FailedOk

th/SRPMS[OK]
th/x32[OK]
th/i686[OK]
th/x86_64[OK]

ac/SRPMS[OK]
ac/i386[OK]
ac/i586[OK]
ac/i686[OK]
ac/alpha[OK]
ac/amd64[OK]
ac/athlon[OK]
ac/ppc[OK]
ac/sparc[OK]
ac/sparc64[OK]

Advanced Search
main()
Powered by PLD Linux
(c) 2002-2018 PLD Team
$Revision: 1.37 $
Powered by achelon.
Your IP: 54.159.30.26

apcupsd 67d438e5-89ec-4f1e-8f3a-cfc8811e801b

Status:Failed
Source URL:ftp://buildlogs.pld-linux.org/ac/amd64/FAIL/apcupsd,67d438e5-89ec-4f1e-8f3a-cfc8811e801b.bz2
text/plain URL:View!
rpm -qa of builder:View!
Date:2011/11/26 17:23:48
Runtime:0:00:13.949462

Toc:

  • prep
  • Executing(%prep): env -i PATH=/bin:/usr/bin:/usr/local/bin:/usr/X11R6/bin:/home/services/builder/bin HOME=/home/services/builder TMPDIR=/tmp/B.d9064b /bin/sh -e /tmp/B.d9064b/rpm-tmp.71737
  • build
  • Executing(%build): env -i PATH=/bin:/usr/bin:/usr/local/bin:/usr/X11R6/bin:/home/services/builder/bin HOME=/home/services/builder TMPDIR=/tmp/B.d9064b /bin/sh -e /tmp/B.d9064b/rpm-tmp.71737
  • error 1
  • error: Bad exit status from /tmp/B.d9064b/rpm-tmp.71737 (%build)
  • error 2
  • RPM build errors:
  • error 3
  • error: No files produced.

Content:

request from: glen
checking if we should skip the build
started at: Sat Nov 26 17:23:33 2011
fetching http://ep09.pld-linux.org/~buildsrc/srpms/67d438e5-89ec-4f1e-8f3a-cfc8811e801b/apcupsd-3.14.10-1.src.rpm
fetched 1349885 bytes, 1904.0 K/s
installing srpm: apcupsd-3.14.10-1.src.rpm
apcupsd                     ##################################################
Building target platforms: amd64-pld-linux
checking BuildConflict-ing packages
no BuildConflicts found
checking BR
no BR needed
building RPM using: echo build-id: 67d438e5-89ec-4f1e-8f3a-cfc8811e801b; cd rpm/SPECS; TMPDIR=/tmp/B.d9064b exec nice -n 19 rpmbuild -bb --define '_smp_mflags -j4'  --target amd64-pld-linux   apcupsd.spec
build-id: 67d438e5-89ec-4f1e-8f3a-cfc8811e801b
Building target platforms: amd64-pld-linux
Executing(%prep):  env -i PATH=/bin:/usr/bin:/usr/local/bin:/usr/X11R6/bin:/home/services/builder/bin HOME=/home/services/builder TMPDIR=/tmp/B.d9064b  /bin/sh -e /tmp/B.d9064b/rpm-tmp.71737
+ umask 022
+ cd /home/services/builder/rpm/BUILD
+ cd /home/services/builder/rpm/BUILD
+ rm -rf apcupsd-3.14.10
+ /bin/gzip -dc /home/services/builder/rpm/SOURCES/apcupsd-3.14.10.tar.gz
+ tar -xf -
+ STATUS=0
+ [ 0 -ne 0 ]
+ cd apcupsd-3.14.10
+ /bin/id -u
+ [ 182 = 0 ]
+ true .
+ /bin/chmod -Rf -Rf a+rX,u+w,g-w,o-w .
+ echo Patch #0 (apcupsd-configure.patch):
Patch #0 (apcupsd-configure.patch):
+ patch -p1 -s
+ < /home/services/builder/rpm/SOURCES/apcupsd-configure.patch 
+ echo Patch #1 (apcupsd-pcnet-seconds.patch):
Patch #1 (apcupsd-pcnet-seconds.patch):
+ patch -p1 -s
+ < /home/services/builder/rpm/SOURCES/apcupsd-pcnet-seconds.patch 
+ install autoconf/configure.in .
+ install autoconf/aclocal.m4 .
+ install autoconf/config.h.in .
+ cp -f /usr/share/automake/config.sub autoconf
+ exit 0
Executing(%build):  env -i PATH=/bin:/usr/bin:/usr/local/bin:/usr/X11R6/bin:/home/services/builder/bin HOME=/home/services/builder TMPDIR=/tmp/B.d9064b  /bin/sh -e /tmp/B.d9064b/rpm-tmp.71737
+ umask 022
+ cd /home/services/builder/rpm/BUILD
+ cd apcupsd-3.14.10
+ autoconf
+ ./configure LDFLAGS=-Wl,--as-needed  CFLAGS=-O2  CXXFLAGS=-O2  FFLAGS=-O2  FCFLAGS=-O2  CPPFLAGS= CC=amd64-pld-linux-gcc CXX=amd64-pld-linux-g++ --host=amd64-pld-linux --build=amd64-pld-linux --prefix=/usr --exec-prefix=/usr --bindir=/usr/bin --sbindir=/usr/sbin --sysconfdir=/etc/apcupsd --datadir=/usr/share --includedir=/usr/include --libdir=/usr/lib64 --libexecdir=/usr/lib64 --localstatedir=/var --sharedstatedir=/var/lib --mandir=/usr/share/man --infodir=/usr/share/info --x-libraries=/usr/X11R6/lib64 APCUPSD_MAIL=/bin/mail SHUTDOWN=/sbin/shutdown WALL=/usr/bin/wall --with-log-dir=/var/log --with-stat-dir=/var/lib/apcupsd --enable-cgi --with-cgi-bin=/home/services/httpd/cgi-bin --enable-test --enable-net --enable-gapcmon --enable-usb
checking for true... /bin/true
checking for false... /bin/false
checking build system type... x86_64-pld-linux-gnu
checking host system type... x86_64-pld-linux-gnu
checking for C++ compiler default output file name... a.out
checking whether the C++ compiler works... yes
checking whether we are cross compiling... no
checking for suffix of executables... 
checking for suffix of object files... o
checking whether we are using the GNU C++ compiler... yes
checking whether amd64-pld-linux-g++ accepts -g... yes
checking for amd64-pld-linux-gcc... amd64-pld-linux-gcc
checking whether we are using the GNU C compiler... yes
checking whether amd64-pld-linux-gcc accepts -g... yes
checking for amd64-pld-linux-gcc option to accept ISO C89... none needed
checking how to run the C preprocessor... amd64-pld-linux-gcc -E
checking for a BSD-compatible install... /usr/bin/install -c
checking for mawk... mawk
checking for library containing strerror... none required
checking for shutdown... /sbin/shutdown
checking for mail... /bin/mail
checking for wall... /usr/bin/wall
checking for sh... /bin/sh
checking for GNU make... make
checking for ranlib... /usr/bin/ranlib
checking for rm... /bin/rm
checking for cp... /bin/cp
checking for echo... /bin/echo
checking for ln... /bin/ln
checking for sed... /bin/sed
checking for ar... /usr/bin/ar
checking for mv... /bin/mv
checking for rst2html.py... /usr/bin/rst2html.py
checking for rst2pdf... no
checking for abort... yes
checking for fork... yes
checking for calloc... yes
checking for getpid... yes
checking for ioctl... yes
checking for kill... yes
checking for rewind... yes
checking for select... yes
checking for setsid... yes
checking for signal... yes
checking for strerror... yes
checking for strncmp... yes
checking for strncpy... yes
checking for tcgetattr... yes
checking for vfprintf... yes
checking for setpgrp... yes
checking for snprintf... yes
checking for vsnprintf... yes
checking for library containing nanosleep... none required
checking for syslog... yes
checking for strftime... yes
checking for grep that handles long lines and -e... /bin/grep
checking for egrep... /bin/grep -E
checking for ANSI C header files... yes
checking for sys/types.h... yes
checking for sys/stat.h... yes
checking for stdlib.h... yes
checking for string.h... yes
checking for memory.h... yes
checking for strings.h... yes
checking for inttypes.h... yes
checking for stdint.h... yes
checking for unistd.h... yes
checking whether setpgrp takes no argument... yes
checking for library containing socket... none required
checking for library containing gethostname... none required
checking for library containing gethostbyname... none required
checking for library containing gethostbyname_r... none required
checking for socklen_t... yes
checking for library containing inet_addr... none required
checking for strchr... yes
using libc's strchr
checking for strstr... yes
checking for strcasecmp... yes
checking for memmove... yes
checking for getopt_long... yes
checking for inet_pton... yes
checking for localtime_r... yes
checking arpa/inet.h usability... yes
checking arpa/inet.h presence... yes
checking for arpa/inet.h... yes
checking ctype.h usability... yes
checking ctype.h presence... yes
checking for ctype.h... yes
checking errno.h usability... yes
checking errno.h presence... yes
checking for errno.h... yes
checking fcntl.h usability... yes
checking fcntl.h presence... yes
checking for fcntl.h... yes
checking limits.h usability... yes
checking limits.h presence... yes
checking for limits.h... yes
checking netdb.h usability... yes
checking netdb.h presence... yes
checking for netdb.h... yes
checking netinet/in.h usability... yes
checking netinet/in.h presence... yes
checking for netinet/in.h... yes
checking pwd.h usability... yes
checking pwd.h presence... yes
checking for pwd.h... yes
checking signal.h usability... yes
checking signal.h presence... yes
checking for signal.h... yes
checking stdarg.h usability... yes
checking stdarg.h presence... yes
checking for stdarg.h... yes
checking stdio.h usability... yes
checking stdio.h presence... yes
checking for stdio.h... yes
checking for stdlib.h... (cached) yes
checking for string.h... (cached) yes
checking for strings.h... (cached) yes
checking sys/ioctl.h usability... yes
checking sys/ioctl.h presence... yes
checking for sys/ioctl.h... yes
checking sys/socket.h usability... yes
checking sys/socket.h presence... yes
checking for sys/socket.h... yes
checking for sys/types.h... (cached) yes
checking syslog.h usability... yes
checking syslog.h presence... yes
checking for syslog.h... yes
checking termios.h usability... yes
checking termios.h presence... yes
checking for termios.h... yes
checking for unistd.h... (cached) yes
checking arpa/nameser.h usability... yes
checking arpa/nameser.h presence... yes
checking for arpa/nameser.h... yes
checking whether stat file-mode macros are broken... no
checking whether time.h and sys/time.h may both be included... yes
checking for sys/wait.h that is POSIX.1 compatible... yes
checking whether struct tm is in sys/time.h or time.h... time.h
checking for struct tm.tm_zone... yes
checking for uid_t in sys/types.h... yes
checking type of array argument to getgroups... gid_t
checking for mode_t... yes
checking for off_t... yes
checking for pid_t... yes
checking return type of signal handlers... void
checking for size_t... yes
checking for uid_t in sys/types.h... (cached) yes
checking for socklen_t... yes
checking for int32_t... yes
checking for X... libraries /usr/X11R6/lib64, headers /usr/X11R6/include
checking whether -R must be followed by a space... neither works
checking for gethostbyname... yes
checking for connect... yes
checking for remove... yes
checking for shmat... yes
checking for IceConnectionNumber in -lICE... yes
checking whether #! works in shell scripts... yes
Using halpolicydir=/usr/share/hal/fdi/policy/20thirdparty
checking for gdImagePng in -lgd... yes
using PNG file format (/usr/lib).
checking gd.h usability... yes
checking gd.h presence... yes
checking for gd.h... yes
Using Linux USB driver.
checking for amd64-pld-linux-pkg-config... no
checking for pkg-config... /usr/bin/pkg-config
checking pkg-config is at least version 0.9.0... yes
checking for GAPCMON... yes
checking how many arguments gethostbyname_r() takes... six
checking if libsupc++ is required... yes
checking if GCC supports -fno-exceptions... yes
checking if GCC supports -fno-rtti... yes
checking for wait... yes
checking for waitpid... yes
checking for wait3... yes
checking for union wait... yes
checking for snprintf... (cached) yes
Enabling cgi program support...
configure: creating ./config.status
config.status: creating autoconf/variables.mak
config.status: WARNING:  'autoconf/variables.mak.in' seems to ignore the --datarootdir setting
config.status: creating platforms/apccontrol
config.status: creating platforms/etc/changeme
config.status: creating platforms/etc/commfailure
config.status: creating platforms/etc/commok
config.status: creating platforms/etc/offbattery
config.status: creating platforms/etc/onbattery
config.status: creating platforms/etc/apcupsd.conf
config.status: creating examples/safe.apccontrol
config.status: creating src/win32/Makefile
config.status: creating platforms/unknown/apcupsd
config.status: creating platforms/unknown/halt
config.status: creating src/cgi/cgiconfig.h
config.status: creating include/config.h


Configuration on Sat Nov 26 16:23:40 UTC 2011:

  Host:                       x86_64-pld-linux-gnu -- unknown unknown
  Apcupsd version:            3.14.10 (13 September 2011)
  Source code location:       .
  Install binaries:           /usr/sbin
  Install config files:       /etc/apcupsd
  Install man files:          /usr/share/man
  Nologin file in:            /etc
  PID directory:              /var/run
  LOG dir (events)    /var/log
  STAT dir (status)    /var/lib/apcupsd
  LOCK dir (for serial port)  /var/lock
  Power Fail dir              /etc/apcupsd
  Compiler:                   amd64-pld-linux-g++ 3.3.6
  Compiler flags:              -I/usr/local/include -O2  -fno-exceptions -fno-rtti -Wall 
  Linker:                     amd64-pld-linux-gcc
  Linker flags:               -Wl,--as-needed  -L/usr/local/lib64 -L/usr/local/lib
  Host and version:           unknown unknown
  Shutdown Program:           /sbin/shutdown
  Port/Device:                /dev/ttyS0
  Network Info Port (CGI):    3551
  UPSTYPE                     apcsmart
  UPSCABLE                    smart

  drivers (no-* are disabled): apcsmart dumb net linux-usb snmp no-net-snmp pcnet test

  enable-nis:                 yes
  with-nisip:                 0.0.0.0
  enable-cgi:                 yes
  with-cgi-bin:               /home/services/httpd/cgi-bin
  with-libwrap:               
  enable-pthreads:            yes
  enable-dist-install:        yes
  enable-gapcmon:             yes
  enable-apcagent:            no
  
Configuration complete: Run 'make' to build apcuspd.

+ /usr/bin/make -j4
        src
        doc
  MAN   apcupsd.8 -> apcupsd.man.txt
        src/lib
        src/drivers
        src/gapcmon
        src/drivers/apcsmart
  CXX   src/gapcmon/eggtrayicon.c
  CXX   src/drivers/apcsmart/smart.c
  CXX   src/lib/apcconfig.c
  CXX   src/lib/apcerror.c
  CXX   src/drivers/apcsmart/smarteeprom.c
  CXX   src/lib/apcevents.c
  CXX   src/lib/apcexec.c
  CXX   src/drivers/apcsmart/smartoper.c
  CXX   src/lib/apcfile.c
  CXX   src/drivers/apcsmart/smartsetup.c
  CXX   src/lib/apclibnis.c
  CXX   src/drivers/apcsmart/smartsetup2.c
  MAN   apcaccess.8 -> apcaccess.man.txt
        src/drivers/dumb
  MAN   apctest.8 -> apctest.man.txt
  CXX   src/lib/apclock.c
  CXX   src/drivers/dumb/dumboper.c
col: Invalid or incomplete multibyte or wide character
Error executing formatting or display command.
System command (cd /home/services/builder/rpm/BUILD/apcupsd-3.14.10/doc/./.. && (echo ".pl 11i"; /bin/cat '/home/services/builder/rpm/BUILD/apcupsd-3.14.10/doc/./apctest.8') | /usr/bin/gtbl | /usr/bin/nroff -msafer -Tlatin1 -mandoc | /usr/bin/less -isr) exited with status 141.
No manual entry for ./apctest.8
make[2]: *** [apctest.man.txt] Error 1
make[1]: *** [all] Error 2
make: *** [doc_DIR] Error 2
make: *** Waiting for unfinished jobs....
  CXX   src/drivers/dumb/dumbsetup.c
  CXX   src/lib/apclog.c
  CXX   src/lib/apcsignal.c
        src/drivers/net
  CXX   src/drivers/net/net.c
  CXX   src/gapcmon/gapcmon.c
  CXX   src/lib/apcstatus.c
  CXX   src/lib/asys.c
        src/drivers/pcnet
  CXX   src/drivers/pcnet/pcnet.c
  CXX   src/lib/newups.c
  CXX   src/lib/md5.c
  CXX   src/lib/statmgr.cpp
        src/drivers/usb
        src/drivers/usb/linux
  CXX   src/drivers/usb/linux/linux-usb.c
  CXX   src/lib/gethostname.c
  CXX   src/lib/amutex.cpp
  CXX   src/drivers/usb/usb.c
  CXX   src/lib/astring.cpp
  CXX   src/lib/autil.cpp
  CXX   src/lib/atimer.cpp
        src/drivers/snmplite
  CXX   src/drivers/snmplite/apc-mib.cpp
  CXX   src/lib/athread.cpp
  CXX   src/lib/libsupc++fix.cpp
  AR    src/lib/libapc.a
        src/cgi
  CXX   src/cgi/upsfetch.c
  CXX   src/cgi/cgilib.c
  CXX   src/drivers/snmplite/asn.cpp
  CXX   src/cgi/multimon.c
  CXX   src/cgi/upsstats.c
  CXX   src/drivers/snmplite/mge-mib.cpp
  CXX   src/gapcmon/gethostname.c
  CXX   src/cgi/upsfstats.c
  CXX   src/cgi/upsimage.c
  LD    src/cgi/multimon.cgi
  LD    src/cgi/upsstats.cgi
  CXX   src/drivers/snmplite/mibs.cpp
  CXX   src/drivers/snmplite/rfc1628-mib.cpp
  LD    src/cgi/upsfstats.cgi
  LD    src/cgi/upsimage.cgi
        src/drivers/test
  CXX   src/drivers/test/testdriver.c
  CXX   src/drivers/snmplite/snmp.cpp
  CXX   src/drivers/snmplite/snmplite.cpp
  CXX   src/drivers/drivers.c
  AR    src/drivers/libdrivers.a
  LD    src/gapcmon/gapcmon
  CXX   src/options.c
  CXX   src/device.c
  CXX   src/reports.c
  CXX   src/action.c
  CXX   src/apcupsd.c
  CXX   src/apcnis.c
  CXX   src/apcaccess.c
  CXX   src/apctest.c
  CXX   src/smtp.c
  LD    src/apcupsd
  LD    src/apcaccess
  LD    src/smtp
  LD    src/apctest
error: Bad exit status from /tmp/B.d9064b/rpm-tmp.71737 (%build)


RPM build errors:
    Bad exit status from /tmp/B.d9064b/rpm-tmp.71737 (%build)
ended at: Sat Nov 26 17:23:48 2011, done in 0:00:13.949462
error: No files produced.
Begin-PLD-Builder-Info
Build-Time: user:12.50s sys:2.86s real:15.86s (faults io:61 non-io:1275989)

End-PLD-Builder-Info
[Back to list of logs] [View rpm -qa of builder]