FailedOk

th/SRPMS[OK]
th/x32[OK]
th/i686[OK]
th/x86_64[OK]

ac/SRPMS[OK]
ac/i386[OK]
ac/i586[OK]
ac/i686[OK]
ac/alpha[OK]
ac/amd64[OK]
ac/athlon[OK]
ac/ppc[OK]
ac/sparc[OK]
ac/sparc64[OK]

Advanced Search
main()
Powered by PLD Linux
(c) 2002-2018 PLD Team
$Revision: 1.37 $
Powered by The Right Thing.
Your IP: 54.159.30.26

apcupsd 67d438e5-89ec-4f1e-8f3a-cfc8811e801b

Status:Failed
Source URL:ftp://buildlogs.pld-linux.org/ac/amd64/FAIL/apcupsd,67d438e5-89ec-4f1e-8f3a-cfc8811e801b.bz2
text/plain URL:View!
full text:View!
rpm -qa of builder:View!
Date:2011/11/26 17:23:48
Runtime:0:00:13.949462

Toc:

  • error 1
  • error: Bad exit status from /tmp/B.d9064b/rpm-tmp.71737 (%build)
  • error 2
  • RPM build errors:
  • error 3
  • error: No files produced.

Content:

  
Configuration complete: Run 'make' to build apcuspd.

+ /usr/bin/make -j4
        src
        doc
  MAN   apcupsd.8 -> apcupsd.man.txt
        src/lib
        src/drivers
        src/gapcmon
        src/drivers/apcsmart
  CXX   src/gapcmon/eggtrayicon.c
  CXX   src/drivers/apcsmart/smart.c
  CXX   src/lib/apcconfig.c
  CXX   src/lib/apcerror.c
  CXX   src/drivers/apcsmart/smarteeprom.c
  CXX   src/lib/apcevents.c
  CXX   src/lib/apcexec.c
  CXX   src/drivers/apcsmart/smartoper.c
  CXX   src/lib/apcfile.c
  CXX   src/drivers/apcsmart/smartsetup.c
  CXX   src/lib/apclibnis.c
  CXX   src/drivers/apcsmart/smartsetup2.c
  MAN   apcaccess.8 -> apcaccess.man.txt
        src/drivers/dumb
  MAN   apctest.8 -> apctest.man.txt
  CXX   src/lib/apclock.c
  CXX   src/drivers/dumb/dumboper.c
col: Invalid or incomplete multibyte or wide character
Error executing formatting or display command.
System command (cd /home/services/builder/rpm/BUILD/apcupsd-3.14.10/doc/./.. && (echo ".pl 11i"; /bin/cat '/home/services/builder/rpm/BUILD/apcupsd-3.14.10/doc/./apctest.8') | /usr/bin/gtbl | /usr/bin/nroff -msafer -Tlatin1 -mandoc | /usr/bin/less -isr) exited with status 141.
No manual entry for ./apctest.8
make[2]: *** [apctest.man.txt] Error 1
make[1]: *** [all] Error 2
make: *** [doc_DIR] Error 2
make: *** Waiting for unfinished jobs....
  CXX   src/drivers/dumb/dumbsetup.c
  CXX   src/lib/apclog.c
  CXX   src/lib/apcsignal.c
        src/drivers/net
  CXX   src/drivers/net/net.c
  CXX   src/gapcmon/gapcmon.c
  CXX   src/lib/apcstatus.c
  CXX   src/lib/asys.c
        src/drivers/pcnet
  CXX   src/drivers/pcnet/pcnet.c
  CXX   src/lib/newups.c
  CXX   src/lib/md5.c
  CXX   src/lib/statmgr.cpp
        src/drivers/usb
        src/drivers/usb/linux
  CXX   src/drivers/usb/linux/linux-usb.c
  CXX   src/lib/gethostname.c
  CXX   src/lib/amutex.cpp
  CXX   src/drivers/usb/usb.c
  CXX   src/lib/astring.cpp
  CXX   src/lib/autil.cpp
  CXX   src/lib/atimer.cpp
        src/drivers/snmplite
  CXX   src/drivers/snmplite/apc-mib.cpp
  CXX   src/lib/athread.cpp
  CXX   src/lib/libsupc++fix.cpp
  AR    src/lib/libapc.a
        src/cgi
  CXX   src/cgi/upsfetch.c
  CXX   src/cgi/cgilib.c
  CXX   src/drivers/snmplite/asn.cpp
  CXX   src/cgi/multimon.c
  CXX   src/cgi/upsstats.c
  CXX   src/drivers/snmplite/mge-mib.cpp
  CXX   src/gapcmon/gethostname.c
  CXX   src/cgi/upsfstats.c
  CXX   src/cgi/upsimage.c
  LD    src/cgi/multimon.cgi
  LD    src/cgi/upsstats.cgi
  CXX   src/drivers/snmplite/mibs.cpp
  CXX   src/drivers/snmplite/rfc1628-mib.cpp
  LD    src/cgi/upsfstats.cgi
  LD    src/cgi/upsimage.cgi
        src/drivers/test
  CXX   src/drivers/test/testdriver.c
  CXX   src/drivers/snmplite/snmp.cpp
  CXX   src/drivers/snmplite/snmplite.cpp
  CXX   src/drivers/drivers.c
  AR    src/drivers/libdrivers.a
  LD    src/gapcmon/gapcmon
  CXX   src/options.c
  CXX   src/device.c
  CXX   src/reports.c
  CXX   src/action.c
  CXX   src/apcupsd.c
  CXX   src/apcnis.c
  CXX   src/apcaccess.c
  CXX   src/apctest.c
  CXX   src/smtp.c
  LD    src/apcupsd
  LD    src/apcaccess
  LD    src/smtp
  LD    src/apctest
error: Bad exit status from /tmp/B.d9064b/rpm-tmp.71737 (%build)


RPM build errors:
    Bad exit status from /tmp/B.d9064b/rpm-tmp.71737 (%build)
ended at: Sat Nov 26 17:23:48 2011, done in 0:00:13.949462
error: No files produced.
Begin-PLD-Builder-Info
Build-Time: user:12.50s sys:2.86s real:15.86s (faults io:61 non-io:1275989)

End-PLD-Builder-Info
[Back to list of logs] [View rpm -qa of builder]