FailedOk

th/SRPMS[OK]
th/x32[OK]
th/i686[OK]
th/x86_64[OK]

ac/SRPMS[OK]
ac/i386[OK]
ac/i586[OK]
ac/i686[OK]
ac/alpha[OK]
ac/amd64[OK]
ac/athlon[OK]
ac/ppc[OK]
ac/sparc[OK]
ac/sparc64[OK]

Advanced Search
main()
Powered by PLD Linux
(c) 2002-2018 PLD Team
$Revision: 1.37 $
Powered by brain.
Your IP: 54.158.219.248

apr-util 2d2c20c0-31ea-464f-ae6f-bdf3a973ae00

Status:Failed
Source URL:ftp://buildlogs.pld-linux.org/ac/amd64/FAIL/apr-util,2d2c20c0-31ea-464f-ae6f-bdf3a973ae00.bz2
text/plain URL:View!
full text:View!
rpm -qa of builder:View!
Date:2011/10/01 12:52:23
Runtime:18:18:05.751828

Toc:

  • error 1
  • make[1]: *** [check] Error 143
  • error 2
  • error: Bad exit status from /tmp/B.eda85f/rpm-tmp.93228 (%build)
  • error 3
  • RPM build errors:
  • error 4
  • error: No files produced.

Content:

Failed to open mysql[]
Loaded sqlite3 driver OK.
Opened sqlite3[] OK
======== create table ========
create table test successful

======== insert rows ========
insert rows test successful

======== invalid op ========
invalid op returned 1 (should be nonzero).  Error msg follows
'no such table: apr_dbd_test1'
valid op returned 0 (should be zero; error shouldn't affect subsequent ops)
invalid op test successful

======== select random ========
ROW 5:	wibble	nothing	5	
ROW 1:	asdfgh	bar	1	
select random test successful

======== select sequential ========
ROW 1:	asdfgh	bar	1	
ROW 2:	bar	foo	(null)	
ROW 3:	foo	(null)	(null)	
ROW 4:	qwerty	foo	0	
ROW 5:	wibble	nothing	5	
ROW 6:	wibble	other	5	
select sequential test successful

======== transactions ========
Transaction 1
6 rows updated
Valid insert returned 1.  Should be nonzero (fail) because transaction is bad
Transaction ended (should be rollback) - viewing table
A column of "failed" indicates transaction failed (no rollback)
ROW 1:	asdfgh	bar	1	
ROW 2:	bar	foo	(null)	
ROW 3:	foo	(null)	(null)	
ROW 4:	qwerty	foo	0	
ROW 5:	wibble	nothing	5	
ROW 6:	wibble	other	5	
Transaction 2
6 rows updated
Valid insert returned 0.  Should be zero (OK)
Transaction ended (should be commit) - viewing table
ROW 1:	aaa	zzz	3	
ROW 2:	asdfgh	success	1	
ROW 3:	bar	success	(null)	
ROW 4:	foo	success	(null)	
ROW 5:	qwerty	success	0	
ROW 6:	wibble	success	5	
ROW 7:	wibble	success	5	
transactions test successful

======== prepared select ========
Selecting rows where col3 <= 3 and bar row where it's unset.
Should show four rows.
ROW 1:	qwerty	success	0	
ROW 2:	asdfgh	success	1	
ROW 3:	bar	success	(null)	
ROW 4:	aaa	zzz	3	
prepared select test successful

======== prepared query ========
Showing table (should now contain row "prepared insert 2")
ROW 1:	aaa	zzz	3	
ROW 2:	asdfgh	success	1	
ROW 3:	bar	success	(null)	
ROW 4:	foo	success	(null)	
ROW 5:	prepared	insert	2	
ROW 6:	qwerty	success	0	
ROW 7:	wibble	success	5	
ROW 8:	wibble	success	5	
prepared query test successful

======== drop table ========
drop table test successful

Loaded odbc driver OK.
[Fri Sep 30 16:34:41 2011] [dbd_odbc] SQLConnect returned SQL_ERROR (-1) at dbd/apr_dbd_odbc.c:1131 [unixODBC][Driver Manager]Data source name not found, and no default driver specified IM002 
Failed to open odbc[]
teststrmatch        :  SUCCESS
testuri             :  SUCCESS
testuuid            :  SUCCESS
testbuckets         :  SUCCESS
testpass            :  SUCCESS
testmd4             :  SUCCESS
testmd5             :  SUCCESS
testldap            :  SUCCESS
testdbd             :  SUCCESS
testdate            :  SUCCESS
testmemcache        :  SUCCESS
testxml             :  SUCCESS
testxlate           :  SUCCESS
testrmm             :  SUCCESS
testdbm             :  SUCCESS
testqueue           :  SUCCESS
testreslist         :  Terminated 
Programs failed: testall
make[1]: *** [check] Error 143
make[1]: Leaving directory `/home/services/builder/rpm/BUILD/apr-util-1.3.12/test'
make: *** [check] Error 2
error: Bad exit status from /tmp/B.eda85f/rpm-tmp.93228 (%build)


RPM build errors:
    Bad exit status from /tmp/B.eda85f/rpm-tmp.93228 (%build)
ended at: Sat Oct  1 12:52:23 2011, done in 18:18:05.751828
error: No files produced.
Begin-PLD-Builder-Info
Build-Time: user:17.92s sys:6.59s real:65887.29s (faults io:12 non-io:2771969)

End-PLD-Builder-Info
[Back to list of logs] [View rpm -qa of builder]