FailedOk

th/SRPMS[OK]
th/x32[OK]
th/i686[OK]
th/x86_64[OK]

ac/SRPMS[OK]
ac/i386[OK]
ac/i586[OK]
ac/i686[OK]
ac/alpha[OK]
ac/amd64[OK]
ac/athlon[OK]
ac/ppc[OK]
ac/sparc[OK]
ac/sparc64[OK]

Advanced Search
main()
Powered by PLD Linux
(c) 2002-2018 PLD Team
$Revision: 1.37 $
Powered by overclock.
Your IP: 54.80.97.221

autoconf 61c98a1c-2fa1-4084-b0d0-ff3141557bc7

Status:Failed
Source URL:ftp://buildlogs.pld-linux.org/ac/amd64/FAIL/autoconf,61c98a1c-2fa1-4084-b0d0-ff3141557bc7.bz2
text/plain URL:View!
rpm -qa of builder:View!
Date:2012/03/04 19:18:31
Runtime:0:08:45.837181

Toc:

  • prep
  • Executing(%prep): env -i PATH=/bin:/usr/bin:/usr/local/bin:/usr/X11R6/bin:/home/services/builder/bin HOME=/home/services/builder TMPDIR=/tmp/B.dfca1b /bin/sh -e /tmp/B.dfca1b/rpm-tmp.47098
  • build
  • Executing(%build): env -i PATH=/bin:/usr/bin:/usr/local/bin:/usr/X11R6/bin:/home/services/builder/bin HOME=/home/services/builder TMPDIR=/tmp/B.dfca1b /bin/sh -e /tmp/B.dfca1b/rpm-tmp.47098
  • make check
  • + /usr/bin/make -j4 check
  • error 1
  • ERROR: 435 tests were run,
  • error 2
  • make[3]: *** [check-local] Error 1
  • error 3
  • make[2]: *** [check-am] Error 2
  • error 4
  • make[1]: *** [check-recursive] Error 1
  • error 5
  • error: Bad exit status from /tmp/B.dfca1b/rpm-tmp.47098 (%build)
  • error 6
  • RPM build errors:
  • error 7
  • error: No files produced.

Content:

request from: glen
checking if we should skip the build
started at: Sun Mar  4 19:09:23 2012
fetching http://ep09.pld-linux.org/~buildsrc/srpms/61c98a1c-2fa1-4084-b0d0-ff3141557bc7/autoconf-2.67-3.src.rpm
fetched 1189303 bytes, 1573.8 K/s
installing srpm: autoconf-2.67-3.src.rpm
autoconf                    ##################################################
Building target platforms: amd64-pld-linux
checking BuildConflict-ing packages
no BuildConflicts found
checking BR
no BR needed
building RPM using: echo build-id: 61c98a1c-2fa1-4084-b0d0-ff3141557bc7; cd rpm/SPECS; TMPDIR=/tmp/B.dfca1b exec nice -n 19 rpmbuild -bb --define '_smp_mflags -j4'  --target amd64-pld-linux   autoconf.spec
build-id: 61c98a1c-2fa1-4084-b0d0-ff3141557bc7
Building target platforms: amd64-pld-linux
Executing(%prep):  env -i PATH=/bin:/usr/bin:/usr/local/bin:/usr/X11R6/bin:/home/services/builder/bin HOME=/home/services/builder TMPDIR=/tmp/B.dfca1b  /bin/sh -e /tmp/B.dfca1b/rpm-tmp.47098
+ umask 022
+ cd /home/services/builder/rpm/BUILD
+ cd /home/services/builder/rpm/BUILD
+ rm -rf autoconf-2.67
+ tar -xf /home/services/builder/rpm/SOURCES/autoconf-2.67.tar.xz
+ cd autoconf-2.67
+ /bin/id -u
+ [ 182 = 0 ]
+ true .
+ /bin/chmod -Rf -Rf a+rX,u+w,g-w,o-w .
+ echo Patch #0 (autoconf-mawk.patch):
Patch #0 (autoconf-mawk.patch):
+ patch -p1 -s
+ < /home/services/builder/rpm/SOURCES/autoconf-mawk.patch 
+ echo Patch #1 (autoconf-info.patch):
Patch #1 (autoconf-info.patch):
+ patch -p1 -s
+ < /home/services/builder/rpm/SOURCES/autoconf-info.patch 
+ echo Patch #2 (autoconf-AC_EGREP.patch):
Patch #2 (autoconf-AC_EGREP.patch):
+ patch -p1 -s
+ < /home/services/builder/rpm/SOURCES/autoconf-AC_EGREP.patch 
+ echo Patch #3 (autoconf-cxxcpp-warnonly.patch):
Patch #3 (autoconf-cxxcpp-warnonly.patch):
+ patch -p1 -s
+ < /home/services/builder/rpm/SOURCES/autoconf-cxxcpp-warnonly.patch 
+ echo Patch #4 (autoconf-git.patch):
Patch #4 (autoconf-git.patch):
+ patch -p1 -s
+ < /home/services/builder/rpm/SOURCES/autoconf-git.patch 
+ exit 0
Executing(%build):  env -i PATH=/bin:/usr/bin:/usr/local/bin:/usr/X11R6/bin:/home/services/builder/bin HOME=/home/services/builder TMPDIR=/tmp/B.dfca1b  /bin/sh -e /tmp/B.dfca1b/rpm-tmp.47098
+ umask 022
+ cd /home/services/builder/rpm/BUILD
+ cd autoconf-2.67
+ ./configure LDFLAGS=-Wl,--as-needed  CFLAGS=-O2  CXXFLAGS=-O2  FFLAGS=-O2  FCFLAGS=-O2  CPPFLAGS= CC=amd64-pld-linux-gcc CXX=amd64-pld-linux-g++ --host=noarch-pld-linux --build=noarch-pld-linux --prefix=/usr --exec-prefix=/usr --bindir=/usr/bin --sbindir=/usr/sbin --sysconfdir=/etc --datadir=/usr/share --includedir=/usr/include --libdir=/usr/share --libexecdir=/usr/lib64 --localstatedir=/var --sharedstatedir=/var/lib --mandir=/usr/share/man --infodir=/usr/share/info --x-libraries=/usr/X11R6/lib64
checking for a BSD-compatible install... /usr/bin/install -c
checking whether build environment is sane... yes
checking for a thread-safe mkdir -p... /bin/mkdir -p
checking for mawk... mawk
checking whether make sets $(MAKE)... yes
checking whether /bin/sh -n is known to work... yes
checking for characters that cannot appear in file names... none
checking whether directories can have trailing spaces... yes
checking for expr... /usr/bin/expr
checking for GNU M4 that supports accurate traces... /usr/bin/m4
checking whether /usr/bin/m4 accepts --gnu... yes
checking how m4 supports trace files... --debugfile
checking for perl... /usr/bin/perl
checking whether /usr/bin/perl Fcntl::flock is implemented... yes
checking for emacs... no
checking for xemacs... no
checking for emacs... no
checking where .elc files should go... ${datadir}/emacs/site-lisp
checking for grep that handles long lines and -e... /bin/grep
checking for egrep... /bin/grep -E
checking for a sed that does not truncate output... /bin/sed
checking whether make is case sensitive... yes
configure: creating ./config.status
config.status: creating tests/Makefile
config.status: creating tests/atlocal
config.status: creating man/Makefile
config.status: creating lib/emacs/Makefile
config.status: creating Makefile
config.status: creating doc/Makefile
config.status: creating lib/Makefile
config.status: creating lib/Autom4te/Makefile
config.status: creating lib/autoscan/Makefile
config.status: creating lib/m4sugar/Makefile
config.status: creating lib/autoconf/Makefile
config.status: creating lib/autotest/Makefile
config.status: creating bin/Makefile
config.status: executing tests/atconfig commands
+ /usr/bin/make -j4 -j1
/usr/bin/make  all-recursive
make[1]: Entering directory `/home/services/builder/rpm/BUILD/autoconf-2.67'
Making all in bin
make[2]: Entering directory `/home/services/builder/rpm/BUILD/autoconf-2.67/bin'
rm -f autom4te autom4te.tmp
srcdir=''; \
	  test -f ./autom4te.in || srcdir=./; \
	  sed -e 's|@SHELL[@]|/bin/sh|g' -e 's|@PERL[@]|/usr/bin/perl|g' -e 's|@PERL_FLOCK[@]|yes|g' -e 's|@bindir[@]|/usr/bin|g' -e 's|@pkgdatadir[@]|/usr/share/autoconf|g' -e 's|@prefix[@]|/usr|g' -e 's|@autoconf-name[@]|'`echo autoconf | sed 's,x,x,'`'|g' -e 's|@autoheader-name[@]|'`echo autoheader | sed 's,x,x,'`'|g' -e 's|@autom4te-name[@]|'`echo autom4te | sed 's,x,x,'`'|g' -e 's|@M4[@]|/usr/bin/m4|g' -e 's|@M4_DEBUGFILE[@]|--debugfile|g' -e 's|@M4_GNU[@]|--gnu|g' -e 's|@AWK[@]|mawk|g' -e 's|@RELEASE_YEAR[@]|'`sed 's/^\([0-9][0-9][0-9][0-9]\).*/\1/;q' ../ChangeLog`'|g' -e 's|@VERSION[@]|2.67|g' -e 's|@PACKAGE_NAME[@]|GNU Autoconf|g' -e 's|@configure_input[@]|Generated from autom4te.in; do not edit by hand.|g' ${srcdir}autom4te.in >autom4te.tmp
chmod +x autom4te.tmp
chmod a-w autom4te.tmp
mv autom4te.tmp autom4te
cd ../lib && /usr/bin/make  autom4te.cfg
make[3]: Entering directory `/home/services/builder/rpm/BUILD/autoconf-2.67/lib'
rm -f autom4te.cfg autom4te.tmp
sed -e 's|@SHELL[@]|/bin/sh|g' -e 's|@PERL[@]|/usr/bin/perl|g' -e 's|@bindir[@]|/usr/bin|g' -e 's|@pkgdatadir[@]|/usr/share/autoconf|g' -e 's|@prefix[@]|/usr|g' -e 's|@autoconf-name[@]|'`echo autoconf | sed 's,x,x,'`'|g' -e 's|@autoheader-name[@]|'`echo autoheader | sed 's,x,x,'`'|g' -e 's|@autom4te-name[@]|'`echo autom4te | sed 's,x,x,'`'|g' -e 's|@M4[@]|/usr/bin/m4|g' -e 's|@AWK[@]|mawk|g' -e 's|@VERSION[@]|2.67|g' -e 's|@PACKAGE_NAME[@]|GNU Autoconf|g' ./autom4te.in >autom4te.tmp
chmod a-w autom4te.tmp
mv autom4te.tmp autom4te.cfg
make[3]: Leaving directory `/home/services/builder/rpm/BUILD/autoconf-2.67/lib'
cd ../lib/m4sugar && /usr/bin/make  version.m4
make[3]: Entering directory `/home/services/builder/rpm/BUILD/autoconf-2.67/lib/m4sugar'
:;{ \
	  echo '# This file is part of -*- Autoconf -*-.' && \
	  echo '# Version of Autoconf.' && \
	  echo '# Copyright (C) 1999, 2000, 2001, 2002, 2006, 2007, 2009' && \
	  echo '# Free Software Foundation, Inc.' && \
	  echo  &&\
	  echo 'm4_define([m4_PACKAGE_NAME],      [GNU Autoconf])' && \
	  echo 'm4_define([m4_PACKAGE_TARNAME],   [autoconf])' && \
	  echo 'm4_define([m4_PACKAGE_VERSION],   [2.67])' && \
	  echo 'm4_define([m4_PACKAGE_STRING],    [GNU Autoconf 2.67])' && \
	  echo 'm4_define([m4_PACKAGE_BUGREPORT], [bug-autoconf@gnu.org])' && \
	  echo 'm4_define([m4_PACKAGE_URL],       [http://www.gnu.org/software/autoconf/])' && \
	  echo 'm4_define([m4_PACKAGE_YEAR],      ['`sed 's/^\([0-9][0-9][0-9][0-9]\).*/\1/;q' ../../ChangeLog`'])'; \
	} > version.m4-t
mv version.m4-t version.m4
make[3]: Leaving directory `/home/services/builder/rpm/BUILD/autoconf-2.67/lib/m4sugar'
autom4te_perllibdir='..'/lib AUTOM4TE_CFG='../lib/autom4te.cfg'         ../bin/autom4te -B '..'/lib -B '..'/lib         --language M4sh --cache '' --melt ./autoconf.as -o autoconf.in
rm -f autoconf autoconf.tmp
srcdir=''; \
	  test -f ./autoconf.in || srcdir=./; \
	  sed -e 's|@SHELL[@]|/bin/sh|g' -e 's|@PERL[@]|/usr/bin/perl|g' -e 's|@PERL_FLOCK[@]|yes|g' -e 's|@bindir[@]|/usr/bin|g' -e 's|@pkgdatadir[@]|/usr/share/autoconf|g' -e 's|@prefix[@]|/usr|g' -e 's|@autoconf-name[@]|'`echo autoconf | sed 's,x,x,'`'|g' -e 's|@autoheader-name[@]|'`echo autoheader | sed 's,x,x,'`'|g' -e 's|@autom4te-name[@]|'`echo autom4te | sed 's,x,x,'`'|g' -e 's|@M4[@]|/usr/bin/m4|g' -e 's|@M4_DEBUGFILE[@]|--debugfile|g' -e 's|@M4_GNU[@]|--gnu|g' -e 's|@AWK[@]|mawk|g' -e 's|@RELEASE_YEAR[@]|'`sed 's/^\([0-9][0-9][0-9][0-9]\).*/\1/;q' ../ChangeLog`'|g' -e 's|@VERSION[@]|2.67|g' -e 's|@PACKAGE_NAME[@]|GNU Autoconf|g' -e 's|@configure_input[@]|Generated from autoconf.in; do not edit by hand.|g' ${srcdir}autoconf.in >autoconf.tmp
chmod +x autoconf.tmp
chmod a-w autoconf.tmp
mv autoconf.tmp autoconf
rm -f autoheader autoheader.tmp
srcdir=''; \
	  test -f ./autoheader.in || srcdir=./; \
	  sed -e 's|@SHELL[@]|/bin/sh|g' -e 's|@PERL[@]|/usr/bin/perl|g' -e 's|@PERL_FLOCK[@]|yes|g' -e 's|@bindir[@]|/usr/bin|g' -e 's|@pkgdatadir[@]|/usr/share/autoconf|g' -e 's|@prefix[@]|/usr|g' -e 's|@autoconf-name[@]|'`echo autoconf | sed 's,x,x,'`'|g' -e 's|@autoheader-name[@]|'`echo autoheader | sed 's,x,x,'`'|g' -e 's|@autom4te-name[@]|'`echo autom4te | sed 's,x,x,'`'|g' -e 's|@M4[@]|/usr/bin/m4|g' -e 's|@M4_DEBUGFILE[@]|--debugfile|g' -e 's|@M4_GNU[@]|--gnu|g' -e 's|@AWK[@]|mawk|g' -e 's|@RELEASE_YEAR[@]|'`sed 's/^\([0-9][0-9][0-9][0-9]\).*/\1/;q' ../ChangeLog`'|g' -e 's|@VERSION[@]|2.67|g' -e 's|@PACKAGE_NAME[@]|GNU Autoconf|g' -e 's|@configure_input[@]|Generated from autoheader.in; do not edit by hand.|g' ${srcdir}autoheader.in >autoheader.tmp
chmod +x autoheader.tmp
chmod a-w autoheader.tmp
mv autoheader.tmp autoheader
rm -f autoreconf autoreconf.tmp
srcdir=''; \
	  test -f ./autoreconf.in || srcdir=./; \
	  sed -e 's|@SHELL[@]|/bin/sh|g' -e 's|@PERL[@]|/usr/bin/perl|g' -e 's|@PERL_FLOCK[@]|yes|g' -e 's|@bindir[@]|/usr/bin|g' -e 's|@pkgdatadir[@]|/usr/share/autoconf|g' -e 's|@prefix[@]|/usr|g' -e 's|@autoconf-name[@]|'`echo autoconf | sed 's,x,x,'`'|g' -e 's|@autoheader-name[@]|'`echo autoheader | sed 's,x,x,'`'|g' -e 's|@autom4te-name[@]|'`echo autom4te | sed 's,x,x,'`'|g' -e 's|@M4[@]|/usr/bin/m4|g' -e 's|@M4_DEBUGFILE[@]|--debugfile|g' -e 's|@M4_GNU[@]|--gnu|g' -e 's|@AWK[@]|mawk|g' -e 's|@RELEASE_YEAR[@]|'`sed 's/^\([0-9][0-9][0-9][0-9]\).*/\1/;q' ../ChangeLog`'|g' -e 's|@VERSION[@]|2.67|g' -e 's|@PACKAGE_NAME[@]|GNU Autoconf|g' -e 's|@configure_input[@]|Generated from autoreconf.in; do not edit by hand.|g' ${srcdir}autoreconf.in >autoreconf.tmp
chmod +x autoreconf.tmp
chmod a-w autoreconf.tmp
mv autoreconf.tmp autoreconf
rm -f ifnames ifnames.tmp
srcdir=''; \
	  test -f ./ifnames.in || srcdir=./; \
	  sed -e 's|@SHELL[@]|/bin/sh|g' -e 's|@PERL[@]|/usr/bin/perl|g' -e 's|@PERL_FLOCK[@]|yes|g' -e 's|@bindir[@]|/usr/bin|g' -e 's|@pkgdatadir[@]|/usr/share/autoconf|g' -e 's|@prefix[@]|/usr|g' -e 's|@autoconf-name[@]|'`echo autoconf | sed 's,x,x,'`'|g' -e 's|@autoheader-name[@]|'`echo autoheader | sed 's,x,x,'`'|g' -e 's|@autom4te-name[@]|'`echo autom4te | sed 's,x,x,'`'|g' -e 's|@M4[@]|/usr/bin/m4|g' -e 's|@M4_DEBUGFILE[@]|--debugfile|g' -e 's|@M4_GNU[@]|--gnu|g' -e 's|@AWK[@]|mawk|g' -e 's|@RELEASE_YEAR[@]|'`sed 's/^\([0-9][0-9][0-9][0-9]\).*/\1/;q' ../ChangeLog`'|g' -e 's|@VERSION[@]|2.67|g' -e 's|@PACKAGE_NAME[@]|GNU Autoconf|g' -e 's|@configure_input[@]|Generated from ifnames.in; do not edit by hand.|g' ${srcdir}ifnames.in >ifnames.tmp
chmod +x ifnames.tmp
chmod a-w ifnames.tmp
mv ifnames.tmp ifnames
rm -f autoscan autoscan.tmp
srcdir=''; \
	  test -f ./autoscan.in || srcdir=./; \
	  sed -e 's|@SHELL[@]|/bin/sh|g' -e 's|@PERL[@]|/usr/bin/perl|g' -e 's|@PERL_FLOCK[@]|yes|g' -e 's|@bindir[@]|/usr/bin|g' -e 's|@pkgdatadir[@]|/usr/share/autoconf|g' -e 's|@prefix[@]|/usr|g' -e 's|@autoconf-name[@]|'`echo autoconf | sed 's,x,x,'`'|g' -e 's|@autoheader-name[@]|'`echo autoheader | sed 's,x,x,'`'|g' -e 's|@autom4te-name[@]|'`echo autom4te | sed 's,x,x,'`'|g' -e 's|@M4[@]|/usr/bin/m4|g' -e 's|@M4_DEBUGFILE[@]|--debugfile|g' -e 's|@M4_GNU[@]|--gnu|g' -e 's|@AWK[@]|mawk|g' -e 's|@RELEASE_YEAR[@]|'`sed 's/^\([0-9][0-9][0-9][0-9]\).*/\1/;q' ../ChangeLog`'|g' -e 's|@VERSION[@]|2.67|g' -e 's|@PACKAGE_NAME[@]|GNU Autoconf|g' -e 's|@configure_input[@]|Generated from autoscan.in; do not edit by hand.|g' ${srcdir}autoscan.in >autoscan.tmp
chmod +x autoscan.tmp
chmod a-w autoscan.tmp
mv autoscan.tmp autoscan
rm -f autoupdate autoupdate.tmp
srcdir=''; \
	  test -f ./autoupdate.in || srcdir=./; \
	  sed -e 's|@SHELL[@]|/bin/sh|g' -e 's|@PERL[@]|/usr/bin/perl|g' -e 's|@PERL_FLOCK[@]|yes|g' -e 's|@bindir[@]|/usr/bin|g' -e 's|@pkgdatadir[@]|/usr/share/autoconf|g' -e 's|@prefix[@]|/usr|g' -e 's|@autoconf-name[@]|'`echo autoconf | sed 's,x,x,'`'|g' -e 's|@autoheader-name[@]|'`echo autoheader | sed 's,x,x,'`'|g' -e 's|@autom4te-name[@]|'`echo autom4te | sed 's,x,x,'`'|g' -e 's|@M4[@]|/usr/bin/m4|g' -e 's|@M4_DEBUGFILE[@]|--debugfile|g' -e 's|@M4_GNU[@]|--gnu|g' -e 's|@AWK[@]|mawk|g' -e 's|@RELEASE_YEAR[@]|'`sed 's/^\([0-9][0-9][0-9][0-9]\).*/\1/;q' ../ChangeLog`'|g' -e 's|@VERSION[@]|2.67|g' -e 's|@PACKAGE_NAME[@]|GNU Autoconf|g' -e 's|@configure_input[@]|Generated from autoupdate.in; do not edit by hand.|g' ${srcdir}autoupdate.in >autoupdate.tmp
chmod +x autoupdate.tmp
chmod a-w autoupdate.tmp
mv autoupdate.tmp autoupdate
make[2]: Leaving directory `/home/services/builder/rpm/BUILD/autoconf-2.67/bin'
Making all in .
make[2]: Entering directory `/home/services/builder/rpm/BUILD/autoconf-2.67'
/bin/sh /home/services/builder/rpm/BUILD/autoconf-2.67/build-aux/missing --run makeinfo --no-headers --no-validate --no-split  --plaintext -o INSTALL \
	  ./doc/install.texi
make[2]: Leaving directory `/home/services/builder/rpm/BUILD/autoconf-2.67'
Making all in lib
make[2]: Entering directory `/home/services/builder/rpm/BUILD/autoconf-2.67/lib'
Making all in Autom4te
make[3]: Entering directory `/home/services/builder/rpm/BUILD/autoconf-2.67/lib/Autom4te'
make[3]: Nothing to be done for `all'.
make[3]: Leaving directory `/home/services/builder/rpm/BUILD/autoconf-2.67/lib/Autom4te'
Making all in m4sugar
make[3]: Entering directory `/home/services/builder/rpm/BUILD/autoconf-2.67/lib/m4sugar'
autom4te_perllibdir='../..'/lib AUTOM4TE_CFG='../../lib/autom4te.cfg'         ../../bin/autom4te -B '../..'/lib -B '../..'/lib        				\
		--language=m4sugar			\
		--freeze			\
		--output=m4sugar.m4f
autom4te_perllibdir='../..'/lib AUTOM4TE_CFG='../../lib/autom4te.cfg'         ../../bin/autom4te -B '../..'/lib -B '../..'/lib        				\
		--language=m4sh			\
		--freeze			\
		--output=m4sh.m4f
make[3]: Leaving directory `/home/services/builder/rpm/BUILD/autoconf-2.67/lib/m4sugar'
Making all in autoconf
make[3]: Entering directory `/home/services/builder/rpm/BUILD/autoconf-2.67/lib/autoconf'
autom4te_perllibdir='../..'/lib AUTOM4TE_CFG='../../lib/autom4te.cfg'         ../../bin/autom4te -B '../..'/lib -B '../..'/lib        				\
		--language=autoconf			\
		--freeze			\
		--output=autoconf.m4f
make[3]: Leaving directory `/home/services/builder/rpm/BUILD/autoconf-2.67/lib/autoconf'
Making all in autotest
make[3]: Entering directory `/home/services/builder/rpm/BUILD/autoconf-2.67/lib/autotest'
autom4te_perllibdir='../..'/lib AUTOM4TE_CFG='../../lib/autom4te.cfg'         ../../bin/autom4te -B '../..'/lib -B '../..'/lib        				\
		--language=autotest			\
		--freeze			\
		--output=autotest.m4f
make[3]: Leaving directory `/home/services/builder/rpm/BUILD/autoconf-2.67/lib/autotest'
Making all in autoscan
make[3]: Entering directory `/home/services/builder/rpm/BUILD/autoconf-2.67/lib/autoscan'
echo '# Automatically Generated: do not edit this file' >autoscan.list
sed '/^[#]/!q' ./autoscan.pre                  >>autoscan.list
( \
	  sed -n '/^[^#]/p' ./autoscan.pre; \
	  autom4te_perllibdir='../..'/lib AUTOM4TE_CFG='../../lib/autom4te.cfg'         ../../bin/autom4te -B '../..'/lib -B '../..'/lib         --cache '' -M -l autoconf -t'AN_OUTPUT:$1: $2		$3' \
	) | LC_ALL=C sort                                      >>autoscan.list
make[3]: Leaving directory `/home/services/builder/rpm/BUILD/autoconf-2.67/lib/autoscan'
Making all in emacs
make[3]: Entering directory `/home/services/builder/rpm/BUILD/autoconf-2.67/lib/emacs'
WARNING: Warnings can be ignored. :-)
if test "no" != no; then \
	  set x; \
	  list='autoconf-mode.el autotest-mode.el'; for p in $list; do \
	    if test -f "$p"; then d=; else d="./"; fi; \
	    set x "$@" "$d$p"; shift; \
	  done; \
	  shift; \
	  EMACS="no" /bin/sh ../../build-aux/elisp-comp "$@" || exit 1; \
	else : ; fi
make[3]: Leaving directory `/home/services/builder/rpm/BUILD/autoconf-2.67/lib/emacs'
make[3]: Entering directory `/home/services/builder/rpm/BUILD/autoconf-2.67/lib'
make[3]: Nothing to be done for `all-am'.
make[3]: Leaving directory `/home/services/builder/rpm/BUILD/autoconf-2.67/lib'
make[2]: Leaving directory `/home/services/builder/rpm/BUILD/autoconf-2.67/lib'
Making all in doc
make[2]: Entering directory `/home/services/builder/rpm/BUILD/autoconf-2.67/doc'
Updating ./version.texi
restore=: && backupdir=".am$$" && \
	am__cwd=`pwd` && CDPATH="${ZSH_VERSION+.}:" && cd . && \
	rm -rf $backupdir && mkdir $backupdir && \
	if (/bin/sh /home/services/builder/rpm/BUILD/autoconf-2.67/build-aux/missing --run makeinfo --version) >/dev/null 2>&1; then \
	  for f in autoconf.info autoconf.info-[0-9] autoconf.info-[0-9][0-9] autoconf.i[0-9] autoconf.i[0-9][0-9]; do \
	    if test -f $f; then mv $f $backupdir; restore=mv; else :; fi; \
	  done; \
	else :; fi && \
	cd "$am__cwd"; \
	if /bin/sh /home/services/builder/rpm/BUILD/autoconf-2.67/build-aux/missing --run makeinfo --no-split  -I . \
	 -o autoconf.info autoconf.texi; \
	then \
	  rc=0; \
	  CDPATH="${ZSH_VERSION+.}:" && cd .; \
	else \
	  rc=$?; \
	  CDPATH="${ZSH_VERSION+.}:" && cd . && \
	  $restore $backupdir/* `echo "./autoconf.info" | sed 's|[^/]*$||'`; \
	fi; \
	rm -rf $backupdir; exit $rc
restore=: && backupdir=".am$$" && \
	am__cwd=`pwd` && CDPATH="${ZSH_VERSION+.}:" && cd . && \
	rm -rf $backupdir && mkdir $backupdir && \
	if (/bin/sh /home/services/builder/rpm/BUILD/autoconf-2.67/build-aux/missing --run makeinfo --version) >/dev/null 2>&1; then \
	  for f in standards.info standards.info-[0-9] standards.info-[0-9][0-9] standards.i[0-9] standards.i[0-9][0-9]; do \
	    if test -f $f; then mv $f $backupdir; restore=mv; else :; fi; \
	  done; \
	else :; fi && \
	cd "$am__cwd"; \
	if /bin/sh /home/services/builder/rpm/BUILD/autoconf-2.67/build-aux/missing --run makeinfo --no-split  -I . \
	 -o standards.info standards.texi; \
	then \
	  rc=0; \
	  CDPATH="${ZSH_VERSION+.}:" && cd .; \
	else \
	  rc=$?; \
	  CDPATH="${ZSH_VERSION+.}:" && cd . && \
	  $restore $backupdir/* `echo "./standards.info" | sed 's|[^/]*$||'`; \
	fi; \
	rm -rf $backupdir; exit $rc
make[2]: Leaving directory `/home/services/builder/rpm/BUILD/autoconf-2.67/doc'
Making all in tests
make[2]: Entering directory `/home/services/builder/rpm/BUILD/autoconf-2.67/tests'
autom4te_perllibdir='..'/lib AUTOM4TE_CFG='../lib/autom4te.cfg'         ../bin/autom4te -B '..'/lib -B '..'/lib         --language=M4sh ./wrapper.as -o wrapper.in
rm -f autoconf autoconf.tmp
input=wrapper.in; \
	sed -e 's|@wrap_program[@]|autoconf|g' -e 's|@abs_top_srcdir[@]|/home/services/builder/rpm/BUILD/autoconf-2.67|g' -e 's|@abs_top_builddir[@]|/home/services/builder/rpm/BUILD/autoconf-2.67|g' -e "s|@configure_input[@]|Generated from $input.|g" wrapper.in >autoconf.tmp
chmod +x autoconf.tmp
chmod a-w autoconf.tmp
mv -f autoconf.tmp autoconf
rm -f autoheader autoheader.tmp
input=wrapper.in; \
	sed -e 's|@wrap_program[@]|autoheader|g' -e 's|@abs_top_srcdir[@]|/home/services/builder/rpm/BUILD/autoconf-2.67|g' -e 's|@abs_top_builddir[@]|/home/services/builder/rpm/BUILD/autoconf-2.67|g' -e "s|@configure_input[@]|Generated from $input.|g" wrapper.in >autoheader.tmp
chmod +x autoheader.tmp
chmod a-w autoheader.tmp
mv -f autoheader.tmp autoheader
rm -f autom4te autom4te.tmp
input=wrapper.in; \
	sed -e 's|@wrap_program[@]|autom4te|g' -e 's|@abs_top_srcdir[@]|/home/services/builder/rpm/BUILD/autoconf-2.67|g' -e 's|@abs_top_builddir[@]|/home/services/builder/rpm/BUILD/autoconf-2.67|g' -e "s|@configure_input[@]|Generated from $input.|g" wrapper.in >autom4te.tmp
chmod +x autom4te.tmp
chmod a-w autom4te.tmp
mv -f autom4te.tmp autom4te
rm -f autoreconf autoreconf.tmp
input=wrapper.in; \
	sed -e 's|@wrap_program[@]|autoreconf|g' -e 's|@abs_top_srcdir[@]|/home/services/builder/rpm/BUILD/autoconf-2.67|g' -e 's|@abs_top_builddir[@]|/home/services/builder/rpm/BUILD/autoconf-2.67|g' -e "s|@configure_input[@]|Generated from $input.|g" wrapper.in >autoreconf.tmp
chmod +x autoreconf.tmp
chmod a-w autoreconf.tmp
mv -f autoreconf.tmp autoreconf
rm -f autoscan autoscan.tmp
input=wrapper.in; \
	sed -e 's|@wrap_program[@]|autoscan|g' -e 's|@abs_top_srcdir[@]|/home/services/builder/rpm/BUILD/autoconf-2.67|g' -e 's|@abs_top_builddir[@]|/home/services/builder/rpm/BUILD/autoconf-2.67|g' -e "s|@configure_input[@]|Generated from $input.|g" wrapper.in >autoscan.tmp
chmod +x autoscan.tmp
chmod a-w autoscan.tmp
mv -f autoscan.tmp autoscan
rm -f autoupdate autoupdate.tmp
input=wrapper.in; \
	sed -e 's|@wrap_program[@]|autoupdate|g' -e 's|@abs_top_srcdir[@]|/home/services/builder/rpm/BUILD/autoconf-2.67|g' -e 's|@abs_top_builddir[@]|/home/services/builder/rpm/BUILD/autoconf-2.67|g' -e "s|@configure_input[@]|Generated from $input.|g" wrapper.in >autoupdate.tmp
chmod +x autoupdate.tmp
chmod a-w autoupdate.tmp
mv -f autoupdate.tmp autoupdate
rm -f ifnames ifnames.tmp
input=wrapper.in; \
	sed -e 's|@wrap_program[@]|ifnames|g' -e 's|@abs_top_srcdir[@]|/home/services/builder/rpm/BUILD/autoconf-2.67|g' -e 's|@abs_top_builddir[@]|/home/services/builder/rpm/BUILD/autoconf-2.67|g' -e "s|@configure_input[@]|Generated from $input.|g" wrapper.in >ifnames.tmp
chmod +x ifnames.tmp
chmod a-w ifnames.tmp
mv -f ifnames.tmp ifnames
make[2]: Leaving directory `/home/services/builder/rpm/BUILD/autoconf-2.67/tests'
Making all in man
make[2]: Entering directory `/home/services/builder/rpm/BUILD/autoconf-2.67/man'
make[2]: Nothing to be done for `all'.
make[2]: Leaving directory `/home/services/builder/rpm/BUILD/autoconf-2.67/man'
make[1]: Leaving directory `/home/services/builder/rpm/BUILD/autoconf-2.67'
+ /usr/bin/make -j4 check
/usr/bin/make  check-recursive
make[1]: Entering directory `/home/services/builder/rpm/BUILD/autoconf-2.67'
Making check in bin
make[2]: Entering directory `/home/services/builder/rpm/BUILD/autoconf-2.67/bin'
make[2]: Nothing to be done for `check'.
make[2]: Leaving directory `/home/services/builder/rpm/BUILD/autoconf-2.67/bin'
Making check in .
make[2]: Entering directory `/home/services/builder/rpm/BUILD/autoconf-2.67'
make[2]: Nothing to be done for `check-am'.
make[2]: Leaving directory `/home/services/builder/rpm/BUILD/autoconf-2.67'
Making check in lib
make[2]: Entering directory `/home/services/builder/rpm/BUILD/autoconf-2.67/lib'
Making check in Autom4te
make[3]: Entering directory `/home/services/builder/rpm/BUILD/autoconf-2.67/lib/Autom4te'
make[3]: Nothing to be done for `check'.
make[3]: Leaving directory `/home/services/builder/rpm/BUILD/autoconf-2.67/lib/Autom4te'
Making check in m4sugar
make[3]: Entering directory `/home/services/builder/rpm/BUILD/autoconf-2.67/lib/m4sugar'
/usr/bin/make  check-local
make[4]: Entering directory `/home/services/builder/rpm/BUILD/autoconf-2.67/lib/m4sugar'
make[4]: Leaving directory `/home/services/builder/rpm/BUILD/autoconf-2.67/lib/m4sugar'
make[3]: Leaving directory `/home/services/builder/rpm/BUILD/autoconf-2.67/lib/m4sugar'
Making check in autoconf
make[3]: Entering directory `/home/services/builder/rpm/BUILD/autoconf-2.67/lib/autoconf'
/usr/bin/make  check-local
make[4]: Entering directory `/home/services/builder/rpm/BUILD/autoconf-2.67/lib/autoconf'
make[4]: Leaving directory `/home/services/builder/rpm/BUILD/autoconf-2.67/lib/autoconf'
make[3]: Leaving directory `/home/services/builder/rpm/BUILD/autoconf-2.67/lib/autoconf'
Making check in autotest
make[3]: Entering directory `/home/services/builder/rpm/BUILD/autoconf-2.67/lib/autotest'
/usr/bin/make  check-local
make[4]: Entering directory `/home/services/builder/rpm/BUILD/autoconf-2.67/lib/autotest'
make[4]: Leaving directory `/home/services/builder/rpm/BUILD/autoconf-2.67/lib/autotest'
make[3]: Leaving directory `/home/services/builder/rpm/BUILD/autoconf-2.67/lib/autotest'
Making check in autoscan
make[3]: Entering directory `/home/services/builder/rpm/BUILD/autoconf-2.67/lib/autoscan'
make[3]: Nothing to be done for `check'.
make[3]: Leaving directory `/home/services/builder/rpm/BUILD/autoconf-2.67/lib/autoscan'
Making check in emacs
make[3]: Entering directory `/home/services/builder/rpm/BUILD/autoconf-2.67/lib/emacs'
make[3]: Leaving directory `/home/services/builder/rpm/BUILD/autoconf-2.67/lib/emacs'
make[3]: Entering directory `/home/services/builder/rpm/BUILD/autoconf-2.67/lib'
make[3]: Nothing to be done for `check-am'.
make[3]: Leaving directory `/home/services/builder/rpm/BUILD/autoconf-2.67/lib'
make[2]: Leaving directory `/home/services/builder/rpm/BUILD/autoconf-2.67/lib'
Making check in doc
make[2]: Entering directory `/home/services/builder/rpm/BUILD/autoconf-2.67/doc'
make[2]: Nothing to be done for `check'.
make[2]: Leaving directory `/home/services/builder/rpm/BUILD/autoconf-2.67/doc'
Making check in tests
make[2]: Entering directory `/home/services/builder/rpm/BUILD/autoconf-2.67/tests'
/usr/bin/make  check-local
make[3]: Entering directory `/home/services/builder/rpm/BUILD/autoconf-2.67/tests'
:;{ \
	  echo '# Signature of the current package.' && \
	  echo 'm4_define([AT_PACKAGE_NAME],      [GNU Autoconf])' && \
	  echo 'm4_define([AT_PACKAGE_TARNAME],   [autoconf])' && \
	  echo 'm4_define([AT_PACKAGE_VERSION],   [2.67])' && \
	  echo 'm4_define([AT_PACKAGE_STRING],    [GNU Autoconf 2.67])' && \
	  echo 'm4_define([AT_PACKAGE_BUGREPORT], [bug-autoconf@gnu.org])' && \
	  echo 'm4_define([AT_PACKAGE_URL],       [http://www.gnu.org/software/autoconf/])'; \
	} > package.m4-t
mv package.m4-t package.m4
cd . && ./mktests.sh \
	  `echo " "../lib/autoconf/general.m4 ../lib/autoconf/status.m4 ../lib/autoconf/autoheader.m4 ../lib/autoconf/autoupdate.m4 ../lib/autoconf/specific.m4 ../lib/autoconf/functions.m4 ../lib/autoconf/lang.m4 ../lib/autoconf/c.m4 ../lib/autoconf/erlang.m4 ../lib/autoconf/fortran.m4 ../lib/autoconf/headers.m4 ../lib/autoconf/libs.m4 ../lib/autoconf/types.m4 ../lib/autoconf/programs.m4 | sed 's, [^ ]*/, ../lib/autoconf/,g'`
cd ../lib/autotest && /usr/bin/make  autotest.m4f
make[4]: Entering directory `/home/services/builder/rpm/BUILD/autoconf-2.67/lib/autotest'
make[4]: `autotest.m4f' is up to date.
make[4]: Leaving directory `/home/services/builder/rpm/BUILD/autoconf-2.67/lib/autotest'
autom4te_perllibdir='..'/lib AUTOM4TE_CFG='../lib/autom4te.cfg'         ../bin/autom4te -B '..'/lib -B '..'/lib         --language=autotest -I . -I . suite.at -o testsuite.tmp
mv testsuite.tmp testsuite
/bin/sh ./testsuite 
## ----------------------------- ##
## GNU Autoconf 2.67 test suite. ##
## ----------------------------- ##

Executables (autoheader, autoupdate...).

  1: Syntax of the shell scripts                     ok
  2: Syntax of the Perl scripts                      ok
  3: autom4te cache                                  ok
  4: autom4te --force                                ok
  5: autom4te and whitespace in file names           ok
  6: autom4te --trace and unusual macro names        ok
  7: autom4te --trace and whitespace                 ok
  8: autoconf --trace: user macros                   ok
  9: autoconf --trace: builtins                      ok
 10: autoconf: forbidden tokens, basic               ok
 11: autoconf: forbidden tokens, exceptions          ok
 12: autoconf: automatically allowed tokens          ok
 13: autoconf: the empty token                       ok
 14: autoconf: subdirectories                        FAILED (tools.at:496)
 15: autoconf: input from stdin                      ok
 16: autoconf: AC_AUTOCONF_VERSION                   ok
 17: autoconf: AC_PRESERVE_HELP_ORDER                ok
 18: ifnames                                         ok
 19: autoheader                                      ok
 20: autoheader and macros                           ok
 21: autoupdate                                      ok
 22: autoupdating AC_LINK_FILES                      ok
 23: autoupdating AC_PREREQ                          ok
 24: autoupdating AU_ALIAS                           ok
 25: autoupdating OLD to NEW                         ok
 26: autoupdating macros recursively                 expected failure (tools.at:945)
 27: autoupdating AC_HELP_STRING                     ok
 28: autoupdating with m4sugar                       FAILED (tools.at:1002)
 29: autoupdating with m4_pushdef                    expected failure (tools.at:1027)
 30: autoupdating with AC_REQUIRE                    expected failure (tools.at:1053)
 31: autoupdating with complex quoting               expected failure (tools.at:1080)
 32: autoupdating AC_LANG_SAVE                       ok
 33: autoupdating AC_FOREACH                         ok
 34: autoupdating with aclocal and m4_include        ok
 35: autom4te preselections                          ok
 36: autom4te cache creation                         ok
 37: autom4te cache locking                          ok
 38: autotools and whitespace in file names          ok

M4sugar.

 39: m4_stack                                        ok
 40: m4_defn                                         ok
 41: m4_dumpdef                                      ok
 42: m4_warn                                         ok
 43: m4_divert_stack                                 ok
 44: m4_expansion_stack                              ok
 45: m4_require: error message                       ok
 46: m4_require: circular dependencies               ok
 47: m4_require: one-shot initialization             ok
 48: m4_require: nested                              ok
 49: m4sugar shorthand conditionals                  ok
 50: m4_cond                                         ok
 51: m4 lists                                        ok
 52: m4_split                                        ok
 53: m4_do                                           ok
 54: m4_append                                       ok
 55: m4_join                                         ok
 56: m4_expand                                       ok
 57: m4_text_box                                     ok
 58: m4_text_wrap                                    ok
 59: m4_version_compare                              ok
 60: Standard regular expressions                    ok
 61: m4_bmatch                                       ok
 62: m4_toupper and m4_tolower                       ok
 63: m4_bpatsubsts                                   ok
 64: m4_esyscmd_s                                    ok
 65: M4 loops                                        ok
 66: m4_map                                          ok
 67: m4_map_args and m4_curry                        ok
 68: m4_combine                                      ok
 69: m4_max and m4_min                               ok
 70: recursion                                       ok
 71: m4_set                                          ok
 72: __file__ and __line__                           ok

M4sh.

 73: LINENO                                          ok
 74: LINENO stack                                    ok
 75: AS_BOX                                          ok
 76: AS_BASENAME                                     ok
 77: AS_DIRNAME                                      ok
 78: AS_SET_CATFILE                                  ok
 79: AS_ECHO and AS_ECHO_N                           ok
 80: AS_EXIT                                         ok
 81: AS_MKDIR_P                                      ok
 82: AS_VERSION_COMPARE                              ok
 83: as_me                                           ok
 84: Negated classes in globbing                     ok
 85: Functions Support                               ok
 86: Functions and return Support                    ok
 87: Nested AS_REQUIRE_SHELL_FN                      ok
 88: Nested AS_REQUIRE                               ok
 89: AS_REQUIRE_SHELL_FN and m4_require              ok
 90: AS_HELP_STRING                                  ok
 91: AS_IF and AS_CASE                               ok
 92: AS_FOR                                          ok
 93: AS_LITERAL_IF                                   ok
 94: AS_TR_SH and AS_TR_CPP                          ok
 95: AS_VAR basics                                   ok
 96: AS_VAR_APPEND                                   ok
 97: AS_VAR_ARITH                                    ok
 98: AS_INIT cleanup                                 ok
 99: AS_INIT_GENERATED                               ok
100: AS_MESSAGE_FD                                   ok
101: _AS_CLEAN_DIR                                   ok
102: ECHO_C                                          ok

Autotest.

103: AT_COPYRIGHT                                    ok
104: Empty test suite                                ok
105: Banner-only test suite                          ok
106: Empty test                                      ok
107: Empty check                                     ok
108: AT_SETUP without AT_INIT                        ok
109: AT_BANNER without AT_INIT                       ok
110: AT_CLEANUP without AT_INIT                      ok
111: Missing AT_CLEANUP                              ok
112: AT_FAIL_IF without AT_SETUP                     ok
113: AT_SKIP_IF without AT_SETUP                     ok
114: AT_CHECK without AT_SETUP                       ok
115: AT_DATA without AT_SETUP                        ok
116: AT_XFAIL_IF without AT_SETUP                    ok
117: AT_KEYWORDS without AT_SETUP                    ok
118: AT_CLEANUP without AT_SETUP                     ok
119: AT_BANNER inside AT_SETUP                       ok
120: AT_SETUP inside AT_SETUP                        ok
121: Multiple AT_INIT                                ok
122: Tested programs                                 ok
123: Startup error messages                          ok
124: Truth                                           ok
125: Fallacy                                         ok
126: Skip                                            ok
127: Hard fail                                       ok
128: AT_FAIL_IF                                      ok
129: AT_SKIP_IF                                      ok
130: Syntax error                                    ok
131: errexit                                         ok
132: unquoted output                                 ok
133: Trace output                                    ok
134: Logging                                         ok
135: Binary output                                   ok
136: Cleanup                                         ok
137: Literal multiline command                       ok
138: Multiline parameter expansion                   ok
139: Backquote command substitution                  ok
140: Multiline backquote command substitution        ok
141: Parenthetical command substitution              ok
142: Multiline parenthetical command substitution    ok
143: Shell comment in command                        ok
144: Invalid brace-enclosed parameter expansion      ok
145: Multiline command from M4 expansion             ok
146: Double-M4-quoted command                        ok
147: Metacharacters in command from M4 expansion     ok
148: BS-newline in command                           ok
149: ^BS-newline in command                          ok
150: BSx641-newline in command                       ok
151: BS-BS-newline in command                        ok
152: BSx640-newline in command                       ok
153: Newline-CODE-BS-newline in command              ok
154: Single-quote-BS-newline in command              ok
155: Single-quote-newline-BS-newline in command      ok
156: Input from stdin                                ok
157: Backquote in a test title                       ok
158: Single-quote in a test title                    ok
159: Double-quote in a test title                    ok
160: Backslash in a test title                       ok
161: Brackets in a test title                        ok
162: Left bracket in a test title                    ok
163: Right bracket in a test title                   ok
164: Quoted pound in a test title                    ok
165: Pound in a test title                           ok
166: Quoted comma in a test title                    ok
167: Comma in a test title                           ok
168: Parentheses in a test title                     ok
169: Left paren in a test title                      ok
170: Right paren in a test title                     ok
171: Quoted Macro in a test title                    ok
172: Macro in a test title                           ok
173: Macro with backquote in a test title            ok
174: Macro with single-quote in a test title         ok
175: Macro with double-quote in a test title         ok
176: Macro with backslash in a test title            ok
177: Macro echoing macro in a test title             ok
178: Macro echoing single-quote in a test title      ok
179: Long test title in a test title                 ok
180: Longer test title in a test title               ok
181: Long test source lines                          ok
182: Debugging a successful test                     ok
183: Debugging script and environment                ok
184: Debugging a failed test                         ok
185: Using atlocal                                   ok
186: Choosing where testsuite is run                 ok
187: recheck                                         ok
188: Banners                                         ok
189: Keywords and ranges                             ok
190: Keyword wrapping                                ok
191: AT_ARG_OPTION                                   ok
192: AT_ARG_OPTION_ARG                               ok
193: parallel test execution                         skipped (autotest.at:1309)
194: parallel truth                                  skipped (autotest.at:1341)
195: parallel fallacy                                skipped (autotest.at:1346)
196: parallel skip                                   skipped (autotest.at:1351)
197: parallel syntax error                           skipped (autotest.at:1356)
198: parallel errexit                                skipped (autotest.at:1375)
199: parallel autotest and signal handling           skipped (autotest.at:1393)
200: colored test results                            ok
201: srcdir propagation                              ok
202: whitespace in absolute testdir                  ok
203: unusual file names                              ok
204: Erlang Eunit unit tests                         FAILED (autotest.at:1792)

Autoconf base layer.

205: AC_REQUIRE: topological sort                    ok
206: AC_REQUIRE: error message                       ok
207: AC_REQUIRE & AC_DEFUN_ONCE: Require, expand     ok
208: AC_REQUIRE & AC_DEFUN_ONCE: Expand, require     ok
209: AC_REQUIRE & AC_PROVIDE                         ok
210: AC_INIT                                         ok
211: AC_INIT with unusual version strings            ok
212: AC_COPYRIGHT                                    ok
213: AC_CACHE_CHECK                                  ok
214: AC_CACHE_LOAD                                   ok
215: AC_COMPUTE_INT                                  ok
216: AC_TRY_COMMAND                                  ok
217: Input/Output                                    ok
218: configure arguments                             ok
219: AC_ARG_ENABLE and AC_ARG_WITH                   ok
220: configure directories                           FAILED (base.at:688)

Testing config.status.

221: AC_CONFIG_COMMANDS with empty commands          FAILED (torture.at:27)
222: Multiple AC_CONFIG_FILES                        ok
223: Parameterized AC_CONFIG_FILES                   FAILED (torture.at:56)
224: AC_ARG_VAR                                      FAILED (torture.at:128)
225: AC_CONFIG_FILES, HEADERS, LINKS and COMMANDS    FAILED (torture.at:253)
226: Macro calls in AC_CONFIG_COMMANDS tags          ok
227: Missing templates                               FAILED (torture.at:382)
228: configure invocation                            ok
229: #define header templates                        FAILED (torture.at:552)
230: Torturing config.status                         FAILED (torture.at:696)
231: Substitute a 2000-byte string                   FAILED (torture.at:812)
232: Define to a 2000-byte string                    FAILED (torture.at:841)
233: Substitute and define special characters        FAILED (torture.at:923)
234: Substitute a newline                            FAILED (torture.at:989)
235: Define a newline                                FAILED (torture.at:1016)
236: AC_SUBST: variable name validation              FAILED (torture.at:1064)
237: datarootdir workaround                          FAILED (torture.at:1104)
238: srcdir                                          FAILED (torture.at:1152)
239: VPATH                                           FAILED (torture.at:1219)
240: Signal handling                                 ok
241: AC_CONFIG_LINKS                                 FAILED (torture.at:1297)
242: AC_CONFIG_LINKS and identical files             ok

autoreconf.

243: Configuring subdirectories                      FAILED (torture.at:1465)
244: Deep Package                                    FAILED (torture.at:1613)
245: Non-Autoconf AC_CONFIG_SUBDIRS                  ok
246: Non-literal AC_CONFIG_SUBDIRS                   ok
247: Empty directory                                 ok
248: Unusual Automake input files                    ok

Low level compiling/preprocessing macros.

249: AC_LANG, AC_LANG_PUSH & AC_LANG_POP             ok
250: AC_REQUIRE & AC_LANG                            ok
251: AC_LANG_SOURCE                                  ok
252: AC_LANG_SOURCE(C++)                             ok
253: AC_LANG_SOURCE example                          ok
254: AC_LANG_PROGRAM example                         ok
255: AC_RUN_IFELSE                                   ok
256: Order of user actions and cleanup               ok
257: AC_TRY_LINK_FUNC                                FAILED (compile.at:346)
258: Multiple languages                              ok

Testing autoconf/lang macros.

259: AC_NO_EXECUTABLES                               FAILED (aclang.at:13)
260: AC_REQUIRE_CPP                                  FAILED (aclang.at:14)

C low level compiling/preprocessing macros.

261: Extensions                                      FAILED (c.at:34)
262: Broken/missing compilers                        ok
263: C keywords                                      FAILED (c.at:76)
264: AC_PROG_CPP requires AC_PROG_CC                 FAILED (c.at:94)
265: AC_PROG_CPP with warnings                       FAILED (c.at:119)
266: AC_PROG_CPP without warnings                    skipped (c.at:144)
267: AC_PROG_CPP via CC                              skipped (c.at:184)
268: AC_NO_EXECUTABLES (working linker)              FAILED (c.at:222)
269: AC_NO_EXECUTABLES (broken linker)               FAILED (c.at:232)
270: AC_USE_SYSTEM_EXTENSIONS                        FAILED (c.at:249)
271: AC_C_RESTRICT and C++                           FAILED (c.at:318)
272: AC_OPENMP and C                                 skipped (c.at:373)
273: AC_OPENMP and C++                               skipped (c.at:416)

Testing autoconf/c macros.

274: AC_C_BACKSLASH_A                                FAILED (acc.at:13)
275: AC_C_BIGENDIAN                                  FAILED (acc.at:14)
276: AC_C_CHAR_UNSIGNED                              FAILED (acc.at:15)
277: AC_C_FLEXIBLE_ARRAY_MEMBER                      FAILED (acc.at:16)
278: AC_C_INLINE                                     FAILED (acc.at:17)
279: AC_C_PROTOTYPES                                 FAILED (acc.at:18)
280: AC_C_RESTRICT                                   FAILED (acc.at:19)
281: AC_C_STRINGIZE                                  FAILED (acc.at:20)
282: AC_C_TYPEOF                                     FAILED (acc.at:21)
283: AC_C_VARARRAYS                                  FAILED (acc.at:22)
284: AC_OPENMP                                       FAILED (acc.at:23)
285: AC_PROG_CC_C89                                  FAILED (acc.at:24)
286: AC_PROG_CC_C99                                  FAILED (acc.at:25)
287: AC_PROG_CC_C_O                                  FAILED (acc.at:26)
288: AC_PROG_CC_STDC                                 FAILED (acc.at:27)
289: AC_PROG_CPP_WERROR                              FAILED (acc.at:28)
290: AC_PROG_GCC_TRADITIONAL                         FAILED (acc.at:29)
291: AC_LANG_C                                       FAILED (acc.at:32)
292: AC_LANG_CPLUSPLUS                               FAILED (acc.at:33)
293: AC_LANG_OBJC                                    FAILED (acc.at:34)

Fortran low level compiling/preprocessing macros.

294: GNU Fortran 77                                  skipped (fortran.at:31)
295: GNU Fortran                                     skipped (fortran.at:59)
296: AC_OPENMP and Fortran 77                        skipped (fortran.at:112)
297: AC_OPENMP and Fortran                           skipped (fortran.at:152)
298: AC_F77_DUMMY_MAIN usage                         skipped (fortran.at:242)
299: AC_FC_DUMMY_MAIN usage                          skipped (fortran.at:323)
300: AC_F77_MAIN usage                               skipped (fortran.at:402)
301: AC_FC_MAIN usage                                skipped (fortran.at:484)
302: AC_F77_FUNC usage                               skipped (fortran.at:561)
303: AC_FC_FUNC usage                                skipped (fortran.at:635)
304: AC_FC_SRCEXT usage                              skipped (fortran.at:720)
305: AC_FC_FREEFORM                                  skipped (fortran.at:756)
306: AC_FC_FREEFORM with AC_FC_SRCEXT                skipped (fortran.at:794)
307: AC_FC_FIXEDFORM                                 skipped (fortran.at:832)
308: AC_FC_FIXEDFORM with AC_FC_SRCEXT               skipped (fortran.at:871)
309: AC_FC_LINE_LENGTH                               skipped (fortran.at:935)

Testing autoconf/fortran macros.

310: AC_F77_MAIN                                     skipped (acfortran.at:13)
311: AC_F77_WRAPPERS                                 skipped (acfortran.at:14)
312: AC_FC_FIXEDFORM                                 skipped (acfortran.at:15)
313: AC_FC_FREEFORM                                  skipped (acfortran.at:16)
314: AC_FC_LINE_LENGTH                               skipped (acfortran.at:17)
315: AC_FC_MAIN                                      skipped (acfortran.at:18)
316: AC_FC_WRAPPERS                                  skipped (acfortran.at:19)
317: AC_PROG_F77_C_O                                 skipped (acfortran.at:20)
318: AC_PROG_FC_C_O                                  skipped (acfortran.at:21)
319: AC_F77_NAME_MANGLING                            FAILED (acfortran.at:24)
320: AC_LANG_FORTRAN77                               FAILED (acfortran.at:25)

Erlang low level compiling and utility macros.

321: Erlang                                          skipped (erlang.at:32)
322: AC_ERLANG_CHECK_LIB                             skipped (erlang.at:54)
323: AC_ERLANG_SUBST_ROOT_DIR                        skipped (erlang.at:74)
324: AC_ERLANG_SUBST_LIB_DIR                         skipped (erlang.at:91)
325: AC_ERLANG_SUBST_INSTALL_LIB_DIR                 FAILED (erlang.at:108)
326: AC_ERLANG_SUBST_INSTALL_LIB_SUBDIR              FAILED (erlang.at:116)
327: AC_ERLANG_SUBST_ERTS_VER                        skipped (erlang.at:130)

Semantics.

328: AC_CHECK_LIB                                    FAILED (semantics.at:33)
329: AC_SEARCH_LIBS                                  FAILED (semantics.at:77)
330: AC_SEARCH_LIBS (none needed)                    FAILED (semantics.at:90)
331: AC_CHECK_DECLS                                  FAILED (semantics.at:105)
332: AC_CHECK_FUNCS                                  FAILED (semantics.at:159)
333: AC_REPLACE_FUNCS                                FAILED (semantics.at:184)
334: AC_CHECK_HEADERS                                FAILED (semantics.at:211)
335: AC_CHECK_HEADERS (preprocessor test)            FAILED (semantics.at:245)
336: AC_CHECK_HEADERS (compiler test)                FAILED (semantics.at:277)
337: AC_CHECK_MEMBER                                 FAILED (semantics.at:291)
338: AC_CHECK_MEMBERS                                FAILED (semantics.at:317)
339: AC_CHECK_ALIGNOF                                FAILED (semantics.at:332)
340: AC_CHECK_ALIGNOF (cross compile)                FAILED (semantics.at:332)
341: AC_CHECK_ALIGNOF struct                         FAILED (semantics.at:349)
342: AC_CHECK_ALIGNOF struct (cross compile)         FAILED (semantics.at:349)
343: AC_CHECK_SIZEOF                                 FAILED (semantics.at:361)
344: AC_CHECK_SIZEOF (cross compile)                 FAILED (semantics.at:361)
345: AC_CHECK_SIZEOF struct                          FAILED (semantics.at:377)
346: AC_CHECK_SIZEOF struct (cross compile)          FAILED (semantics.at:377)
347: AC_CHECK_TYPES                                  FAILED (semantics.at:402)
348: AC_CHECK_TYPES: backward compatibility          ok
349: AC_CHECK_FILES                                  FAILED (semantics.at:452)
350: AC_CHECK_PROG & AC_CHECK_PROGS                  ok
351: AC_C_BIGENDIAN                                  FAILED (semantics.at:550)
352: AC_PATH_PROG & AC_PATH_PROGS                    ok
353: AC_PATH_PROGS_FEATURE_CHECK                     ok
354: AC_PATH_XTRA                                    FAILED (semantics.at:717)
355: AC_SYS_RESTARTABLE_SYSCALLS                     FAILED (semantics.at:733)
356: AC_FUNC_SETVBUF_REVERSED                        FAILED (semantics.at:734)
357: AC_FUNC_WAIT3                                   FAILED (semantics.at:735)

Testing autoconf/general macros.

358: AC_ARG_ENABLE                                   FAILED (acgeneral.at:13)
359: AC_ARG_PROGRAM                                  FAILED (acgeneral.at:14)
360: AC_ARG_WITH                                     FAILED (acgeneral.at:15)
361: AC_CHECK_DECLS_ONCE                             FAILED (acgeneral.at:16)
362: AC_EGREP_CPP                                    FAILED (acgeneral.at:17)
363: AC_EGREP_HEADER                                 FAILED (acgeneral.at:18)
364: AC_LIBOBJ                                       FAILED (acgeneral.at:19)
365: AC_LIBSOURCES                                   FAILED (acgeneral.at:20)
366: AC_PREFIX_DEFAULT                               FAILED (acgeneral.at:21)
367: AC_CHECKING                                     FAILED (acgeneral.at:24)
368: AC_COMPILE_CHECK                                FAILED (acgeneral.at:25)
369: AC_ENABLE                                       FAILED (acgeneral.at:26)
370: AC_FOREACH                                      FAILED (acgeneral.at:27)
371: AC_MSG_RESULT_UNQUOTED                          FAILED (acgeneral.at:28)
372: AC_TRY_COMPILE                                  FAILED (acgeneral.at:29)
373: AC_TRY_CPP                                      FAILED (acgeneral.at:30)
374: AC_TRY_LINK                                     FAILED (acgeneral.at:31)
375: AC_TRY_RUN                                      FAILED (acgeneral.at:32)
376: AC_VALIDATE_CACHED_SYSTEM_TUPLE                 FAILED (acgeneral.at:33)
377: AC_WITH                                         FAILED (acgeneral.at:34)

Testing autoconf/status macros.

378: AC_OUTPUT_COMMANDS                              FAILED (acstatus.at:15)

Testing autoconf/specific macros.

379: AC_SYS_INTERPRETER                              FAILED (acspecific.at:13)
380: AC_SYS_LARGEFILE                                FAILED (acspecific.at:14)
381: AC_SYS_LONG_FILE_NAMES                          FAILED (acspecific.at:15)
382: AC_SYS_POSIX_TERMIOS                            FAILED (acspecific.at:16)
383: AC_AIX                                          FAILED (acspecific.at:19)
384: AC_ARG_ARRAY                                    FAILED (acspecific.at:20)
385: AC_DECL_SYS_SIGLIST                             FAILED (acspecific.at:21)
386: AC_DYNIX_SEQ                                    FAILED (acspecific.at:22)
387: AC_HAVE_POUNDBANG                               FAILED (acspecific.at:23)
388: AC_IRIX_SUN                                     FAILED (acspecific.at:24)
389: AC_ISC_POSIX                                    FAILED (acspecific.at:25)
390: AC_MINIX                                        FAILED (acspecific.at:26)
391: AC_SCO_INTL                                     FAILED (acspecific.at:27)
392: AC_XENIX_DIR                                    FAILED (acspecific.at:28)

Testing autoconf/programs macros.

393: AC_PROG_AWK                                     FAILED (acprograms.at:13)
394: AC_PROG_FGREP                                   FAILED (acprograms.at:14)
395: AC_PROG_INSTALL                                 FAILED (acprograms.at:15)
396: AC_PROG_LEX                                     FAILED (acprograms.at:16)
397: AC_PROG_LN_S                                    FAILED (acprograms.at:17)
398: AC_PROG_MAKE_SET                                FAILED (acprograms.at:18)
399: AC_PROG_MKDIR_P                                 FAILED (acprograms.at:19)
400: AC_PROG_RANLIB                                  FAILED (acprograms.at:20)
401: AC_PROG_SED                                     FAILED (acprograms.at:21)
402: AC_PROG_YACC                                    FAILED (acprograms.at:22)
403: AC_CHECK_TOOL_PREFIX                            FAILED (acprograms.at:25)
404: AC_DECL_YYTEXT                                  FAILED (acprograms.at:26)
405: AC_RSH                                          FAILED (acprograms.at:27)

Testing autoconf/headers macros.

406: AC_CHECK_HEADERS_ONCE                           FAILED (acheaders.at:13)
407: AC_HEADER_ASSERT                                FAILED (acheaders.at:14)
408: AC_HEADER_MAJOR                                 FAILED (acheaders.at:15)
409: AC_HEADER_RESOLV                                FAILED (acheaders.at:16)
410: AC_HEADER_STAT                                  FAILED (acheaders.at:17)
411: AC_HEADER_STDBOOL                               FAILED (acheaders.at:18)
412: AC_HEADER_TIOCGWINSZ                            FAILED (acheaders.at:19)
413: AC_DIR_HEADER                                   FAILED (acheaders.at:22)
414: AC_MEMORY_H                                     FAILED (acheaders.at:23)
415: AC_UNISTD_H                                     FAILED (acheaders.at:24)
416: AC_USG                                          FAILED (acheaders.at:25)

Testing autoconf/types macros.

417: AC_STRUCT_DIRENT_D_INO                          FAILED (actypes.at:13)
418: AC_STRUCT_DIRENT_D_TYPE                         FAILED (actypes.at:14)
419: AC_STRUCT_ST_BLOCKS                             FAILED (actypes.at:15)
420: AC_STRUCT_TIMEZONE                              FAILED (actypes.at:16)
421: AC_TYPE_INT16_T                                 FAILED (actypes.at:17)
422: AC_TYPE_INT32_T                                 FAILED (actypes.at:18)
423: AC_TYPE_INT64_T                                 FAILED (actypes.at:19)
424: AC_TYPE_INT8_T                                  FAILED (actypes.at:20)
425: AC_TYPE_INTMAX_T                                FAILED (actypes.at:21)
426: AC_TYPE_INTPTR_T                                FAILED (actypes.at:22)
427: AC_TYPE_LONG_DOUBLE                             FAILED (actypes.at:23)
428: AC_TYPE_LONG_DOUBLE_WIDER                       FAILED (actypes.at:24)
429: AC_TYPE_MODE_T                                  FAILED (actypes.at:25)
430: AC_TYPE_OFF_T                                   FAILED (actypes.at:26)
431: AC_TYPE_SSIZE_T                                 FAILED (actypes.at:27)
432: AC_TYPE_UINT16_T                                FAILED (actypes.at:28)
433: AC_TYPE_UINT32_T                                FAILED (actypes.at:29)
434: AC_TYPE_UINT64_T                                FAILED (actypes.at:30)
435: AC_TYPE_UINT8_T                                 FAILED (actypes.at:31)
436: AC_TYPE_UINTMAX_T                               FAILED (actypes.at:32)
437: AC_TYPE_UINTPTR_T                               FAILED (actypes.at:33)
438: AC_C_LONG_DOUBLE                                FAILED (actypes.at:36)
439: AC_INT_16_BITS                                  FAILED (actypes.at:37)
440: AC_LONG_64_BITS                                 FAILED (actypes.at:38)
441: AC_STRUCT_ST_BLKSIZE                            FAILED (actypes.at:39)
442: AC_STRUCT_ST_RDEV                               FAILED (actypes.at:40)
443: AC_TYPE_SIGNAL                                  FAILED (actypes.at:41)
444: AM_TYPE_PTRDIFF_T                               FAILED (actypes.at:42)

Testing autoconf/functions macros.

445: AC_CHECK_FUNCS_ONCE                             FAILED (acfunctions.at:13)
446: AC_FUNC_CHOWN                                   FAILED (acfunctions.at:14)
447: AC_FUNC_CLOSEDIR_VOID                           FAILED (acfunctions.at:15)
448: AC_FUNC_ERROR_AT_LINE                           FAILED (acfunctions.at:16)
449: AC_FUNC_FNMATCH                                 FAILED (acfunctions.at:17)
450: AC_FUNC_FORK                                    FAILED (acfunctions.at:18)
451: AC_FUNC_FSEEKO                                  FAILED (acfunctions.at:19)
452: AC_FUNC_GETGROUPS                               FAILED (acfunctions.at:20)
453: AC_FUNC_GETMNTENT                               FAILED (acfunctions.at:21)
454: AC_FUNC_GETPGRP                                 FAILED (acfunctions.at:22)
455: AC_FUNC_LSTAT                                   FAILED (acfunctions.at:23)
456: AC_FUNC_MALLOC                                  FAILED (acfunctions.at:24)
457: AC_FUNC_MBRTOWC                                 FAILED (acfunctions.at:25)
458: AC_FUNC_MEMCMP                                  FAILED (acfunctions.at:26)
459: AC_FUNC_MKTIME                                  FAILED (acfunctions.at:27)
460: AC_FUNC_MMAP                                    FAILED (acfunctions.at:28)
461: AC_FUNC_OBSTACK                                 FAILED (acfunctions.at:29)
462: AC_FUNC_REALLOC                                 FAILED (acfunctions.at:30)
463: AC_FUNC_SELECT_ARGTYPES                         FAILED (acfunctions.at:31)
464: AC_FUNC_SETPGRP                                 FAILED (acfunctions.at:32)
465: AC_FUNC_STAT                                    FAILED (acfunctions.at:33)
466: AC_FUNC_STRCOLL                                 FAILED (acfunctions.at:34)
467: AC_FUNC_STRERROR_R                              FAILED (acfunctions.at:35)
468: AC_FUNC_STRFTIME                                FAILED (acfunctions.at:36)
469: AC_FUNC_STRNLEN                                 FAILED (acfunctions.at:37)
470: AC_FUNC_STRTOD                                  FAILED (acfunctions.at:38)
471: AC_FUNC_STRTOLD                                 FAILED (acfunctions.at:39)
472: AC_FUNC_UTIME_NULL                              FAILED (acfunctions.at:40)
473: AC_FUNC_VPRINTF                                 FAILED (acfunctions.at:41)

Testing autoconf/libs macros.

474: AC_HAVE_LIBRARY                                 FAILED (aclibs.at:15)

Compatibility with other tools.

475: Libtool                                         skipped (foreign.at:33)
476: shtool                                          FAILED (foreign.at:130)

Autoscan.

477: autoscan                                        ok

## ------------- ##
## Test results. ##
## ------------- ##

ERROR: 435 tests were run,
206 failed (4 expected failures).
42 tests were skipped.
## -------------------------- ##
## testsuite.log was created. ##
## -------------------------- ##

Please send `tests/testsuite.log' and all information you think might help:

   To: <bug-autoconf@gnu.org>
   Subject: [GNU Autoconf 2.67] testsuite: 14 28 204 220 221 223 224 225 227 229 230 231 232 233 234 235 236 237 238 239 241 243 244 257 259 260 261 263 264 265 268 269 270 271 274 275 276 277 278 279 280 281 282 283 284 285 286 287 288 289 290 291 292 293 319 320 325 326 328 329 330 331 332 333 334 335 336 337 338 339 340 341 342 343 344 345 346 347 349 351 354 355 356 357 358 359 360 361 362 363 364 365 366 367 368 369 370 371 372 373 374 375 376 377 378 379 380 381 382 383 384 385 386 387 388 389 390 391 392 393 394 395 396 397 398 399 400 401 402 403 404 405 406 407 408 409 410 411 412 413 414 415 416 417 418 419 420 421 422 423 424 425 426 427 428 429 430 431 432 433 434 435 436 437 438 439 440 441 442 443 444 445 446 447 448 449 450 451 452 453 454 455 456 457 458 459 460 461 462 463 464 465 466 467 468 469 470 471 472 473 474 476 failed

You may investigate any problem if you feel able to do so, in which
case the test suite provides a good starting point.  Its output may
be found below `tests/testsuite.dir'.

make[3]: *** [check-local] Error 1
make[3]: Leaving directory `/home/services/builder/rpm/BUILD/autoconf-2.67/tests'
make[2]: *** [check-am] Error 2
make[2]: Leaving directory `/home/services/builder/rpm/BUILD/autoconf-2.67/tests'
make[1]: *** [check-recursive] Error 1
make[1]: Leaving directory `/home/services/builder/rpm/BUILD/autoconf-2.67'
make: *** [check] Error 2
error: Bad exit status from /tmp/B.dfca1b/rpm-tmp.47098 (%build)


RPM build errors:
    Bad exit status from /tmp/B.dfca1b/rpm-tmp.47098 (%build)
ended at: Sun Mar  4 19:18:11 2012, done in 0:08:45.837181
error: No files produced.
Begin-PLD-Builder-Info
Build-Time: user:226.33s sys:81.15s real:547.96s (faults io:39 non-io:40541309)

End-PLD-Builder-Info
[Back to list of logs] [View rpm -qa of builder]