FailedOk

th/SRPMS[OK]
th/x32[OK]
th/i686[OK]
th/x86_64[OK]

ac/SRPMS[OK]
ac/i386[OK]
ac/i586[OK]
ac/i686[OK]
ac/alpha[OK]
ac/amd64[OK]
ac/athlon[OK]
ac/ppc[OK]
ac/sparc[OK]
ac/sparc64[OK]

Advanced Search
main()
Powered by PLD Linux
(c) 2002-2018 PLD Team
$Revision: 1.37 $
Powered by PDP-7.
Your IP: 54.225.55.174

autoconf 61c98a1c-2fa1-4084-b0d0-ff3141557bc7

Status:Failed
Source URL:ftp://buildlogs.pld-linux.org/ac/amd64/FAIL/autoconf,61c98a1c-2fa1-4084-b0d0-ff3141557bc7.bz2
text/plain URL:View!
full text:View!
rpm -qa of builder:View!
Date:2012/03/04 19:18:31
Runtime:0:08:45.837181

Toc:

  • error 1
  • ERROR: 435 tests were run,
  • error 2
  • make[3]: *** [check-local] Error 1
  • error 3
  • make[2]: *** [check-am] Error 2
  • error 4
  • make[1]: *** [check-recursive] Error 1
  • error 5
  • error: Bad exit status from /tmp/B.dfca1b/rpm-tmp.47098 (%build)
  • error 6
  • RPM build errors:
  • error 7
  • error: No files produced.

Content:

402: AC_PROG_YACC                                    FAILED (acprograms.at:22)
403: AC_CHECK_TOOL_PREFIX                            FAILED (acprograms.at:25)
404: AC_DECL_YYTEXT                                  FAILED (acprograms.at:26)
405: AC_RSH                                          FAILED (acprograms.at:27)

Testing autoconf/headers macros.

406: AC_CHECK_HEADERS_ONCE                           FAILED (acheaders.at:13)
407: AC_HEADER_ASSERT                                FAILED (acheaders.at:14)
408: AC_HEADER_MAJOR                                 FAILED (acheaders.at:15)
409: AC_HEADER_RESOLV                                FAILED (acheaders.at:16)
410: AC_HEADER_STAT                                  FAILED (acheaders.at:17)
411: AC_HEADER_STDBOOL                               FAILED (acheaders.at:18)
412: AC_HEADER_TIOCGWINSZ                            FAILED (acheaders.at:19)
413: AC_DIR_HEADER                                   FAILED (acheaders.at:22)
414: AC_MEMORY_H                                     FAILED (acheaders.at:23)
415: AC_UNISTD_H                                     FAILED (acheaders.at:24)
416: AC_USG                                          FAILED (acheaders.at:25)

Testing autoconf/types macros.

417: AC_STRUCT_DIRENT_D_INO                          FAILED (actypes.at:13)
418: AC_STRUCT_DIRENT_D_TYPE                         FAILED (actypes.at:14)
419: AC_STRUCT_ST_BLOCKS                             FAILED (actypes.at:15)
420: AC_STRUCT_TIMEZONE                              FAILED (actypes.at:16)
421: AC_TYPE_INT16_T                                 FAILED (actypes.at:17)
422: AC_TYPE_INT32_T                                 FAILED (actypes.at:18)
423: AC_TYPE_INT64_T                                 FAILED (actypes.at:19)
424: AC_TYPE_INT8_T                                  FAILED (actypes.at:20)
425: AC_TYPE_INTMAX_T                                FAILED (actypes.at:21)
426: AC_TYPE_INTPTR_T                                FAILED (actypes.at:22)
427: AC_TYPE_LONG_DOUBLE                             FAILED (actypes.at:23)
428: AC_TYPE_LONG_DOUBLE_WIDER                       FAILED (actypes.at:24)
429: AC_TYPE_MODE_T                                  FAILED (actypes.at:25)
430: AC_TYPE_OFF_T                                   FAILED (actypes.at:26)
431: AC_TYPE_SSIZE_T                                 FAILED (actypes.at:27)
432: AC_TYPE_UINT16_T                                FAILED (actypes.at:28)
433: AC_TYPE_UINT32_T                                FAILED (actypes.at:29)
434: AC_TYPE_UINT64_T                                FAILED (actypes.at:30)
435: AC_TYPE_UINT8_T                                 FAILED (actypes.at:31)
436: AC_TYPE_UINTMAX_T                               FAILED (actypes.at:32)
437: AC_TYPE_UINTPTR_T                               FAILED (actypes.at:33)
438: AC_C_LONG_DOUBLE                                FAILED (actypes.at:36)
439: AC_INT_16_BITS                                  FAILED (actypes.at:37)
440: AC_LONG_64_BITS                                 FAILED (actypes.at:38)
441: AC_STRUCT_ST_BLKSIZE                            FAILED (actypes.at:39)
442: AC_STRUCT_ST_RDEV                               FAILED (actypes.at:40)
443: AC_TYPE_SIGNAL                                  FAILED (actypes.at:41)
444: AM_TYPE_PTRDIFF_T                               FAILED (actypes.at:42)

Testing autoconf/functions macros.

445: AC_CHECK_FUNCS_ONCE                             FAILED (acfunctions.at:13)
446: AC_FUNC_CHOWN                                   FAILED (acfunctions.at:14)
447: AC_FUNC_CLOSEDIR_VOID                           FAILED (acfunctions.at:15)
448: AC_FUNC_ERROR_AT_LINE                           FAILED (acfunctions.at:16)
449: AC_FUNC_FNMATCH                                 FAILED (acfunctions.at:17)
450: AC_FUNC_FORK                                    FAILED (acfunctions.at:18)
451: AC_FUNC_FSEEKO                                  FAILED (acfunctions.at:19)
452: AC_FUNC_GETGROUPS                               FAILED (acfunctions.at:20)
453: AC_FUNC_GETMNTENT                               FAILED (acfunctions.at:21)
454: AC_FUNC_GETPGRP                                 FAILED (acfunctions.at:22)
455: AC_FUNC_LSTAT                                   FAILED (acfunctions.at:23)
456: AC_FUNC_MALLOC                                  FAILED (acfunctions.at:24)
457: AC_FUNC_MBRTOWC                                 FAILED (acfunctions.at:25)
458: AC_FUNC_MEMCMP                                  FAILED (acfunctions.at:26)
459: AC_FUNC_MKTIME                                  FAILED (acfunctions.at:27)
460: AC_FUNC_MMAP                                    FAILED (acfunctions.at:28)
461: AC_FUNC_OBSTACK                                 FAILED (acfunctions.at:29)
462: AC_FUNC_REALLOC                                 FAILED (acfunctions.at:30)
463: AC_FUNC_SELECT_ARGTYPES                         FAILED (acfunctions.at:31)
464: AC_FUNC_SETPGRP                                 FAILED (acfunctions.at:32)
465: AC_FUNC_STAT                                    FAILED (acfunctions.at:33)
466: AC_FUNC_STRCOLL                                 FAILED (acfunctions.at:34)
467: AC_FUNC_STRERROR_R                              FAILED (acfunctions.at:35)
468: AC_FUNC_STRFTIME                                FAILED (acfunctions.at:36)
469: AC_FUNC_STRNLEN                                 FAILED (acfunctions.at:37)
470: AC_FUNC_STRTOD                                  FAILED (acfunctions.at:38)
471: AC_FUNC_STRTOLD                                 FAILED (acfunctions.at:39)
472: AC_FUNC_UTIME_NULL                              FAILED (acfunctions.at:40)
473: AC_FUNC_VPRINTF                                 FAILED (acfunctions.at:41)

Testing autoconf/libs macros.

474: AC_HAVE_LIBRARY                                 FAILED (aclibs.at:15)

Compatibility with other tools.

475: Libtool                                         skipped (foreign.at:33)
476: shtool                                          FAILED (foreign.at:130)

Autoscan.

477: autoscan                                        ok

## ------------- ##
## Test results. ##
## ------------- ##

ERROR: 435 tests were run,
206 failed (4 expected failures).
42 tests were skipped.
## -------------------------- ##
## testsuite.log was created. ##
## -------------------------- ##

Please send `tests/testsuite.log' and all information you think might help:

   To: <bug-autoconf@gnu.org>
   Subject: [GNU Autoconf 2.67] testsuite: 14 28 204 220 221 223 224 225 227 229 230 231 232 233 234 235 236 237 238 239 241 243 244 257 259 260 261 263 264 265 268 269 270 271 274 275 276 277 278 279 280 281 282 283 284 285 286 287 288 289 290 291 292 293 319 320 325 326 328 329 330 331 332 333 334 335 336 337 338 339 340 341 342 343 344 345 346 347 349 351 354 355 356 357 358 359 360 361 362 363 364 365 366 367 368 369 370 371 372 373 374 375 376 377 378 379 380 381 382 383 384 385 386 387 388 389 390 391 392 393 394 395 396 397 398 399 400 401 402 403 404 405 406 407 408 409 410 411 412 413 414 415 416 417 418 419 420 421 422 423 424 425 426 427 428 429 430 431 432 433 434 435 436 437 438 439 440 441 442 443 444 445 446 447 448 449 450 451 452 453 454 455 456 457 458 459 460 461 462 463 464 465 466 467 468 469 470 471 472 473 474 476 failed

You may investigate any problem if you feel able to do so, in which
case the test suite provides a good starting point.  Its output may
be found below `tests/testsuite.dir'.

make[3]: *** [check-local] Error 1
make[3]: Leaving directory `/home/services/builder/rpm/BUILD/autoconf-2.67/tests'
make[2]: *** [check-am] Error 2
make[2]: Leaving directory `/home/services/builder/rpm/BUILD/autoconf-2.67/tests'
make[1]: *** [check-recursive] Error 1
make[1]: Leaving directory `/home/services/builder/rpm/BUILD/autoconf-2.67'
make: *** [check] Error 2
error: Bad exit status from /tmp/B.dfca1b/rpm-tmp.47098 (%build)


RPM build errors:
    Bad exit status from /tmp/B.dfca1b/rpm-tmp.47098 (%build)
ended at: Sun Mar  4 19:18:11 2012, done in 0:08:45.837181
error: No files produced.
Begin-PLD-Builder-Info
Build-Time: user:226.33s sys:81.15s real:547.96s (faults io:39 non-io:40541309)

End-PLD-Builder-Info
[Back to list of logs] [View rpm -qa of builder]