FailedOk

th/SRPMS[OK]
th/x32[OK]
th/i686[OK]
th/x86_64[OK]

ac/SRPMS[OK]
ac/i386[OK]
ac/i586[OK]
ac/i686[OK]
ac/alpha[OK]
ac/amd64[OK]
ac/athlon[OK]
ac/ppc[OK]
ac/sparc[OK]
ac/sparc64[OK]

Advanced Search
main()
Powered by PLD Linux
(c) 2002-2018 PLD Team
$Revision: 1.37 $
Powered by Star Treck.
Your IP: 54.225.55.174

autoconf bb1520a2-27c2-4930-ae64-a90a6b22fbc3

Status:Failed
Source URL:ftp://buildlogs.pld-linux.org/ac/amd64/FAIL/autoconf,bb1520a2-27c2-4930-ae64-a90a6b22fbc3.bz2
text/plain URL:View!
rpm -qa of builder:View!
Date:2010/07/08 13:26:30
Runtime:00

Toc:

  • prep
  • Executing(%prep): /bin/sh -e /tmp/B.4eb3fe/rpm-tmp.23120
  • build
  • Executing(%build): /bin/sh -e /tmp/B.4eb3fe/rpm-tmp.16116
  • make check
  • + /usr/bin/make -j1 check
  • error 1
  • ERROR: 461 tests were run,
  • error 2
  • make[3]: *** [check-local] Error 1
  • error 3
  • make[2]: *** [check-am] Error 2
  • error 4
  • make[1]: *** [check-recursive] Error 1
  • error 5
  • error: Bad exit status from /tmp/B.4eb3fe/rpm-tmp.16116 (%build)
  • error 6
  • RPM build errors:
  • error 7
  • error: No files produced.

Content:

request from: glen
checking if we should skip the build
started at: Thu Jul  8 13:15:21 2010
fetching http://ep09.pld-linux.org/~buildsrc/srpms/bb1520a2-27c2-4930-ae64-a90a6b22fbc3/autoconf-2.66-1.1.src.rpm
fetched 1182243 bytes, 1145.4 K/s
installing srpm: autoconf-2.66-1.1.src.rpm
Building target platforms: amd64-pld-linux
checking BuildConflict-ing packages
no BuildConflicts found
checking BR
no BR needed
building RPM using: echo build-id: bb1520a2-27c2-4930-ae64-a90a6b22fbc3; cd rpm/SPECS; TMPDIR=/tmp/B.4eb3fe exec nice -n 19 rpmbuild -bb --define '_smp_mflags -j1'  --target amd64-pld-linux   autoconf.spec
build-id: bb1520a2-27c2-4930-ae64-a90a6b22fbc3
Building target platforms: amd64-pld-linux
Executing(%prep): /bin/sh -e /tmp/B.4eb3fe/rpm-tmp.23120
+ umask 022
+ cd /home/services/builder/rpm/BUILD
+ cd /home/services/builder/rpm/BUILD
+ rm -rf autoconf-2.66
+ tar -xf /home/services/builder/rpm/SOURCES/autoconf-2.66.tar.xz
+ cd autoconf-2.66
+ /bin/id -u
+ [ 182 = 0 ]
+ true .
+ /bin/chmod -Rf a+rX,u+w,g-w,o-w .
+ echo Patch #0 (autoconf-mawk.patch):
Patch #0 (autoconf-mawk.patch):
+ patch -p1 -s
+ < /home/services/builder/rpm/SOURCES/autoconf-mawk.patch 
+ echo Patch #1 (autoconf-info.patch):
Patch #1 (autoconf-info.patch):
+ patch -p1 -s
+ < /home/services/builder/rpm/SOURCES/autoconf-info.patch 
+ echo Patch #2 (autoconf-AC_EGREP.patch):
Patch #2 (autoconf-AC_EGREP.patch):
+ patch -p1 -s
+ < /home/services/builder/rpm/SOURCES/autoconf-AC_EGREP.patch 
+ echo Patch #3 (autoconf-cxxcpp-warnonly.patch):
Patch #3 (autoconf-cxxcpp-warnonly.patch):
+ patch -p1 -s
+ < /home/services/builder/rpm/SOURCES/autoconf-cxxcpp-warnonly.patch 
+ exit 0
Executing(%build): /bin/sh -e /tmp/B.4eb3fe/rpm-tmp.16116
+ umask 022
+ cd /home/services/builder/rpm/BUILD
+ cd autoconf-2.66
+ ./configure LDFLAGS=-Wl,--as-needed  CFLAGS=-O2  CXXFLAGS=-O2  FFLAGS=-O2  FCFLAGS=-O2  CPPFLAGS= CC=amd64-pld-linux-gcc CXX=amd64-pld-linux-g++ --host=noarch-pld-linux --build=noarch-pld-linux --prefix=/usr --exec-prefix=/usr --bindir=/usr/bin --sbindir=/usr/sbin --sysconfdir=/etc --datadir=/usr/share --includedir=/usr/include --libdir=/usr/share --libexecdir=/usr/lib64 --localstatedir=/var --sharedstatedir=/var/lib --mandir=/usr/share/man --infodir=/usr/share/info --x-libraries=/usr/X11R6/lib64
checking for a BSD-compatible install... /usr/bin/install -c
checking whether build environment is sane... yes
checking for a thread-safe mkdir -p... /bin/mkdir -p
checking for mawk... mawk
checking whether make sets $(MAKE)... yes
checking whether /bin/sh -n is known to work... yes
checking for characters that cannot appear in file names... none
checking whether directories can have trailing spaces... yes
checking for expr... /usr/bin/expr
checking for GNU M4 that supports accurate traces... /usr/bin/m4
checking whether /usr/bin/m4 accepts --gnu... yes
checking how m4 supports trace files... --debugfile
checking for perl... /usr/bin/perl
checking whether /usr/bin/perl Fcntl::flock is implemented... yes
checking for emacs... emacs
checking whether emacs is sufficiently recent... yes
checking for emacs... emacs
checking where .elc files should go... ${datarootdir}/emacs/site-lisp
checking for grep that handles long lines and -e... /bin/grep
checking for egrep... /bin/grep -E
checking for a sed that does not truncate output... /bin/sed
checking whether make is case sensitive... yes
configure: creating ./config.status
config.status: creating tests/Makefile
config.status: creating tests/atlocal
config.status: creating man/Makefile
config.status: creating lib/emacs/Makefile
config.status: creating Makefile
config.status: creating doc/Makefile
config.status: creating lib/Makefile
config.status: creating lib/Autom4te/Makefile
config.status: creating lib/autoscan/Makefile
config.status: creating lib/m4sugar/Makefile
config.status: creating lib/autoconf/Makefile
config.status: creating lib/autotest/Makefile
config.status: creating bin/Makefile
config.status: executing tests/atconfig commands
+ /usr/bin/make -j1 -j1
/usr/bin/make  all-recursive
make[1]: Entering directory `/home/services/builder/rpm/BUILD/autoconf-2.66'
Making all in bin
make[2]: Entering directory `/home/services/builder/rpm/BUILD/autoconf-2.66/bin'
rm -f autom4te autom4te.tmp
srcdir=''; \
	  test -f ./autom4te.in || srcdir=./; \
	  sed -e 's|@SHELL[@]|/bin/sh|g' -e 's|@PERL[@]|/usr/bin/perl|g' -e 's|@PERL_FLOCK[@]|yes|g' -e 's|@bindir[@]|/usr/bin|g' -e 's|@pkgdatadir[@]|/usr/share/autoconf|g' -e 's|@prefix[@]|/usr|g' -e 's|@autoconf-name[@]|'`echo autoconf | sed 's,x,x,'`'|g' -e 's|@autoheader-name[@]|'`echo autoheader | sed 's,x,x,'`'|g' -e 's|@autom4te-name[@]|'`echo autom4te | sed 's,x,x,'`'|g' -e 's|@M4[@]|/usr/bin/m4|g' -e 's|@M4_DEBUGFILE[@]|--debugfile|g' -e 's|@M4_GNU[@]|--gnu|g' -e 's|@AWK[@]|mawk|g' -e 's|@RELEASE_YEAR[@]|'`sed 's/^\([0-9][0-9][0-9][0-9]\).*/\1/;q' ../ChangeLog`'|g' -e 's|@VERSION[@]|2.66|g' -e 's|@PACKAGE_NAME[@]|GNU Autoconf|g' -e 's|@configure_input[@]|Generated from autom4te.in; do not edit by hand.|g' ${srcdir}autom4te.in >autom4te.tmp
chmod +x autom4te.tmp
chmod a-w autom4te.tmp
mv autom4te.tmp autom4te
cd ../lib && /usr/bin/make  autom4te.cfg
make[3]: Entering directory `/home/services/builder/rpm/BUILD/autoconf-2.66/lib'
rm -f autom4te.cfg autom4te.tmp
sed -e 's|@SHELL[@]|/bin/sh|g' -e 's|@PERL[@]|/usr/bin/perl|g' -e 's|@bindir[@]|/usr/bin|g' -e 's|@pkgdatadir[@]|/usr/share/autoconf|g' -e 's|@prefix[@]|/usr|g' -e 's|@autoconf-name[@]|'`echo autoconf | sed 's,x,x,'`'|g' -e 's|@autoheader-name[@]|'`echo autoheader | sed 's,x,x,'`'|g' -e 's|@autom4te-name[@]|'`echo autom4te | sed 's,x,x,'`'|g' -e 's|@M4[@]|/usr/bin/m4|g' -e 's|@AWK[@]|mawk|g' -e 's|@VERSION[@]|2.66|g' -e 's|@PACKAGE_NAME[@]|GNU Autoconf|g' ./autom4te.in >autom4te.tmp
chmod a-w autom4te.tmp
mv autom4te.tmp autom4te.cfg
make[3]: Leaving directory `/home/services/builder/rpm/BUILD/autoconf-2.66/lib'
cd ../lib/m4sugar && /usr/bin/make  version.m4
make[3]: Entering directory `/home/services/builder/rpm/BUILD/autoconf-2.66/lib/m4sugar'
:;{ \
	  echo '# This file is part of -*- Autoconf -*-.' && \
	  echo '# Version of Autoconf.' && \
	  echo '# Copyright (C) 1999, 2000, 2001, 2002, 2006, 2007, 2009' && \
	  echo '# Free Software Foundation, Inc.' && \
	  echo  &&\
	  echo 'm4_define([m4_PACKAGE_NAME],      [GNU Autoconf])' && \
	  echo 'm4_define([m4_PACKAGE_TARNAME],   [autoconf])' && \
	  echo 'm4_define([m4_PACKAGE_VERSION],   [2.66])' && \
	  echo 'm4_define([m4_PACKAGE_STRING],    [GNU Autoconf 2.66])' && \
	  echo 'm4_define([m4_PACKAGE_BUGREPORT], [bug-autoconf@gnu.org])' && \
	  echo 'm4_define([m4_PACKAGE_URL],       [http://www.gnu.org/software/autoconf/])' && \
	  echo 'm4_define([m4_PACKAGE_YEAR],      ['`sed 's/^\([0-9][0-9][0-9][0-9]\).*/\1/;q' ../../ChangeLog`'])'; \
	} > version.m4-t
mv version.m4-t version.m4
make[3]: Leaving directory `/home/services/builder/rpm/BUILD/autoconf-2.66/lib/m4sugar'
autom4te_perllibdir='..'/lib AUTOM4TE_CFG='../lib/autom4te.cfg'         ../bin/autom4te -B '..'/lib -B '..'/lib         --language M4sh --cache '' --melt ./autoconf.as -o autoconf.in
rm -f autoconf autoconf.tmp
srcdir=''; \
	  test -f ./autoconf.in || srcdir=./; \
	  sed -e 's|@SHELL[@]|/bin/sh|g' -e 's|@PERL[@]|/usr/bin/perl|g' -e 's|@PERL_FLOCK[@]|yes|g' -e 's|@bindir[@]|/usr/bin|g' -e 's|@pkgdatadir[@]|/usr/share/autoconf|g' -e 's|@prefix[@]|/usr|g' -e 's|@autoconf-name[@]|'`echo autoconf | sed 's,x,x,'`'|g' -e 's|@autoheader-name[@]|'`echo autoheader | sed 's,x,x,'`'|g' -e 's|@autom4te-name[@]|'`echo autom4te | sed 's,x,x,'`'|g' -e 's|@M4[@]|/usr/bin/m4|g' -e 's|@M4_DEBUGFILE[@]|--debugfile|g' -e 's|@M4_GNU[@]|--gnu|g' -e 's|@AWK[@]|mawk|g' -e 's|@RELEASE_YEAR[@]|'`sed 's/^\([0-9][0-9][0-9][0-9]\).*/\1/;q' ../ChangeLog`'|g' -e 's|@VERSION[@]|2.66|g' -e 's|@PACKAGE_NAME[@]|GNU Autoconf|g' -e 's|@configure_input[@]|Generated from autoconf.in; do not edit by hand.|g' ${srcdir}autoconf.in >autoconf.tmp
chmod +x autoconf.tmp
chmod a-w autoconf.tmp
mv autoconf.tmp autoconf
rm -f autoheader autoheader.tmp
srcdir=''; \
	  test -f ./autoheader.in || srcdir=./; \
	  sed -e 's|@SHELL[@]|/bin/sh|g' -e 's|@PERL[@]|/usr/bin/perl|g' -e 's|@PERL_FLOCK[@]|yes|g' -e 's|@bindir[@]|/usr/bin|g' -e 's|@pkgdatadir[@]|/usr/share/autoconf|g' -e 's|@prefix[@]|/usr|g' -e 's|@autoconf-name[@]|'`echo autoconf | sed 's,x,x,'`'|g' -e 's|@autoheader-name[@]|'`echo autoheader | sed 's,x,x,'`'|g' -e 's|@autom4te-name[@]|'`echo autom4te | sed 's,x,x,'`'|g' -e 's|@M4[@]|/usr/bin/m4|g' -e 's|@M4_DEBUGFILE[@]|--debugfile|g' -e 's|@M4_GNU[@]|--gnu|g' -e 's|@AWK[@]|mawk|g' -e 's|@RELEASE_YEAR[@]|'`sed 's/^\([0-9][0-9][0-9][0-9]\).*/\1/;q' ../ChangeLog`'|g' -e 's|@VERSION[@]|2.66|g' -e 's|@PACKAGE_NAME[@]|GNU Autoconf|g' -e 's|@configure_input[@]|Generated from autoheader.in; do not edit by hand.|g' ${srcdir}autoheader.in >autoheader.tmp
chmod +x autoheader.tmp
chmod a-w autoheader.tmp
mv autoheader.tmp autoheader
rm -f autoreconf autoreconf.tmp
srcdir=''; \
	  test -f ./autoreconf.in || srcdir=./; \
	  sed -e 's|@SHELL[@]|/bin/sh|g' -e 's|@PERL[@]|/usr/bin/perl|g' -e 's|@PERL_FLOCK[@]|yes|g' -e 's|@bindir[@]|/usr/bin|g' -e 's|@pkgdatadir[@]|/usr/share/autoconf|g' -e 's|@prefix[@]|/usr|g' -e 's|@autoconf-name[@]|'`echo autoconf | sed 's,x,x,'`'|g' -e 's|@autoheader-name[@]|'`echo autoheader | sed 's,x,x,'`'|g' -e 's|@autom4te-name[@]|'`echo autom4te | sed 's,x,x,'`'|g' -e 's|@M4[@]|/usr/bin/m4|g' -e 's|@M4_DEBUGFILE[@]|--debugfile|g' -e 's|@M4_GNU[@]|--gnu|g' -e 's|@AWK[@]|mawk|g' -e 's|@RELEASE_YEAR[@]|'`sed 's/^\([0-9][0-9][0-9][0-9]\).*/\1/;q' ../ChangeLog`'|g' -e 's|@VERSION[@]|2.66|g' -e 's|@PACKAGE_NAME[@]|GNU Autoconf|g' -e 's|@configure_input[@]|Generated from autoreconf.in; do not edit by hand.|g' ${srcdir}autoreconf.in >autoreconf.tmp
chmod +x autoreconf.tmp
chmod a-w autoreconf.tmp
mv autoreconf.tmp autoreconf
rm -f ifnames ifnames.tmp
srcdir=''; \
	  test -f ./ifnames.in || srcdir=./; \
	  sed -e 's|@SHELL[@]|/bin/sh|g' -e 's|@PERL[@]|/usr/bin/perl|g' -e 's|@PERL_FLOCK[@]|yes|g' -e 's|@bindir[@]|/usr/bin|g' -e 's|@pkgdatadir[@]|/usr/share/autoconf|g' -e 's|@prefix[@]|/usr|g' -e 's|@autoconf-name[@]|'`echo autoconf | sed 's,x,x,'`'|g' -e 's|@autoheader-name[@]|'`echo autoheader | sed 's,x,x,'`'|g' -e 's|@autom4te-name[@]|'`echo autom4te | sed 's,x,x,'`'|g' -e 's|@M4[@]|/usr/bin/m4|g' -e 's|@M4_DEBUGFILE[@]|--debugfile|g' -e 's|@M4_GNU[@]|--gnu|g' -e 's|@AWK[@]|mawk|g' -e 's|@RELEASE_YEAR[@]|'`sed 's/^\([0-9][0-9][0-9][0-9]\).*/\1/;q' ../ChangeLog`'|g' -e 's|@VERSION[@]|2.66|g' -e 's|@PACKAGE_NAME[@]|GNU Autoconf|g' -e 's|@configure_input[@]|Generated from ifnames.in; do not edit by hand.|g' ${srcdir}ifnames.in >ifnames.tmp
chmod +x ifnames.tmp
chmod a-w ifnames.tmp
mv ifnames.tmp ifnames
rm -f autoscan autoscan.tmp
srcdir=''; \
	  test -f ./autoscan.in || srcdir=./; \
	  sed -e 's|@SHELL[@]|/bin/sh|g' -e 's|@PERL[@]|/usr/bin/perl|g' -e 's|@PERL_FLOCK[@]|yes|g' -e 's|@bindir[@]|/usr/bin|g' -e 's|@pkgdatadir[@]|/usr/share/autoconf|g' -e 's|@prefix[@]|/usr|g' -e 's|@autoconf-name[@]|'`echo autoconf | sed 's,x,x,'`'|g' -e 's|@autoheader-name[@]|'`echo autoheader | sed 's,x,x,'`'|g' -e 's|@autom4te-name[@]|'`echo autom4te | sed 's,x,x,'`'|g' -e 's|@M4[@]|/usr/bin/m4|g' -e 's|@M4_DEBUGFILE[@]|--debugfile|g' -e 's|@M4_GNU[@]|--gnu|g' -e 's|@AWK[@]|mawk|g' -e 's|@RELEASE_YEAR[@]|'`sed 's/^\([0-9][0-9][0-9][0-9]\).*/\1/;q' ../ChangeLog`'|g' -e 's|@VERSION[@]|2.66|g' -e 's|@PACKAGE_NAME[@]|GNU Autoconf|g' -e 's|@configure_input[@]|Generated from autoscan.in; do not edit by hand.|g' ${srcdir}autoscan.in >autoscan.tmp
chmod +x autoscan.tmp
chmod a-w autoscan.tmp
mv autoscan.tmp autoscan
rm -f autoupdate autoupdate.tmp
srcdir=''; \
	  test -f ./autoupdate.in || srcdir=./; \
	  sed -e 's|@SHELL[@]|/bin/sh|g' -e 's|@PERL[@]|/usr/bin/perl|g' -e 's|@PERL_FLOCK[@]|yes|g' -e 's|@bindir[@]|/usr/bin|g' -e 's|@pkgdatadir[@]|/usr/share/autoconf|g' -e 's|@prefix[@]|/usr|g' -e 's|@autoconf-name[@]|'`echo autoconf | sed 's,x,x,'`'|g' -e 's|@autoheader-name[@]|'`echo autoheader | sed 's,x,x,'`'|g' -e 's|@autom4te-name[@]|'`echo autom4te | sed 's,x,x,'`'|g' -e 's|@M4[@]|/usr/bin/m4|g' -e 's|@M4_DEBUGFILE[@]|--debugfile|g' -e 's|@M4_GNU[@]|--gnu|g' -e 's|@AWK[@]|mawk|g' -e 's|@RELEASE_YEAR[@]|'`sed 's/^\([0-9][0-9][0-9][0-9]\).*/\1/;q' ../ChangeLog`'|g' -e 's|@VERSION[@]|2.66|g' -e 's|@PACKAGE_NAME[@]|GNU Autoconf|g' -e 's|@configure_input[@]|Generated from autoupdate.in; do not edit by hand.|g' ${srcdir}autoupdate.in >autoupdate.tmp
chmod +x autoupdate.tmp
chmod a-w autoupdate.tmp
mv autoupdate.tmp autoupdate
make[2]: Leaving directory `/home/services/builder/rpm/BUILD/autoconf-2.66/bin'
Making all in .
make[2]: Entering directory `/home/services/builder/rpm/BUILD/autoconf-2.66'
/bin/sh /home/services/builder/rpm/BUILD/autoconf-2.66/build-aux/missing --run makeinfo --no-headers --no-validate --no-split  --plaintext -o INSTALL \
	  ./doc/install.texi
make[2]: Leaving directory `/home/services/builder/rpm/BUILD/autoconf-2.66'
Making all in lib
make[2]: Entering directory `/home/services/builder/rpm/BUILD/autoconf-2.66/lib'
Making all in Autom4te
make[3]: Entering directory `/home/services/builder/rpm/BUILD/autoconf-2.66/lib/Autom4te'
make[3]: Nothing to be done for `all'.
make[3]: Leaving directory `/home/services/builder/rpm/BUILD/autoconf-2.66/lib/Autom4te'
Making all in m4sugar
make[3]: Entering directory `/home/services/builder/rpm/BUILD/autoconf-2.66/lib/m4sugar'
autom4te_perllibdir='../..'/lib AUTOM4TE_CFG='../../lib/autom4te.cfg'         ../../bin/autom4te -B '../..'/lib -B '../..'/lib        				\
		--language=m4sugar			\
		--freeze			\
		--output=m4sugar.m4f
autom4te_perllibdir='../..'/lib AUTOM4TE_CFG='../../lib/autom4te.cfg'         ../../bin/autom4te -B '../..'/lib -B '../..'/lib        				\
		--language=m4sh			\
		--freeze			\
		--output=m4sh.m4f
make[3]: Leaving directory `/home/services/builder/rpm/BUILD/autoconf-2.66/lib/m4sugar'
Making all in autoconf
make[3]: Entering directory `/home/services/builder/rpm/BUILD/autoconf-2.66/lib/autoconf'
autom4te_perllibdir='../..'/lib AUTOM4TE_CFG='../../lib/autom4te.cfg'         ../../bin/autom4te -B '../..'/lib -B '../..'/lib        				\
		--language=autoconf			\
		--freeze			\
		--output=autoconf.m4f
make[3]: Leaving directory `/home/services/builder/rpm/BUILD/autoconf-2.66/lib/autoconf'
Making all in autotest
make[3]: Entering directory `/home/services/builder/rpm/BUILD/autoconf-2.66/lib/autotest'
autom4te_perllibdir='../..'/lib AUTOM4TE_CFG='../../lib/autom4te.cfg'         ../../bin/autom4te -B '../..'/lib -B '../..'/lib        				\
		--language=autotest			\
		--freeze			\
		--output=autotest.m4f
make[3]: Leaving directory `/home/services/builder/rpm/BUILD/autoconf-2.66/lib/autotest'
Making all in autoscan
make[3]: Entering directory `/home/services/builder/rpm/BUILD/autoconf-2.66/lib/autoscan'
echo '# Automatically Generated: do not edit this file' >autoscan.list
sed '/^[#]/!q' ./autoscan.pre                  >>autoscan.list
( \
	  sed -n '/^[^#]/p' ./autoscan.pre; \
	  autom4te_perllibdir='../..'/lib AUTOM4TE_CFG='../../lib/autom4te.cfg'         ../../bin/autom4te -B '../..'/lib -B '../..'/lib         --cache '' -M -l autoconf -t'AN_OUTPUT:$1: $2		$3' \
	) | LC_ALL=C sort                                      >>autoscan.list
make[3]: Leaving directory `/home/services/builder/rpm/BUILD/autoconf-2.66/lib/autoscan'
Making all in emacs
make[3]: Entering directory `/home/services/builder/rpm/BUILD/autoconf-2.66/lib/emacs'
WARNING: Warnings can be ignored. :-)
if test "emacs" != no; then \
	  set x; \
	  list='autoconf-mode.el autotest-mode.el'; for p in $list; do \
	    if test -f "$p"; then d=; else d="./"; fi; \
	    set x "$@" "$d$p"; shift; \
	  done; \
	  shift; \
	  EMACS="emacs" /bin/sh ../../build-aux/elisp-comp "$@" || exit 1; \
	else : ; fi
While compiling autoconf-mode in file /home/services/builder/rpm/BUILD/autoconf-2.66/lib/emacs/elc.16738/autoconf-mode.el:
  ** assignment to free variable add-log-current-defun-function
Wrote /home/services/builder/rpm/BUILD/autoconf-2.66/lib/emacs/elc.16738/autoconf-mode.elc
While compiling autotest-mode in file /home/services/builder/rpm/BUILD/autoconf-2.66/lib/emacs/elc.16738/autotest-mode.el:
  ** assignment to free variable add-log-current-defun-function
Wrote /home/services/builder/rpm/BUILD/autoconf-2.66/lib/emacs/elc.16738/autotest-mode.elc
Done
make[3]: Leaving directory `/home/services/builder/rpm/BUILD/autoconf-2.66/lib/emacs'
make[3]: Entering directory `/home/services/builder/rpm/BUILD/autoconf-2.66/lib'
make[3]: Nothing to be done for `all-am'.
make[3]: Leaving directory `/home/services/builder/rpm/BUILD/autoconf-2.66/lib'
make[2]: Leaving directory `/home/services/builder/rpm/BUILD/autoconf-2.66/lib'
Making all in doc
make[2]: Entering directory `/home/services/builder/rpm/BUILD/autoconf-2.66/doc'
Updating ./version.texi
restore=: && backupdir=".am$$" && \
	am__cwd=`pwd` && CDPATH="${ZSH_VERSION+.}:" && cd . && \
	rm -rf $backupdir && mkdir $backupdir && \
	if (/bin/sh /home/services/builder/rpm/BUILD/autoconf-2.66/build-aux/missing --run makeinfo --version) >/dev/null 2>&1; then \
	  for f in autoconf.info autoconf.info-[0-9] autoconf.info-[0-9][0-9] autoconf.i[0-9] autoconf.i[0-9][0-9]; do \
	    if test -f $f; then mv $f $backupdir; restore=mv; else :; fi; \
	  done; \
	else :; fi && \
	cd "$am__cwd"; \
	if /bin/sh /home/services/builder/rpm/BUILD/autoconf-2.66/build-aux/missing --run makeinfo --no-split  -I . \
	 -o autoconf.info autoconf.texi; \
	then \
	  rc=0; \
	  CDPATH="${ZSH_VERSION+.}:" && cd .; \
	else \
	  rc=$?; \
	  CDPATH="${ZSH_VERSION+.}:" && cd . && \
	  $restore $backupdir/* `echo "./autoconf.info" | sed 's|[^/]*$||'`; \
	fi; \
	rm -rf $backupdir; exit $rc
restore=: && backupdir=".am$$" && \
	am__cwd=`pwd` && CDPATH="${ZSH_VERSION+.}:" && cd . && \
	rm -rf $backupdir && mkdir $backupdir && \
	if (/bin/sh /home/services/builder/rpm/BUILD/autoconf-2.66/build-aux/missing --run makeinfo --version) >/dev/null 2>&1; then \
	  for f in standards.info standards.info-[0-9] standards.info-[0-9][0-9] standards.i[0-9] standards.i[0-9][0-9]; do \
	    if test -f $f; then mv $f $backupdir; restore=mv; else :; fi; \
	  done; \
	else :; fi && \
	cd "$am__cwd"; \
	if /bin/sh /home/services/builder/rpm/BUILD/autoconf-2.66/build-aux/missing --run makeinfo --no-split  -I . \
	 -o standards.info standards.texi; \
	then \
	  rc=0; \
	  CDPATH="${ZSH_VERSION+.}:" && cd .; \
	else \
	  rc=$?; \
	  CDPATH="${ZSH_VERSION+.}:" && cd . && \
	  $restore $backupdir/* `echo "./standards.info" | sed 's|[^/]*$||'`; \
	fi; \
	rm -rf $backupdir; exit $rc
make[2]: Leaving directory `/home/services/builder/rpm/BUILD/autoconf-2.66/doc'
Making all in tests
make[2]: Entering directory `/home/services/builder/rpm/BUILD/autoconf-2.66/tests'
autom4te_perllibdir='..'/lib AUTOM4TE_CFG='../lib/autom4te.cfg'         ../bin/autom4te -B '..'/lib -B '..'/lib         --language=M4sh ./wrapper.as -o wrapper.in
rm -f autoconf autoconf.tmp
input=wrapper.in; \
	sed -e 's|@wrap_program[@]|autoconf|g' -e 's|@abs_top_srcdir[@]|/home/services/builder/rpm/BUILD/autoconf-2.66|g' -e 's|@abs_top_builddir[@]|/home/services/builder/rpm/BUILD/autoconf-2.66|g' -e "s|@configure_input[@]|Generated from $input.|g" wrapper.in >autoconf.tmp
chmod +x autoconf.tmp
chmod a-w autoconf.tmp
mv -f autoconf.tmp autoconf
rm -f autoheader autoheader.tmp
input=wrapper.in; \
	sed -e 's|@wrap_program[@]|autoheader|g' -e 's|@abs_top_srcdir[@]|/home/services/builder/rpm/BUILD/autoconf-2.66|g' -e 's|@abs_top_builddir[@]|/home/services/builder/rpm/BUILD/autoconf-2.66|g' -e "s|@configure_input[@]|Generated from $input.|g" wrapper.in >autoheader.tmp
chmod +x autoheader.tmp
chmod a-w autoheader.tmp
mv -f autoheader.tmp autoheader
rm -f autom4te autom4te.tmp
input=wrapper.in; \
	sed -e 's|@wrap_program[@]|autom4te|g' -e 's|@abs_top_srcdir[@]|/home/services/builder/rpm/BUILD/autoconf-2.66|g' -e 's|@abs_top_builddir[@]|/home/services/builder/rpm/BUILD/autoconf-2.66|g' -e "s|@configure_input[@]|Generated from $input.|g" wrapper.in >autom4te.tmp
chmod +x autom4te.tmp
chmod a-w autom4te.tmp
mv -f autom4te.tmp autom4te
rm -f autoreconf autoreconf.tmp
input=wrapper.in; \
	sed -e 's|@wrap_program[@]|autoreconf|g' -e 's|@abs_top_srcdir[@]|/home/services/builder/rpm/BUILD/autoconf-2.66|g' -e 's|@abs_top_builddir[@]|/home/services/builder/rpm/BUILD/autoconf-2.66|g' -e "s|@configure_input[@]|Generated from $input.|g" wrapper.in >autoreconf.tmp
chmod +x autoreconf.tmp
chmod a-w autoreconf.tmp
mv -f autoreconf.tmp autoreconf
rm -f autoscan autoscan.tmp
input=wrapper.in; \
	sed -e 's|@wrap_program[@]|autoscan|g' -e 's|@abs_top_srcdir[@]|/home/services/builder/rpm/BUILD/autoconf-2.66|g' -e 's|@abs_top_builddir[@]|/home/services/builder/rpm/BUILD/autoconf-2.66|g' -e "s|@configure_input[@]|Generated from $input.|g" wrapper.in >autoscan.tmp
chmod +x autoscan.tmp
chmod a-w autoscan.tmp
mv -f autoscan.tmp autoscan
rm -f autoupdate autoupdate.tmp
input=wrapper.in; \
	sed -e 's|@wrap_program[@]|autoupdate|g' -e 's|@abs_top_srcdir[@]|/home/services/builder/rpm/BUILD/autoconf-2.66|g' -e 's|@abs_top_builddir[@]|/home/services/builder/rpm/BUILD/autoconf-2.66|g' -e "s|@configure_input[@]|Generated from $input.|g" wrapper.in >autoupdate.tmp
chmod +x autoupdate.tmp
chmod a-w autoupdate.tmp
mv -f autoupdate.tmp autoupdate
rm -f ifnames ifnames.tmp
input=wrapper.in; \
	sed -e 's|@wrap_program[@]|ifnames|g' -e 's|@abs_top_srcdir[@]|/home/services/builder/rpm/BUILD/autoconf-2.66|g' -e 's|@abs_top_builddir[@]|/home/services/builder/rpm/BUILD/autoconf-2.66|g' -e "s|@configure_input[@]|Generated from $input.|g" wrapper.in >ifnames.tmp
chmod +x ifnames.tmp
chmod a-w ifnames.tmp
mv -f ifnames.tmp ifnames
make[2]: Leaving directory `/home/services/builder/rpm/BUILD/autoconf-2.66/tests'
Making all in man
make[2]: Entering directory `/home/services/builder/rpm/BUILD/autoconf-2.66/man'
make[2]: Nothing to be done for `all'.
make[2]: Leaving directory `/home/services/builder/rpm/BUILD/autoconf-2.66/man'
make[1]: Leaving directory `/home/services/builder/rpm/BUILD/autoconf-2.66'
+ /usr/bin/make -j1 check
/usr/bin/make  check-recursive
make[1]: Entering directory `/home/services/builder/rpm/BUILD/autoconf-2.66'
Making check in bin
make[2]: Entering directory `/home/services/builder/rpm/BUILD/autoconf-2.66/bin'
make[2]: Nothing to be done for `check'.
make[2]: Leaving directory `/home/services/builder/rpm/BUILD/autoconf-2.66/bin'
Making check in .
make[2]: Entering directory `/home/services/builder/rpm/BUILD/autoconf-2.66'
make[2]: Nothing to be done for `check-am'.
make[2]: Leaving directory `/home/services/builder/rpm/BUILD/autoconf-2.66'
Making check in lib
make[2]: Entering directory `/home/services/builder/rpm/BUILD/autoconf-2.66/lib'
Making check in Autom4te
make[3]: Entering directory `/home/services/builder/rpm/BUILD/autoconf-2.66/lib/Autom4te'
make[3]: Nothing to be done for `check'.
make[3]: Leaving directory `/home/services/builder/rpm/BUILD/autoconf-2.66/lib/Autom4te'
Making check in m4sugar
make[3]: Entering directory `/home/services/builder/rpm/BUILD/autoconf-2.66/lib/m4sugar'
/usr/bin/make  check-local
make[4]: Entering directory `/home/services/builder/rpm/BUILD/autoconf-2.66/lib/m4sugar'
make[4]: Leaving directory `/home/services/builder/rpm/BUILD/autoconf-2.66/lib/m4sugar'
make[3]: Leaving directory `/home/services/builder/rpm/BUILD/autoconf-2.66/lib/m4sugar'
Making check in autoconf
make[3]: Entering directory `/home/services/builder/rpm/BUILD/autoconf-2.66/lib/autoconf'
/usr/bin/make  check-local
make[4]: Entering directory `/home/services/builder/rpm/BUILD/autoconf-2.66/lib/autoconf'
make[4]: Leaving directory `/home/services/builder/rpm/BUILD/autoconf-2.66/lib/autoconf'
make[3]: Leaving directory `/home/services/builder/rpm/BUILD/autoconf-2.66/lib/autoconf'
Making check in autotest
make[3]: Entering directory `/home/services/builder/rpm/BUILD/autoconf-2.66/lib/autotest'
/usr/bin/make  check-local
make[4]: Entering directory `/home/services/builder/rpm/BUILD/autoconf-2.66/lib/autotest'
make[4]: Leaving directory `/home/services/builder/rpm/BUILD/autoconf-2.66/lib/autotest'
make[3]: Leaving directory `/home/services/builder/rpm/BUILD/autoconf-2.66/lib/autotest'
Making check in autoscan
make[3]: Entering directory `/home/services/builder/rpm/BUILD/autoconf-2.66/lib/autoscan'
make[3]: Nothing to be done for `check'.
make[3]: Leaving directory `/home/services/builder/rpm/BUILD/autoconf-2.66/lib/autoscan'
Making check in emacs
make[3]: Entering directory `/home/services/builder/rpm/BUILD/autoconf-2.66/lib/emacs'
make[3]: Nothing to be done for `check'.
make[3]: Leaving directory `/home/services/builder/rpm/BUILD/autoconf-2.66/lib/emacs'
make[3]: Entering directory `/home/services/builder/rpm/BUILD/autoconf-2.66/lib'
make[3]: Nothing to be done for `check-am'.
make[3]: Leaving directory `/home/services/builder/rpm/BUILD/autoconf-2.66/lib'
make[2]: Leaving directory `/home/services/builder/rpm/BUILD/autoconf-2.66/lib'
Making check in doc
make[2]: Entering directory `/home/services/builder/rpm/BUILD/autoconf-2.66/doc'
make[2]: Nothing to be done for `check'.
make[2]: Leaving directory `/home/services/builder/rpm/BUILD/autoconf-2.66/doc'
Making check in tests
make[2]: Entering directory `/home/services/builder/rpm/BUILD/autoconf-2.66/tests'
/usr/bin/make  check-local
make[3]: Entering directory `/home/services/builder/rpm/BUILD/autoconf-2.66/tests'
:;{ \
	  echo '# Signature of the current package.' && \
	  echo 'm4_define([AT_PACKAGE_NAME],      [GNU Autoconf])' && \
	  echo 'm4_define([AT_PACKAGE_TARNAME],   [autoconf])' && \
	  echo 'm4_define([AT_PACKAGE_VERSION],   [2.66])' && \
	  echo 'm4_define([AT_PACKAGE_STRING],    [GNU Autoconf 2.66])' && \
	  echo 'm4_define([AT_PACKAGE_BUGREPORT], [bug-autoconf@gnu.org])' && \
	  echo 'm4_define([AT_PACKAGE_URL],       [http://www.gnu.org/software/autoconf/])'; \
	} > package.m4-t
mv package.m4-t package.m4
cd . && ./mktests.sh \
	  `echo " "../lib/autoconf/general.m4 ../lib/autoconf/status.m4 ../lib/autoconf/autoheader.m4 ../lib/autoconf/autoupdate.m4 ../lib/autoconf/specific.m4 ../lib/autoconf/functions.m4 ../lib/autoconf/lang.m4 ../lib/autoconf/c.m4 ../lib/autoconf/erlang.m4 ../lib/autoconf/fortran.m4 ../lib/autoconf/headers.m4 ../lib/autoconf/libs.m4 ../lib/autoconf/types.m4 ../lib/autoconf/programs.m4 | sed 's, [^ ]*/, ../lib/autoconf/,g'`
cd ../lib/autotest && /usr/bin/make  autotest.m4f
make[4]: Entering directory `/home/services/builder/rpm/BUILD/autoconf-2.66/lib/autotest'
make[4]: `autotest.m4f' is up to date.
make[4]: Leaving directory `/home/services/builder/rpm/BUILD/autoconf-2.66/lib/autotest'
autom4te_perllibdir='..'/lib AUTOM4TE_CFG='../lib/autom4te.cfg'         ../bin/autom4te -B '..'/lib -B '..'/lib         --language=autotest -I . -I . suite.at -o testsuite.tmp
mv testsuite.tmp testsuite
/bin/sh ./testsuite 
## ----------------------------- ##
## GNU Autoconf 2.66 test suite. ##
## ----------------------------- ##

Executables (autoheader, autoupdate...).

  1: Syntax of the shell scripts                     ok
  2: Syntax of the Perl scripts                      ok
  3: autom4te cache                                  ok
  4: autom4te --force                                ok
  5: autom4te and whitespace in file names           ok
  6: autom4te --trace and unusual macro names        ok
  7: autom4te --trace and whitespace                 ok
  8: autoconf --trace: user macros                   ok
  9: autoconf --trace: builtins                      ok
 10: autoconf: forbidden tokens, basic               ok
 11: autoconf: forbidden tokens, exceptions          ok
 12: autoconf: automatically allowed tokens          ok
 13: autoconf: the empty token                       ok
 14: autoconf: subdirectories                        ok
 15: autoconf: input from stdin                      ok
 16: autoconf: AC_AUTOCONF_VERSION                   ok
 17: autoconf: AC_PRESERVE_HELP_ORDER                ok
 18: ifnames                                         ok
 19: autoheader                                      ok
 20: autoheader and macros                           ok
 21: autoupdate                                      ok
 22: autoupdating AC_LINK_FILES                      ok
 23: autoupdating AC_PREREQ                          ok
 24: autoupdating AU_ALIAS                           ok
 25: autoupdating OLD to NEW                         ok
 26: autoupdating macros recursively                 expected failure (tools.at:945)
 27: autoupdating AC_HELP_STRING                     ok
 28: autoupdating with m4sugar                       ok
 29: autoupdating with m4_pushdef                    expected failure (tools.at:1027)
 30: autoupdating with AC_REQUIRE                    expected failure (tools.at:1053)
 31: autoupdating with complex quoting               expected failure (tools.at:1080)
 32: autoupdating AC_LANG_SAVE                       ok
 33: autoupdating AC_FOREACH                         ok
 34: autoupdating with aclocal and m4_include        ok
 35: autom4te preselections                          ok
 36: autom4te cache creation                         ok
 37: autom4te cache locking                          ok
 38: autotools and whitespace in file names          ok

M4sugar.

 39: m4_stack                                        ok
 40: m4_defn                                         ok
 41: m4_dumpdef                                      ok
 42: m4_warn                                         ok
 43: m4_divert_stack                                 ok
 44: m4_expansion_stack                              ok
 45: m4_require: error message                       ok
 46: m4_require: circular dependencies               ok
 47: m4_require: one-shot initialization             ok
 48: m4_require: nested                              ok
 49: m4sugar shorthand conditionals                  ok
 50: m4_cond                                         ok
 51: m4 lists                                        ok
 52: m4_split                                        ok
 53: m4_do                                           ok
 54: m4_append                                       ok
 55: m4_join                                         ok
 56: m4_expand                                       ok
 57: m4_text_box                                     ok
 58: m4_text_wrap                                    ok
 59: m4_version_compare                              ok
 60: Standard regular expressions                    ok
 61: m4_bmatch                                       ok
 62: m4_toupper and m4_tolower                       ok
 63: m4_bpatsubsts                                   ok
 64: m4_esyscmd_s                                    ok
 65: M4 loops                                        ok
 66: m4_map                                          ok
 67: m4_map_args and m4_curry                        ok
 68: m4_combine                                      ok
 69: m4_max and m4_min                               ok
 70: recursion                                       ok
 71: m4_set                                          ok
 72: __file__ and __line__                           ok

M4sh.

 73: LINENO                                          ok
 74: LINENO stack                                    ok
 75: AS_BOX                                          ok
 76: AS_BASENAME                                     ok
 77: AS_DIRNAME                                      ok
 78: AS_SET_CATFILE                                  ok
 79: AS_ECHO and AS_ECHO_N                           ok
 80: AS_EXIT                                         ok
 81: AS_MKDIR_P                                      ok
 82: AS_VERSION_COMPARE                              ok
 83: as_me                                           ok
 84: Negated classes in globbing                     ok
 85: Functions Support                               ok
 86: Functions and return Support                    ok
 87: Nested AS_REQUIRE_SHELL_FN                      ok
 88: Nested AS_REQUIRE                               ok
 89: AS_REQUIRE_SHELL_FN and m4_require              ok
 90: AS_HELP_STRING                                  ok
 91: AS_IF and AS_CASE                               ok
 92: AS_FOR                                          ok
 93: AS_LITERAL_IF                                   ok
 94: AS_TR_SH and AS_TR_CPP                          ok
 95: AS_VAR basics                                   ok
 96: AS_VAR_APPEND                                   ok
 97: AS_VAR_ARITH                                    ok
 98: AS_INIT cleanup                                 ok
 99: AS_INIT_GENERATED                               ok
100: AS_MESSAGE_FD                                   ok
101: _AS_CLEAN_DIR                                   ok
102: ECHO_C                                          ok

Autotest.

103: AT_COPYRIGHT                                    ok
104: Empty test suite                                ok
105: Banner-only test suite                          ok
106: Empty test                                      ok
107: Empty check                                     ok
108: AT_SETUP without AT_INIT                        ok
109: AT_BANNER without AT_INIT                       ok
110: AT_CLEANUP without AT_INIT                      ok
111: Missing AT_CLEANUP                              ok
112: AT_FAIL_IF without AT_SETUP                     ok
113: AT_SKIP_IF without AT_SETUP                     ok
114: AT_CHECK without AT_SETUP                       ok
115: AT_DATA without AT_SETUP                        ok
116: AT_XFAIL_IF without AT_SETUP                    ok
117: AT_KEYWORDS without AT_SETUP                    ok
118: AT_CLEANUP without AT_SETUP                     ok
119: AT_BANNER inside AT_SETUP                       ok
120: AT_SETUP inside AT_SETUP                        ok
121: Multiple AT_INIT                                ok
122: Tested programs                                 ok
123: Startup error messages                          ok
124: Truth                                           ok
125: Fallacy                                         ok
126: Skip                                            ok
127: Hard fail                                       ok
128: AT_FAIL_IF                                      ok
129: AT_SKIP_IF                                      ok
130: Syntax error                                    ok
131: errexit                                         ok
132: unquoted output                                 ok
133: Trace output                                    ok
134: Logging                                         ok
135: Binary output                                   ok
136: Cleanup                                         ok
137: Literal multiline command                       ok
138: Multiline parameter expansion                   ok
139: Backquote command substitution                  ok
140: Multiline backquote command substitution        ok
141: Parenthetical command substitution              ok
142: Multiline parenthetical command substitution    ok
143: Shell comment in command                        ok
144: Invalid brace-enclosed parameter expansion      ok
145: Multiline command from M4 expansion             ok
146: Double-M4-quoted command                        ok
147: Metacharacters in command from M4 expansion     ok
148: BS-newline in command                           ok
149: ^BS-newline in command                          ok
150: BSx641-newline in command                       ok
151: BS-BS-newline in command                        ok
152: BSx640-newline in command                       ok
153: Newline-CODE-BS-newline in command              ok
154: Single-quote-BS-newline in command              ok
155: Single-quote-newline-BS-newline in command      ok
156: Input from stdin                                ok
157: Backquote in a test title                       ok
158: Single-quote in a test title                    ok
159: Double-quote in a test title                    ok
160: Backslash in a test title                       ok
161: Brackets in a test title                        ok
162: Left bracket in a test title                    ok
163: Right bracket in a test title                   ok
164: Quoted pound in a test title                    ok
165: Pound in a test title                           ok
166: Quoted comma in a test title                    ok
167: Comma in a test title                           ok
168: Parentheses in a test title                     ok
169: Left paren in a test title                      ok
170: Right paren in a test title                     ok
171: Quoted Macro in a test title                    ok
172: Macro in a test title                           ok
173: Macro with backquote in a test title            ok
174: Macro with single-quote in a test title         ok
175: Macro with double-quote in a test title         ok
176: Macro with backslash in a test title            ok
177: Macro echoing macro in a test title             ok
178: Macro echoing single-quote in a test title      ok
179: Long test title in a test title                 ok
180: Longer test title in a test title               ok
181: Long test source lines                          ok
182: Debugging a successful test                     ok
183: Debugging script and environment                ok
184: Debugging a failed test                         ok
185: Using atlocal                                   ok
186: Choosing where testsuite is run                 ok
187: recheck                                         ok
188: Banners                                         ok
189: Keywords and ranges                             ok
190: Keyword wrapping                                ok
191: AT_ARG_OPTION                                   ok
192: AT_ARG_OPTION_ARG                               ok
193: parallel test execution                         skipped (autotest.at:1309)
194: parallel truth                                  skipped (autotest.at:1341)
195: parallel fallacy                                skipped (autotest.at:1346)
196: parallel skip                                   skipped (autotest.at:1351)
197: parallel syntax error                           skipped (autotest.at:1356)
198: parallel errexit                                skipped (autotest.at:1375)
199: parallel autotest and signal handling           skipped (autotest.at:1393)
200: colored test results                            ok
201: srcdir propagation                              ok
202: whitespace in absolute testdir                  ok
203: unusual file names                              ok
204: Erlang Eunit unit tests                         ok

Autoconf base layer.

205: AC_REQUIRE: topological sort                    ok
206: AC_REQUIRE: error message                       ok
207: AC_REQUIRE & AC_DEFUN_ONCE: Require, expand     ok
208: AC_REQUIRE & AC_DEFUN_ONCE: Expand, require     ok
209: AC_REQUIRE & AC_PROVIDE                         ok
210: AC_INIT                                         ok
211: AC_COPYRIGHT                                    ok
212: AC_CACHE_CHECK                                  ok
213: AC_CACHE_LOAD                                   ok
214: AC_COMPUTE_INT                                  ok
215: AC_TRY_COMMAND                                  ok
216: Input/Output                                    ok
217: configure arguments                             ok
218: AC_ARG_ENABLE and AC_ARG_WITH                   ok
219: configure directories                           ok

Testing config.status.

220: AC_CONFIG_COMMANDS with empty commands          ok
221: Multiple AC_CONFIG_FILES                        ok
222: Parameterized AC_CONFIG_FILES                   ok
223: AC_ARG_VAR                                      ok
224: AC_CONFIG_FILES, HEADERS, LINKS and COMMANDS    ok
225: Macro calls in AC_CONFIG_COMMANDS tags          ok
226: Missing templates                               ok
227: configure invocation                            ok
228: #define header templates                        ok
229: Torturing config.status                         ok
230: Substitute a 2000-byte string                   ok
231: Define to a 2000-byte string                    ok
232: Substitute and define special characters        ok
233: Substitute a newline                            ok
234: Define a newline                                ok
235: AC_SUBST: variable name validation              ok
236: datarootdir workaround                          ok
237: srcdir                                          ok
238: VPATH                                           ok
239: Signal handling                                 ok
240: AC_CONFIG_LINKS                                 ok
241: AC_CONFIG_LINKS and identical files             ok

autoreconf.

242: Configuring subdirectories                      ok
243: Deep Package                                    ok
244: Non-Autoconf AC_CONFIG_SUBDIRS                  ok
245: Empty directory                                 ok
246: Unusual Automake input files                    ok

Low level compiling/preprocessing macros.

247: AC_LANG, AC_LANG_PUSH & AC_LANG_POP             ok
248: AC_REQUIRE & AC_LANG                            ok
249: AC_LANG_SOURCE                                  ok
250: AC_LANG_SOURCE(C++)                             ok
251: AC_LANG_SOURCE example                          ok
252: AC_LANG_PROGRAM example                         ok
253: AC_RUN_IFELSE                                   ok
254: Order of user actions and cleanup               ok
255: AC_TRY_LINK_FUNC                                ok
256: Multiple languages                              ok

Testing autoconf/lang macros.

257: AC_NO_EXECUTABLES                               ok
258: AC_REQUIRE_CPP                                  ok

C low level compiling/preprocessing macros.

259: Extensions                                      ok
260: Broken/missing compilers                        ok
261: C keywords                                      ok
262: AC_PROG_CPP requires AC_PROG_CC                 ok
263: AC_PROG_CPP with warnings                       ok
264: AC_PROG_CPP without warnings                    ok
265: AC_PROG_CPP via CC                              ok
266: AC_NO_EXECUTABLES (working linker)              ok
267: AC_NO_EXECUTABLES (broken linker)               ok
268: AC_USE_SYSTEM_EXTENSIONS                        ok
269: AC_C_RESTRICT and C++                           ok
270: AC_OPENMP and C                                 skipped (c.at:373)
271: AC_OPENMP and C++                               skipped (c.at:416)

Testing autoconf/c macros.

272: AC_C_BACKSLASH_A                                ok
273: AC_C_BIGENDIAN                                  ok
274: AC_C_CHAR_UNSIGNED                              ok
275: AC_C_FLEXIBLE_ARRAY_MEMBER                      ok
276: AC_C_INLINE                                     ok
277: AC_C_PROTOTYPES                                 ok
278: AC_C_RESTRICT                                   ok
279: AC_C_STRINGIZE                                  ok
280: AC_C_TYPEOF                                     ok
281: AC_C_VARARRAYS                                  ok
282: AC_OPENMP                                       ok
283: AC_PROG_CC_C89                                  ok
284: AC_PROG_CC_C99                                  ok
285: AC_PROG_CC_C_O                                  ok
286: AC_PROG_CC_STDC                                 ok
287: AC_PROG_CPP_WERROR                              ok
288: AC_PROG_GCC_TRADITIONAL                         ok
289: AC_LANG_C                                       ok
290: AC_LANG_CPLUSPLUS                               ok
291: AC_LANG_OBJC                                    ok

Fortran low level compiling/preprocessing macros.

292: GNU Fortran 77                                  ok
293: GNU Fortran                                     ok
294: AC_OPENMP and Fortran 77                        skipped (fortran.at:112)
295: AC_OPENMP and Fortran                           skipped (fortran.at:152)
296: AC_F77_DUMMY_MAIN usage                         ok
297: AC_FC_DUMMY_MAIN usage                          ok
298: AC_F77_MAIN usage                               ok
299: AC_FC_MAIN usage                                ok
300: AC_F77_FUNC usage                               ok
301: AC_FC_FUNC usage                                ok
302: AC_FC_SRCEXT usage                              ok
303: AC_FC_FREEFORM                                  ok
304: AC_FC_FREEFORM with AC_FC_SRCEXT                FAILED (fortran.at:794)
305: AC_FC_FIXEDFORM                                 ok
306: AC_FC_FIXEDFORM with AC_FC_SRCEXT               FAILED (fortran.at:871)

Testing autoconf/fortran macros.

307: AC_F77_MAIN                                     ok
308: AC_F77_WRAPPERS                                 ok
309: AC_FC_FIXEDFORM                                 ok
310: AC_FC_FREEFORM                                  ok
311: AC_FC_MAIN                                      ok
312: AC_FC_WRAPPERS                                  ok
313: AC_PROG_F77_C_O                                 ok
314: AC_PROG_FC_C_O                                  ok
315: AC_F77_NAME_MANGLING                            ok
316: AC_LANG_FORTRAN77                               ok

Erlang low level compiling and utility macros.

317: Erlang                                          ok
318: AC_ERLANG_CHECK_LIB                             ok
319: AC_ERLANG_SUBST_ROOT_DIR                        ok
320: AC_ERLANG_SUBST_LIB_DIR                         ok
321: AC_ERLANG_SUBST_INSTALL_LIB_DIR                 ok
322: AC_ERLANG_SUBST_INSTALL_LIB_SUBDIR              ok
323: AC_ERLANG_SUBST_ERTS_VER                        ok

Semantics.

324: AC_CHECK_LIB                                    ok
325: AC_SEARCH_LIBS                                  ok
326: AC_SEARCH_LIBS (none needed)                    ok
327: AC_CHECK_DECLS                                  ok
328: AC_CHECK_FUNCS                                  ok
329: AC_REPLACE_FUNCS                                ok
330: AC_CHECK_HEADERS                                ok
331: AC_CHECK_HEADERS (preprocessor test)            ok
332: AC_CHECK_HEADERS (compiler test)                ok
333: AC_CHECK_MEMBER                                 ok
334: AC_CHECK_MEMBERS                                ok
335: AC_CHECK_ALIGNOF                                ok
336: AC_CHECK_ALIGNOF (cross compile)                ok
337: AC_CHECK_ALIGNOF struct                         ok
338: AC_CHECK_ALIGNOF struct (cross compile)         ok
339: AC_CHECK_SIZEOF                                 ok
340: AC_CHECK_SIZEOF (cross compile)                 ok
341: AC_CHECK_SIZEOF struct                          ok
342: AC_CHECK_SIZEOF struct (cross compile)          ok
343: AC_CHECK_TYPES                                  ok
344: AC_CHECK_TYPES: backward compatibility          ok
345: AC_CHECK_FILES                                  ok
346: AC_CHECK_PROG & AC_CHECK_PROGS                  ok
347: AC_C_BIGENDIAN                                  ok
348: AC_PATH_PROG & AC_PATH_PROGS                    ok
349: AC_PATH_PROGS_FEATURE_CHECK                     ok
350: AC_PATH_XTRA                                    ok
351: AC_SYS_RESTARTABLE_SYSCALLS                     ok
352: AC_FUNC_SETVBUF_REVERSED                        ok
353: AC_FUNC_WAIT3                                   ok

Testing autoconf/general macros.

354: AC_ARG_ENABLE                                   ok
355: AC_ARG_PROGRAM                                  ok
356: AC_ARG_WITH                                     ok
357: AC_CHECK_DECLS_ONCE                             ok
358: AC_EGREP_CPP                                    ok
359: AC_EGREP_HEADER                                 ok
360: AC_LIBOBJ                                       ok
361: AC_LIBSOURCES                                   ok
362: AC_PREFIX_DEFAULT                               ok
363: AC_CHECKING                                     ok
364: AC_COMPILE_CHECK                                ok
365: AC_ENABLE                                       ok
366: AC_FOREACH                                      ok
367: AC_MSG_RESULT_UNQUOTED                          ok
368: AC_TRY_COMPILE                                  ok
369: AC_TRY_CPP                                      ok
370: AC_TRY_LINK                                     ok
371: AC_TRY_RUN                                      ok
372: AC_VALIDATE_CACHED_SYSTEM_TUPLE                 ok
373: AC_WITH                                         ok

Testing autoconf/status macros.

374: AC_OUTPUT_COMMANDS                              ok

Testing autoconf/specific macros.

375: AC_SYS_INTERPRETER                              ok
376: AC_SYS_LARGEFILE                                ok
377: AC_SYS_LONG_FILE_NAMES                          ok
378: AC_SYS_POSIX_TERMIOS                            ok
379: AC_AIX                                          ok
380: AC_ARG_ARRAY                                    ok
381: AC_DECL_SYS_SIGLIST                             ok
382: AC_DYNIX_SEQ                                    ok
383: AC_HAVE_POUNDBANG                               ok
384: AC_IRIX_SUN                                     ok
385: AC_ISC_POSIX                                    ok
386: AC_MINIX                                        ok
387: AC_SCO_INTL                                     ok
388: AC_XENIX_DIR                                    ok

Testing autoconf/programs macros.

389: AC_PROG_AWK                                     ok
390: AC_PROG_FGREP                                   ok
391: AC_PROG_INSTALL                                 ok
392: AC_PROG_LEX                                     ok
393: AC_PROG_LN_S                                    ok
394: AC_PROG_MAKE_SET                                ok
395: AC_PROG_MKDIR_P                                 ok
396: AC_PROG_RANLIB                                  ok
397: AC_PROG_SED                                     ok
398: AC_PROG_YACC                                    ok
399: AC_CHECK_TOOL_PREFIX                            ok
400: AC_DECL_YYTEXT                                  ok
401: AC_RSH                                          ok

Testing autoconf/headers macros.

402: AC_CHECK_HEADERS_ONCE                           ok
403: AC_HEADER_ASSERT                                ok
404: AC_HEADER_MAJOR                                 ok
405: AC_HEADER_RESOLV                                ok
406: AC_HEADER_STAT                                  ok
407: AC_HEADER_STDBOOL                               ok
408: AC_HEADER_TIOCGWINSZ                            ok
409: AC_DIR_HEADER                                   ok
410: AC_MEMORY_H                                     ok
411: AC_UNISTD_H                                     ok
412: AC_USG                                          ok

Testing autoconf/types macros.

413: AC_STRUCT_DIRENT_D_INO                          ok
414: AC_STRUCT_DIRENT_D_TYPE                         ok
415: AC_STRUCT_ST_BLOCKS                             ok
416: AC_STRUCT_TIMEZONE                              ok
417: AC_TYPE_INT16_T                                 ok
418: AC_TYPE_INT32_T                                 ok
419: AC_TYPE_INT64_T                                 ok
420: AC_TYPE_INT8_T                                  ok
421: AC_TYPE_INTMAX_T                                ok
422: AC_TYPE_INTPTR_T                                ok
423: AC_TYPE_LONG_DOUBLE                             ok
424: AC_TYPE_LONG_DOUBLE_WIDER                       ok
425: AC_TYPE_MODE_T                                  ok
426: AC_TYPE_OFF_T                                   ok
427: AC_TYPE_SSIZE_T                                 ok
428: AC_TYPE_UINT16_T                                ok
429: AC_TYPE_UINT32_T                                ok
430: AC_TYPE_UINT64_T                                ok
431: AC_TYPE_UINT8_T                                 ok
432: AC_TYPE_UINTMAX_T                               ok
433: AC_TYPE_UINTPTR_T                               ok
434: AC_C_LONG_DOUBLE                                ok
435: AC_INT_16_BITS                                  ok
436: AC_LONG_64_BITS                                 ok
437: AC_STRUCT_ST_BLKSIZE                            ok
438: AC_STRUCT_ST_RDEV                               ok
439: AC_TYPE_SIGNAL                                  ok
440: AM_TYPE_PTRDIFF_T                               ok

Testing autoconf/functions macros.

441: AC_CHECK_FUNCS_ONCE                             ok
442: AC_FUNC_CHOWN                                   ok
443: AC_FUNC_CLOSEDIR_VOID                           ok
444: AC_FUNC_ERROR_AT_LINE                           ok
445: AC_FUNC_FNMATCH                                 ok
446: AC_FUNC_FORK                                    ok
447: AC_FUNC_FSEEKO                                  ok
448: AC_FUNC_GETGROUPS                               ok
449: AC_FUNC_GETMNTENT                               ok
450: AC_FUNC_GETPGRP                                 ok
451: AC_FUNC_LSTAT                                   ok
452: AC_FUNC_MALLOC                                  ok
453: AC_FUNC_MBRTOWC                                 ok
454: AC_FUNC_MEMCMP                                  ok
455: AC_FUNC_MKTIME                                  ok
456: AC_FUNC_MMAP                                    ok
457: AC_FUNC_OBSTACK                                 ok
458: AC_FUNC_REALLOC                                 ok
459: AC_FUNC_SELECT_ARGTYPES                         ok
460: AC_FUNC_SETPGRP                                 ok
461: AC_FUNC_STAT                                    ok
462: AC_FUNC_STRCOLL                                 ok
463: AC_FUNC_STRERROR_R                              ok
464: AC_FUNC_STRFTIME                                ok
465: AC_FUNC_STRNLEN                                 ok
466: AC_FUNC_STRTOD                                  ok
467: AC_FUNC_STRTOLD                                 ok
468: AC_FUNC_UTIME_NULL                              ok
469: AC_FUNC_VPRINTF                                 ok

Testing autoconf/libs macros.

470: AC_HAVE_LIBRARY                                 ok

Compatibility with other tools.

471: Libtool                                         skipped (foreign.at:33)
472: shtool                                          ok

Autoscan.

473: autoscan                                        ok

## ------------- ##
## Test results. ##
## ------------- ##

ERROR: 461 tests were run,
6 failed (4 expected failures).
12 tests were skipped.
## -------------------------- ##
## testsuite.log was created. ##
## -------------------------- ##

Please send `tests/testsuite.log' and all information you think might help:

   To: <bug-autoconf@gnu.org>
   Subject: [GNU Autoconf 2.66] testsuite: 304 306 failed

You may investigate any problem if you feel able to do so, in which
case the test suite provides a good starting point.  Its output may
be found below `tests/testsuite.dir'.

make[3]: *** [check-local] Error 1
make[3]: Leaving directory `/home/services/builder/rpm/BUILD/autoconf-2.66/tests'
make[2]: *** [check-am] Error 2
make[2]: Leaving directory `/home/services/builder/rpm/BUILD/autoconf-2.66/tests'
make[1]: *** [check-recursive] Error 1
make[1]: Leaving directory `/home/services/builder/rpm/BUILD/autoconf-2.66'
make: *** [check] Error 2
error: Bad exit status from /tmp/B.4eb3fe/rpm-tmp.16116 (%build)


RPM build errors:
    Bad exit status from /tmp/B.4eb3fe/rpm-tmp.16116 (%build)
ended at: Thu Jul  8 13:26:29 2010, done in 00h 11m 05s
error: No files produced.
Begin-PLD-Builder-Info
Build-Time: user:304.62s sys:85.25s real:669.08s (faults io:270 non-io:61170726)

End-PLD-Builder-Info
[Back to list of logs] [View rpm -qa of builder]