FailedOk

th/SRPMS[OK]
th/x32[OK]
th/i686[OK]
th/x86_64[OK]

ac/SRPMS[OK]
ac/i386[OK]
ac/i586[OK]
ac/i686[OK]
ac/alpha[OK]
ac/amd64[OK]
ac/athlon[OK]
ac/ppc[OK]
ac/sparc[OK]
ac/sparc64[OK]

Advanced Search
main()
Powered by PLD Linux
(c) 2002-2020 PLD Team
$Revision: 1.37 $
Powered by penguin.
Your IP: 35.172.233.2

aMule 7d479c1d-287d-44ac-8bd6-49b540441516

Status:Failed
Source URL:https://buildlogs.pld-linux.org/pld/ac/i386/FAIL/aMule,7d479c1d-287d-44ac-8bd6-49b540441516.bz2
text/plain URL:View!
full text:View!
rpm -qa of builder:View!
Date:2010/01/26 08:54:18
Runtime:00

Toc:

  • error 1
  • make[5]: *** [cas] Error 1
  • error 2
  • make[4]: *** [all-recursive] Error 1
  • error 3
  • make[3]: *** [all-recursive] Error 1
  • error 4
  • make[2]: *** [all-recursive] Error 1
  • error 5
  • make[1]: *** [all-recursive] Error 1
  • error 6
  • error: Bad exit status from /tmp/B.17e1fb/rpm-tmp.59671 (%build)
  • error 7
  • RPM build errors:
  • error 8
  • error: No files produced.

Content:

make[2]: Leaving directory `/home/users/builder/rpm/BUILD/aMule-2.1.3/m4'
Making all in docs
make[2]: Entering directory `/home/users/builder/rpm/BUILD/aMule-2.1.3/docs'
Making all in man
make[3]: Entering directory `/home/users/builder/rpm/BUILD/aMule-2.1.3/docs/man'
make[3]: Nothing to be done for `all'.
make[3]: Leaving directory `/home/users/builder/rpm/BUILD/aMule-2.1.3/docs/man'
make[3]: Entering directory `/home/users/builder/rpm/BUILD/aMule-2.1.3/docs'
make[3]: Nothing to be done for `all-am'.
make[3]: Leaving directory `/home/users/builder/rpm/BUILD/aMule-2.1.3/docs'
make[2]: Leaving directory `/home/users/builder/rpm/BUILD/aMule-2.1.3/docs'
Making all in src
make[2]: Entering directory `/home/users/builder/rpm/BUILD/aMule-2.1.3/src'
Making all in libs
make[3]: Entering directory `/home/users/builder/rpm/BUILD/aMule-2.1.3/src/libs'
Making all in ec
make[4]: Entering directory `/home/users/builder/rpm/BUILD/aMule-2.1.3/src/libs/ec'
i386-pld-linux-gcc -o mkFileSum ../../../src/utils/mkFileSum.c
Generating ECVersion.h... created.
make  all-am
make[5]: Entering directory `/home/users/builder/rpm/BUILD/aMule-2.1.3/src/libs/ec'
i386-pld-linux-g++ -DHAVE_CONFIG_H -I. -I../../..    -I/usr/lib/wx/include/gtk2-unicode-release-2.6 -I/usr/include/wx-2.6 -DGTK_NO_CHECK_CASTS -D__WXGTK__ -D_FILE_OFFSET_BITS=64 -D_LARGE_FILES -D_LARGEFILE_SOURCE=1   -I../../../src -I../../../src/libs -DECSOCKET_USE_EVENTS=0 -O2 -march=i386  -DUSE_EMBEDDED_CRYPTO -W -Wall -Wshadow -Wundef -O2  -MT libec_noevt_a-ECPacket.o -MD -MP -MF .deps/libec_noevt_a-ECPacket.Tpo -c -o libec_noevt_a-ECPacket.o `test -f 'ECPacket.cpp' || echo './'`ECPacket.cpp
mv -f .deps/libec_noevt_a-ECPacket.Tpo .deps/libec_noevt_a-ECPacket.Po
i386-pld-linux-g++ -DHAVE_CONFIG_H -I. -I../../..    -I/usr/lib/wx/include/gtk2-unicode-release-2.6 -I/usr/include/wx-2.6 -DGTK_NO_CHECK_CASTS -D__WXGTK__ -D_FILE_OFFSET_BITS=64 -D_LARGE_FILES -D_LARGEFILE_SOURCE=1   -I../../../src -I../../../src/libs -DECSOCKET_USE_EVENTS=0 -O2 -march=i386  -DUSE_EMBEDDED_CRYPTO -W -Wall -Wshadow -Wundef -O2  -MT libec_noevt_a-ECSocket.o -MD -MP -MF .deps/libec_noevt_a-ECSocket.Tpo -c -o libec_noevt_a-ECSocket.o `test -f 'ECSocket.cpp' || echo './'`ECSocket.cpp
mv -f .deps/libec_noevt_a-ECSocket.Tpo .deps/libec_noevt_a-ECSocket.Po
i386-pld-linux-g++ -DHAVE_CONFIG_H -I. -I../../..    -I/usr/lib/wx/include/gtk2-unicode-release-2.6 -I/usr/include/wx-2.6 -DGTK_NO_CHECK_CASTS -D__WXGTK__ -D_FILE_OFFSET_BITS=64 -D_LARGE_FILES -D_LARGEFILE_SOURCE=1   -I../../../src -I../../../src/libs -DECSOCKET_USE_EVENTS=0 -O2 -march=i386  -DUSE_EMBEDDED_CRYPTO -W -Wall -Wshadow -Wundef -O2  -MT libec_noevt_a-RemoteConnect.o -MD -MP -MF .deps/libec_noevt_a-RemoteConnect.Tpo -c -o libec_noevt_a-RemoteConnect.o `test -f 'RemoteConnect.cpp' || echo './'`RemoteConnect.cpp
mv -f .deps/libec_noevt_a-RemoteConnect.Tpo .deps/libec_noevt_a-RemoteConnect.Po
i386-pld-linux-g++ -DHAVE_CONFIG_H -I. -I../../..    -I/usr/lib/wx/include/gtk2-unicode-release-2.6 -I/usr/include/wx-2.6 -DGTK_NO_CHECK_CASTS -D__WXGTK__ -D_FILE_OFFSET_BITS=64 -D_LARGE_FILES -D_LARGEFILE_SOURCE=1   -I../../../src -I../../../src/libs -DECSOCKET_USE_EVENTS=0 -O2 -march=i386  -DUSE_EMBEDDED_CRYPTO -W -Wall -Wshadow -Wundef -O2  -MT libec_noevt_a-ECSpecialTags.o -MD -MP -MF .deps/libec_noevt_a-ECSpecialTags.Tpo -c -o libec_noevt_a-ECSpecialTags.o `test -f 'ECSpecialTags.cpp' || echo './'`ECSpecialTags.cpp
mv -f .deps/libec_noevt_a-ECSpecialTags.Tpo .deps/libec_noevt_a-ECSpecialTags.Po
rm -f libec_noevt.a
ar cru libec_noevt.a libec_noevt_a-ECPacket.o libec_noevt_a-ECSocket.o libec_noevt_a-RemoteConnect.o libec_noevt_a-ECSpecialTags.o 
ranlib libec_noevt.a
i386-pld-linux-g++ -DHAVE_CONFIG_H -I. -I../../..    -I/usr/lib/wx/include/gtk2-unicode-release-2.6 -I/usr/include/wx-2.6 -DGTK_NO_CHECK_CASTS -D__WXGTK__ -D_FILE_OFFSET_BITS=64 -D_LARGE_FILES -D_LARGEFILE_SOURCE=1   -I../../../src -I../../../src/libs -O2 -march=i386  -DUSE_EMBEDDED_CRYPTO -W -Wall -Wshadow -Wundef -O2  -MT libec_a-ECPacket.o -MD -MP -MF .deps/libec_a-ECPacket.Tpo -c -o libec_a-ECPacket.o `test -f 'ECPacket.cpp' || echo './'`ECPacket.cpp
mv -f .deps/libec_a-ECPacket.Tpo .deps/libec_a-ECPacket.Po
i386-pld-linux-g++ -DHAVE_CONFIG_H -I. -I../../..    -I/usr/lib/wx/include/gtk2-unicode-release-2.6 -I/usr/include/wx-2.6 -DGTK_NO_CHECK_CASTS -D__WXGTK__ -D_FILE_OFFSET_BITS=64 -D_LARGE_FILES -D_LARGEFILE_SOURCE=1   -I../../../src -I../../../src/libs -O2 -march=i386  -DUSE_EMBEDDED_CRYPTO -W -Wall -Wshadow -Wundef -O2  -MT libec_a-ECSocket.o -MD -MP -MF .deps/libec_a-ECSocket.Tpo -c -o libec_a-ECSocket.o `test -f 'ECSocket.cpp' || echo './'`ECSocket.cpp
mv -f .deps/libec_a-ECSocket.Tpo .deps/libec_a-ECSocket.Po
i386-pld-linux-g++ -DHAVE_CONFIG_H -I. -I../../..    -I/usr/lib/wx/include/gtk2-unicode-release-2.6 -I/usr/include/wx-2.6 -DGTK_NO_CHECK_CASTS -D__WXGTK__ -D_FILE_OFFSET_BITS=64 -D_LARGE_FILES -D_LARGEFILE_SOURCE=1   -I../../../src -I../../../src/libs -O2 -march=i386  -DUSE_EMBEDDED_CRYPTO -W -Wall -Wshadow -Wundef -O2  -MT libec_a-RemoteConnect.o -MD -MP -MF .deps/libec_a-RemoteConnect.Tpo -c -o libec_a-RemoteConnect.o `test -f 'RemoteConnect.cpp' || echo './'`RemoteConnect.cpp
mv -f .deps/libec_a-RemoteConnect.Tpo .deps/libec_a-RemoteConnect.Po
i386-pld-linux-g++ -DHAVE_CONFIG_H -I. -I../../..    -I/usr/lib/wx/include/gtk2-unicode-release-2.6 -I/usr/include/wx-2.6 -DGTK_NO_CHECK_CASTS -D__WXGTK__ -D_FILE_OFFSET_BITS=64 -D_LARGE_FILES -D_LARGEFILE_SOURCE=1   -I../../../src -I../../../src/libs -O2 -march=i386  -DUSE_EMBEDDED_CRYPTO -W -Wall -Wshadow -Wundef -O2  -MT libec_a-ECSpecialTags.o -MD -MP -MF .deps/libec_a-ECSpecialTags.Tpo -c -o libec_a-ECSpecialTags.o `test -f 'ECSpecialTags.cpp' || echo './'`ECSpecialTags.cpp
mv -f .deps/libec_a-ECSpecialTags.Tpo .deps/libec_a-ECSpecialTags.Po
rm -f libec.a
ar cru libec.a libec_a-ECPacket.o libec_a-ECSocket.o libec_a-RemoteConnect.o libec_a-ECSpecialTags.o 
ranlib libec.a
make[5]: Leaving directory `/home/users/builder/rpm/BUILD/aMule-2.1.3/src/libs/ec'
make[4]: Leaving directory `/home/users/builder/rpm/BUILD/aMule-2.1.3/src/libs/ec'
Making all in common
make[4]: Entering directory `/home/users/builder/rpm/BUILD/aMule-2.1.3/src/libs/common'
i386-pld-linux-g++ -DHAVE_CONFIG_H -I. -I../../..    -I/usr/lib/wx/include/gtk2-unicode-release-2.6 -I/usr/include/wx-2.6 -DGTK_NO_CHECK_CASTS -D__WXGTK__ -D_FILE_OFFSET_BITS=64 -D_LARGE_FILES -D_LARGEFILE_SOURCE=1   -DHAVE_BFD  -O2 -march=i386  -DUSE_EMBEDDED_CRYPTO -W -Wall -Wshadow -Wundef -O2  -MT libmulecommon_a-Format.o -MD -MP -MF .deps/libmulecommon_a-Format.Tpo -c -o libmulecommon_a-Format.o `test -f 'Format.cpp' || echo './'`Format.cpp
mv -f .deps/libmulecommon_a-Format.Tpo .deps/libmulecommon_a-Format.Po
i386-pld-linux-g++ -DHAVE_CONFIG_H -I. -I../../..    -I/usr/lib/wx/include/gtk2-unicode-release-2.6 -I/usr/include/wx-2.6 -DGTK_NO_CHECK_CASTS -D__WXGTK__ -D_FILE_OFFSET_BITS=64 -D_LARGE_FILES -D_LARGEFILE_SOURCE=1   -DHAVE_BFD  -O2 -march=i386  -DUSE_EMBEDDED_CRYPTO -W -Wall -Wshadow -Wundef -O2  -MT libmulecommon_a-MD5Sum.o -MD -MP -MF .deps/libmulecommon_a-MD5Sum.Tpo -c -o libmulecommon_a-MD5Sum.o `test -f 'MD5Sum.cpp' || echo './'`MD5Sum.cpp
mv -f .deps/libmulecommon_a-MD5Sum.Tpo .deps/libmulecommon_a-MD5Sum.Po
i386-pld-linux-g++ -DHAVE_CONFIG_H -I. -I../../..    -I/usr/lib/wx/include/gtk2-unicode-release-2.6 -I/usr/include/wx-2.6 -DGTK_NO_CHECK_CASTS -D__WXGTK__ -D_FILE_OFFSET_BITS=64 -D_LARGE_FILES -D_LARGEFILE_SOURCE=1   -DHAVE_BFD  -O2 -march=i386  -DUSE_EMBEDDED_CRYPTO -W -Wall -Wshadow -Wundef -O2  -MT libmulecommon_a-MuleDebug.o -MD -MP -MF .deps/libmulecommon_a-MuleDebug.Tpo -c -o libmulecommon_a-MuleDebug.o `test -f 'MuleDebug.cpp' || echo './'`MuleDebug.cpp
mv -f .deps/libmulecommon_a-MuleDebug.Tpo .deps/libmulecommon_a-MuleDebug.Po
i386-pld-linux-g++ -DHAVE_CONFIG_H -I. -I../../..    -I/usr/lib/wx/include/gtk2-unicode-release-2.6 -I/usr/include/wx-2.6 -DGTK_NO_CHECK_CASTS -D__WXGTK__ -D_FILE_OFFSET_BITS=64 -D_LARGE_FILES -D_LARGEFILE_SOURCE=1   -DHAVE_BFD  -O2 -march=i386  -DUSE_EMBEDDED_CRYPTO -W -Wall -Wshadow -Wundef -O2  -MT libmulecommon_a-PlatformSpecific.o -MD -MP -MF .deps/libmulecommon_a-PlatformSpecific.Tpo -c -o libmulecommon_a-PlatformSpecific.o `test -f 'PlatformSpecific.cpp' || echo './'`PlatformSpecific.cpp
mv -f .deps/libmulecommon_a-PlatformSpecific.Tpo .deps/libmulecommon_a-PlatformSpecific.Po
i386-pld-linux-g++ -DHAVE_CONFIG_H -I. -I../../..    -I/usr/lib/wx/include/gtk2-unicode-release-2.6 -I/usr/include/wx-2.6 -DGTK_NO_CHECK_CASTS -D__WXGTK__ -D_FILE_OFFSET_BITS=64 -D_LARGE_FILES -D_LARGEFILE_SOURCE=1   -DHAVE_BFD  -O2 -march=i386  -DUSE_EMBEDDED_CRYPTO -W -Wall -Wshadow -Wundef -O2  -MT libmulecommon_a-StringFunctions.o -MD -MP -MF .deps/libmulecommon_a-StringFunctions.Tpo -c -o libmulecommon_a-StringFunctions.o `test -f 'StringFunctions.cpp' || echo './'`StringFunctions.cpp
mv -f .deps/libmulecommon_a-StringFunctions.Tpo .deps/libmulecommon_a-StringFunctions.Po
rm -f libmulecommon.a
ar cru libmulecommon.a libmulecommon_a-Format.o libmulecommon_a-MD5Sum.o libmulecommon_a-MuleDebug.o libmulecommon_a-PlatformSpecific.o libmulecommon_a-StringFunctions.o 
ranlib libmulecommon.a
make[4]: Leaving directory `/home/users/builder/rpm/BUILD/aMule-2.1.3/src/libs/common'
make[4]: Entering directory `/home/users/builder/rpm/BUILD/aMule-2.1.3/src/libs'
make[4]: Nothing to be done for `all-am'.
make[4]: Leaving directory `/home/users/builder/rpm/BUILD/aMule-2.1.3/src/libs'
make[3]: Leaving directory `/home/users/builder/rpm/BUILD/aMule-2.1.3/src/libs'
Making all in utils
make[3]: Entering directory `/home/users/builder/rpm/BUILD/aMule-2.1.3/src/utils'
Making all in xas
make[4]: Entering directory `/home/users/builder/rpm/BUILD/aMule-2.1.3/src/utils/xas'
Making all in docs
make[5]: Entering directory `/home/users/builder/rpm/BUILD/aMule-2.1.3/src/utils/xas/docs'
make[5]: Nothing to be done for `all'.
make[5]: Leaving directory `/home/users/builder/rpm/BUILD/aMule-2.1.3/src/utils/xas/docs'
make[5]: Entering directory `/home/users/builder/rpm/BUILD/aMule-2.1.3/src/utils/xas'
make[5]: Nothing to be done for `all-am'.
make[5]: Leaving directory `/home/users/builder/rpm/BUILD/aMule-2.1.3/src/utils/xas'
make[4]: Leaving directory `/home/users/builder/rpm/BUILD/aMule-2.1.3/src/utils/xas'
Making all in cas
make[4]: Entering directory `/home/users/builder/rpm/BUILD/aMule-2.1.3/src/utils/cas'
Making all in docs
make[5]: Entering directory `/home/users/builder/rpm/BUILD/aMule-2.1.3/src/utils/cas/docs'
make[5]: Nothing to be done for `all'.
make[5]: Leaving directory `/home/users/builder/rpm/BUILD/aMule-2.1.3/src/utils/cas/docs'
make[5]: Entering directory `/home/users/builder/rpm/BUILD/aMule-2.1.3/src/utils/cas'
i386-pld-linux-gcc -DHAVE_CONFIG_H -I. -I../../..    -I/usr/include -D__GD__ -O2 -march=i386  -W -Wall -Wshadow -Wundef -O2  -MT cas-cas.o -MD -MP -MF .deps/cas-cas.Tpo -c -o cas-cas.o `test -f 'cas.c' || echo './'`cas.c
mv -f .deps/cas-cas.Tpo .deps/cas-cas.Po
i386-pld-linux-gcc -DHAVE_CONFIG_H -I. -I../../..    -I/usr/include -D__GD__ -O2 -march=i386  -W -Wall -Wshadow -Wundef -O2  -MT cas-configfile.o -MD -MP -MF .deps/cas-configfile.Tpo -c -o cas-configfile.o `test -f 'configfile.c' || echo './'`configfile.c
mv -f .deps/cas-configfile.Tpo .deps/cas-configfile.Po
i386-pld-linux-gcc -DHAVE_CONFIG_H -I. -I../../..    -I/usr/include -D__GD__ -O2 -march=i386  -W -Wall -Wshadow -Wundef -O2  -MT cas-functions.o -MD -MP -MF .deps/cas-functions.Tpo -c -o cas-functions.o `test -f 'functions.c' || echo './'`functions.c
mv -f .deps/cas-functions.Tpo .deps/cas-functions.Po
i386-pld-linux-gcc -DHAVE_CONFIG_H -I. -I../../..    -I/usr/include -D__GD__ -O2 -march=i386  -W -Wall -Wshadow -Wundef -O2  -MT cas-graphics.o -MD -MP -MF .deps/cas-graphics.Tpo -c -o cas-graphics.o `test -f 'graphics.c' || echo './'`graphics.c
mv -f .deps/cas-graphics.Tpo .deps/cas-graphics.Po
i386-pld-linux-gcc -DHAVE_CONFIG_H -I. -I../../..    -I/usr/include -D__GD__ -O2 -march=i386  -W -Wall -Wshadow -Wundef -O2  -MT cas-html.o -MD -MP -MF .deps/cas-html.Tpo -c -o cas-html.o `test -f 'html.c' || echo './'`html.c
mv -f .deps/cas-html.Tpo .deps/cas-html.Po
i386-pld-linux-gcc -DHAVE_CONFIG_H -I. -I../../..    -I/usr/include -D__GD__ -O2 -march=i386  -W -Wall -Wshadow -Wundef -O2  -MT cas-lines.o -MD -MP -MF .deps/cas-lines.Tpo -c -o cas-lines.o `test -f 'lines.c' || echo './'`lines.c
mv -f .deps/cas-lines.Tpo .deps/cas-lines.Po
i386-pld-linux-gcc -I/usr/include -D__GD__ -O2 -march=i386  -W -Wall -Wshadow -Wundef -O2   -Wl,--as-needed   -lpthread -o cas cas-cas.o cas-configfile.o cas-functions.o cas-graphics.o cas-html.o cas-lines.o  -lXpm -lX11 -ljpeg -lfontconfig -lfreetype -lpng12 -lz -lm -lgd  
/usr/bin/ld: cannot find -lXpm
collect2: ld returned 1 exit status
make[5]: *** [cas] Error 1
make[5]: Leaving directory `/home/users/builder/rpm/BUILD/aMule-2.1.3/src/utils/cas'
make[4]: *** [all-recursive] Error 1
make[4]: Leaving directory `/home/users/builder/rpm/BUILD/aMule-2.1.3/src/utils/cas'
make[3]: *** [all-recursive] Error 1
make[3]: Leaving directory `/home/users/builder/rpm/BUILD/aMule-2.1.3/src/utils'
make[2]: *** [all-recursive] Error 1
make[2]: Leaving directory `/home/users/builder/rpm/BUILD/aMule-2.1.3/src'
make[1]: *** [all-recursive] Error 1
make[1]: Leaving directory `/home/users/builder/rpm/BUILD/aMule-2.1.3'
make: *** [all] Error 2
error: Bad exit status from /tmp/B.17e1fb/rpm-tmp.59671 (%build)


RPM build errors:
    Bad exit status from /tmp/B.17e1fb/rpm-tmp.59671 (%build)
ended at: Tue Jan 26 08:54:17 2010, done in 00h 00m 59s
error: No files produced.
Can't find java virtual machine, aborting.
Begin-PLD-Builder-Info
Build-Time: user:47.92s sys:7.71s real:63.89s (faults io:70 non-io:2079494)

End-PLD-Builder-Info
[Back to list of logs] [View rpm -qa of builder]