FailedOk

th/SRPMS[OK]
th/x32[OK]
th/i686[OK]
th/x86_64[OK]

ac/SRPMS[OK]
ac/i386[OK]
ac/i586[OK]
ac/i686[OK]
ac/alpha[OK]
ac/amd64[OK]
ac/athlon[OK]
ac/ppc[OK]
ac/sparc[OK]
ac/sparc64[OK]

Advanced Search
main()
Powered by PLD Linux
(c) 2002-2019 PLD Team
$Revision: 1.37 $
Powered by /dev/drzewo.
Your IP: 3.226.243.10

irssi 27008dcb-e99d-4bd0-a5ec-05b42bc866ee

Status:Failed
Source URL:ftp://buildlogs.pld-linux.org/ac/i586/FAIL/irssi,27008dcb-e99d-4bd0-a5ec-05b42bc866ee.bz2
text/plain URL:View!
full text:View!
rpm -qa of builder:View!
Date:2015/04/27 16:09:50
Runtime:0:00:13.594722

Toc:

  • error 1
  • make[3]: *** [get.lo] Error 1
  • error 2
  • make[3]: *** [parse.lo] Error 1
  • error 3
  • make[3]: *** [set.lo] Error 1
  • error 4
  • make[3]: *** [write.lo] Error 1
  • error 5
  • make[2]: *** [all-recursive] Error 1
  • error 6
  • make[1]: *** [all-recursive] Error 1
  • error 7
  • error: Bad exit status from /tmp/B.e1f01ae4-f6e6-47c7-878a-0af53559bf9f/BUILD/tmp/rpm-tmp.37002 (%build)
  • error 8
  • RPM build errors:
  • error 9
  • error: No files produced.

Content:

Making all in src
make[2]: Entering directory `/tmp/B.e1f01ae4-f6e6-47c7-878a-0af53559bf9f/BUILD/irssi-0.8.15/src'
Making all in lib-config
make[3]: Entering directory `/tmp/B.e1f01ae4-f6e6-47c7-878a-0af53559bf9f/BUILD/irssi-0.8.15/src/lib-config'
/bin/sh ../../libtool --tag=CC   --mode=compile i586-pld-linux-gcc -DHAVE_CONFIG_H -I. -I../.. -I../../src -I/usr/include/glib-2.0 -I/usr/lib/glib-2.0/include      -O2 -march=i586  -Wall -I/usr/include/openssl   -MT get.lo -MD -MP -MF .deps/get.Tpo -c -o get.lo get.c
/bin/sh ../../libtool --tag=CC   --mode=compile i586-pld-linux-gcc -DHAVE_CONFIG_H -I. -I../.. -I../../src -I/usr/include/glib-2.0 -I/usr/lib/glib-2.0/include      -O2 -march=i586  -Wall -I/usr/include/openssl   -MT set.lo -MD -MP -MF .deps/set.Tpo -c -o set.lo set.c
/bin/sh ../../libtool --tag=CC   --mode=compile i586-pld-linux-gcc -DHAVE_CONFIG_H -I. -I../.. -I../../src -I/usr/include/glib-2.0 -I/usr/lib/glib-2.0/include      -O2 -march=i586  -Wall -I/usr/include/openssl   -MT parse.lo -MD -MP -MF .deps/parse.Tpo -c -o parse.lo parse.c
/bin/sh ../../libtool --tag=CC   --mode=compile i586-pld-linux-gcc -DHAVE_CONFIG_H -I. -I../.. -I../../src -I/usr/include/glib-2.0 -I/usr/lib/glib-2.0/include      -O2 -march=i586  -Wall -I/usr/include/openssl   -MT write.lo -MD -MP -MF .deps/write.Tpo -c -o write.lo write.c
../../libtool[965]: X--tag=CC: not found
../../libtool[965]: X--tag=CC: not found
../../libtool[965]: X--tag=CC: not found
../../libtool[965]: libtool: ignoring unknown tag : not found
../../libtool[965]: X--mode=compile: not found
../../libtool[965]: libtool: ignoring unknown tag : not found
../../libtool[965]: X--mode=compile: not found
../../libtool[965]: X--tag=CC: not found
../../libtool[965]: libtool: ignoring unknown tag : not found
../../libtool[965]: X--mode=compile: not found
../../libtool[965]: libtool: ignoring unknown tag : not found
../../libtool[965]: X--mode=compile: not found
../../libtool[7132]: *** Warning: inferring the mode of operation is deprecated.: not found
../../libtool[7132]: *** Future versions of Libtool will require --mode=MODE be specified.: not found
../../libtool[7132]: *** Warning: inferring the mode of operation is deprecated.: not found
../../libtool[7132]: *** Future versions of Libtool will require --mode=MODE be specified.: not found
../../libtool[7132]: *** Warning: inferring the mode of operation is deprecated.: not found
../../libtool[7132]: *** Future versions of Libtool will require --mode=MODE be specified.: not found
../../libtool[7132]: Xi586-pld-linux-gcc: not found
../../libtool[7132]: Xi586-pld-linux-gcc: not found
../../libtool[7132]: Xi586-pld-linux-gcc: not found
../../libtool[7132]: X-DHAVE_CONFIG_H: not found
../../libtool[7132]: X-DHAVE_CONFIG_H: not found
../../libtool[7132]: X-DHAVE_CONFIG_H: not found
../../libtool[7132]: X-I.: not found
../../libtool[7132]: X-I.: not found
../../libtool[7132]: X-I.: not found
../../libtool[7132]: X-I../..: not found
../../libtool[7132]: X-I../..: not found
../../libtool[7132]: X-I../../src: not found
../../libtool[7132]: X-I../..: not found
../../libtool[7132]: X-I/usr/include/glib-2.0: not found
../../libtool[7132]: *** Warning: inferring the mode of operation is deprecated.: not found
../../libtool[7132]: *** Future versions of Libtool will require --mode=MODE be specified.: not found
../../libtool[7132]: X-I../../src: not found
../../libtool[7132]: X-I../../src: not found
../../libtool[7132]: Xi586-pld-linux-gcc: not found
../../libtool[7132]: X-I/usr/include/glib-2.0: not found
../../libtool[7132]: X-I/usr/lib/glib-2.0/include: not found
../../libtool[7132]: X-I/usr/lib/glib-2.0/include: not found
../../libtool[7132]: X-DHAVE_CONFIG_H: not found
../../libtool[7132]: X-I/usr/include/glib-2.0: not found
../../libtool[7132]: X-O2: not found
../../libtool[7132]: X-O2: not found
../../libtool[7132]: X-I/usr/lib/glib-2.0/include: not found
../../libtool[7132]: X-march=i586: not found
../../libtool[7132]: X-I.: not found
../../libtool[7132]: X-O2: not found
../../libtool[7132]: X-march=i586: not found
../../libtool[7132]: X-Wall: not found
../../libtool[7132]: X-I../..: not found
../../libtool[7132]: X-Wall: not found
../../libtool[7132]: X-I../../src: not found
../../libtool[7132]: X-march=i586: not found
../../libtool[7132]: X-I/usr/include/openssl: not found
../../libtool[7132]: X-I/usr/include/openssl: not found
../../libtool[7132]: X-I/usr/include/glib-2.0: not found
../../libtool[7132]: X-Wall: not found
../../libtool[7132]: X-MT: not found
../../libtool[7132]: X-I/usr/lib/glib-2.0/include: not found
../../libtool[7132]: X-MT: not found
../../libtool[7132]: X-I/usr/include/openssl: not found
../../libtool[7132]: Xget.lo: not found
../../libtool[7132]: X-MT: not found
../../libtool[7132]: X-O2: not found
../../libtool[7132]: Xparse.lo: not found
../../libtool[7132]: X-MD: not found
../../libtool[7132]: X-march=i586: not found
../../libtool[7132]: X-MD: not found
../../libtool[7132]: Xset.lo: not found
../../libtool[7132]: X-MP: not found
../../libtool[7132]: X-Wall: not found
../../libtool[7132]: X-MP: not found
../../libtool[7132]: X-MD: not found
../../libtool[7132]: X-MF: not found
../../libtool[7132]: X-I/usr/include/openssl: not found
../../libtool[7132]: X-MF: not found
../../libtool[7132]: X-MP: not found
../../libtool[7132]: X.deps/get.Tpo: not found
../../libtool[7132]: X-MF: not found
../../libtool[7132]: X.deps/parse.Tpo: not found
../../libtool[7132]: X-c: not found
../../libtool[7132]: X-MT: not found
../../libtool[7132]: X.deps/set.Tpo: not found
../../libtool[7132]: Xget.lo: not found
../../libtool[7132]: Xwrite.lo: not found
../../libtool[7132]: libtool: compile: cannot determine name of library object from `': not found
../../libtool[7132]: X-c: not found
../../libtool[7132]: X-c: not found
../../libtool[7132]: X-MD: not found
../../libtool[7132]: Xparse.lo: not found
make[3]: *** [get.lo] Error 1
make[3]: *** Waiting for unfinished jobs....
../../libtool[7132]: Xset.lo: not found
../../libtool[7132]: X-MP: not found
../../libtool[7132]: libtool: compile: cannot determine name of library object from `': not found
../../libtool[7132]: libtool: compile: cannot determine name of library object from `': not found
../../libtool[7132]: X-MF: not found
make[3]: *** [parse.lo] Error 1
../../libtool[7132]: X.deps/write.Tpo: not found
make[3]: *** [set.lo] Error 1
../../libtool[7132]: X-c: not found
../../libtool[7132]: Xwrite.lo: not found
../../libtool[7132]: libtool: compile: cannot determine name of library object from `': not found
make[3]: *** [write.lo] Error 1
make[3]: Leaving directory `/tmp/B.e1f01ae4-f6e6-47c7-878a-0af53559bf9f/BUILD/irssi-0.8.15/src/lib-config'
make[2]: *** [all-recursive] Error 1
make[2]: Leaving directory `/tmp/B.e1f01ae4-f6e6-47c7-878a-0af53559bf9f/BUILD/irssi-0.8.15/src'
make[1]: *** [all-recursive] Error 1
make[1]: Leaving directory `/tmp/B.e1f01ae4-f6e6-47c7-878a-0af53559bf9f/BUILD/irssi-0.8.15'
make: *** [all] Error 2
error: Bad exit status from /tmp/B.e1f01ae4-f6e6-47c7-878a-0af53559bf9f/BUILD/tmp/rpm-tmp.37002 (%build)


RPM build errors:
    Bad exit status from /tmp/B.e1f01ae4-f6e6-47c7-878a-0af53559bf9f/BUILD/tmp/rpm-tmp.37002 (%build)
ended at: Mon Apr 27 16:09:50 2015, done in 0:00:13.594722
error: No files produced.
+ chmod -R u+rwX /tmp/B.e1f01ae4-f6e6-47c7-878a-0af53559bf9f/BUILD
+ rm -rf /tmp/B.e1f01ae4-f6e6-47c7-878a-0af53559bf9f/tmp /tmp/B.e1f01ae4-f6e6-47c7-878a-0af53559bf9f/BUILD
+ rm -rf /tmp/B.e1f01ae4-f6e6-47c7-878a-0af53559bf9f
Begin-PLD-Builder-Info
Build-Time: user:10.09s sys:0.95s real:15.01s (faults io:0 non-io:815514)

End-PLD-Builder-Info
[Back to list of logs] [View rpm -qa of builder]