FailedOk

th/SRPMS[OK]
th/x32[OK]
th/i686[OK]
th/x86_64[OK]

ac/SRPMS[OK]
ac/i386[OK]
ac/i586[OK]
ac/i686[OK]
ac/alpha[OK]
ac/amd64[OK]
ac/athlon[OK]
ac/ppc[OK]
ac/sparc[OK]
ac/sparc64[OK]

Advanced Search
main()
Powered by PLD Linux
(c) 2002-2018 PLD Team
$Revision: 1.37 $
Powered by Multics.
Your IP: 54.235.48.106

perl-Net-SSLeay 0e05a4fb-88c3-4590-80de-a35b28791b00

Status:Failed
Source URL:ftp://buildlogs.pld-linux.org/ac/i586/FAIL/perl-Net-SSLeay,0e05a4fb-88c3-4590-80de-a35b28791b00.bz2
text/plain URL:View!
full text:View!
rpm -qa of builder:View!
Date:2015/03/28 14:28:29
Runtime:0:00:03.700076

Toc:

  • error 1
  • SSLeay.c:3357: error: `LHASH' undeclared (first use in this function)
  • error 2
  • SSLeay.c:3357: error: (Each undeclared identifier is reported only once
  • error 3
  • SSLeay.c:3357: error: for each function it appears in.)
  • error 4
  • SSLeay.c:3357: error: `RETVAL' undeclared (first use in this function)
  • error 5
  • error: Bad exit status from /tmp/B.fca13d43-6805-4622-8e51-8b685cd9f5a3/BUILD/tmp/rpm-tmp.14358 (%build)
  • error 6
  • RPM build errors:
  • error 7
  • error: No files produced.

Content:

checking if we should skip the build
started at: Sat Mar 28 14:28:25 2015
fetching http://ep09.pld-linux.org/~buildsrc/srpms/0e05a4fb-88c3-4590-80de-a35b28791b00/perl-Net-SSLeay-1.30-1.src.rpm
fetched 89564 bytes, 1104.8 K/s
installing srpm: perl-Net-SSLeay-1.30-1.src.rpm
+ install -d /tmp/B.fca13d43-6805-4622-8e51-8b685cd9f5a3/BUILD /tmp/B.fca13d43-6805-4622-8e51-8b685cd9f5a3/RPMS
+ rpm -Uhv --nodeps --define '_topdir /tmp/B.fca13d43-6805-4622-8e51-8b685cd9f5a3' --define '_specdir %{_topdir}' --define '_sourcedir %{_specdir}' --define '_rpmdir %{_topdir}/RPMS' --define '_builddir %{_topdir}/BUILD' perl-Net-SSLeay-1.30-1.src.rpm
warning: perl-Net-SSLeay-1.30-1.src.rpm: Header V4 DSA signature: NOKEY, key ID c890bd6f
perl-Net-SSLeay             ##################################################
+ rm -f perl-Net-SSLeay-1.30-1.src.rpm
+ install -m 700 -d /tmp/B.fca13d43-6805-4622-8e51-8b685cd9f5a3/BUILD/tmp
+ TMPDIR=/tmp/B.fca13d43-6805-4622-8e51-8b685cd9f5a3/BUILD/tmp
+ exec nice -n 19 rpmbuild -bp --short-circuit --nodeps --define '_topdir /tmp/B.fca13d43-6805-4622-8e51-8b685cd9f5a3' --define '_specdir %{_topdir}' --define '_sourcedir %{_specdir}' --define '_rpmdir %{_topdir}/RPMS' --define '_builddir %{_topdir}/BUILD' --target i586-pld-linux --define 'prep exit 0' /tmp/B.fca13d43-6805-4622-8e51-8b685cd9f5a3/perl-Net-SSLeay.spec
Building target platforms: i586-pld-linux
checking BuildConflict-ing packages
no BuildConflicts found
checking BR
rpm: Building target platforms: i586-pld-linux
no BR needed
building RPM using: set -ex; : build-id: 0e05a4fb-88c3-4590-80de-a35b28791b00; TMPDIR=/tmp/B.fca13d43-6805-4622-8e51-8b685cd9f5a3/BUILD/tmp exec nice -n 19 rpmbuild -bb --define '_smp_mflags -j4' --define '_pld_builder 1' --define '_topdir /tmp/B.fca13d43-6805-4622-8e51-8b685cd9f5a3' --define '_specdir %{_topdir}' --define '_sourcedir %{_specdir}' --define '_rpmdir %{_topdir}/RPMS' --define '_builddir %{_topdir}/BUILD'  --target i586-pld-linux /tmp/B.fca13d43-6805-4622-8e51-8b685cd9f5a3/perl-Net-SSLeay.spec
+ : build-id: 0e05a4fb-88c3-4590-80de-a35b28791b00
+ TMPDIR=/tmp/B.fca13d43-6805-4622-8e51-8b685cd9f5a3/BUILD/tmp
+ exec nice -n 19 rpmbuild -bb --define '_smp_mflags -j4' --define '_pld_builder 1' --define '_topdir /tmp/B.fca13d43-6805-4622-8e51-8b685cd9f5a3' --define '_specdir %{_topdir}' --define '_sourcedir %{_specdir}' --define '_rpmdir %{_topdir}/RPMS' --define '_builddir %{_topdir}/BUILD' --target i586-pld-linux /tmp/B.fca13d43-6805-4622-8e51-8b685cd9f5a3/perl-Net-SSLeay.spec
Building target platforms: i586-pld-linux
Executing(%prep): env -i PATH=/bin:/usr/bin:/usr/local/bin:/usr/X11R6/bin:/home/services/builder/bin HOME=/home/services/builder TMPDIR=/tmp/B.fca13d43-6805-4622-8e51-8b685cd9f5a3/BUILD/tmp  /bin/sh -e /tmp/B.fca13d43-6805-4622-8e51-8b685cd9f5a3/BUILD/tmp/rpm-tmp.14358
+ umask 022
+ cd /tmp/B.fca13d43-6805-4622-8e51-8b685cd9f5a3/BUILD
+ cd /tmp/B.fca13d43-6805-4622-8e51-8b685cd9f5a3/BUILD
+ rm -rf Net_SSLeay.pm-1.30
+ /bin/gzip -dc /tmp/B.fca13d43-6805-4622-8e51-8b685cd9f5a3/Net_SSLeay.pm-1.30.tar.gz
+ tar -xf -
+ STATUS=0
+ [ 0 -ne 0 ]
+ cd Net_SSLeay.pm-1.30
+ /bin/id -u
+ [ 182 = 0 ]
+ true .
+ /bin/chmod -Rf -Rf a+rX,u+w,g-w,o-w .
+ echo Patch #0 (perl-Net-SSLeay-paths.patch):
Patch #0 (perl-Net-SSLeay-paths.patch):
+ patch -p1 -s
+ < /tmp/B.fca13d43-6805-4622-8e51-8b685cd9f5a3/perl-Net-SSLeay-paths.patch 
+ exit 0
Executing(%build): env -i PATH=/bin:/usr/bin:/usr/local/bin:/usr/X11R6/bin:/home/services/builder/bin HOME=/home/services/builder TMPDIR=/tmp/B.fca13d43-6805-4622-8e51-8b685cd9f5a3/BUILD/tmp  /bin/sh -e /tmp/B.fca13d43-6805-4622-8e51-8b685cd9f5a3/BUILD/tmp/rpm-tmp.14358
PATH=/bin:/usr/bin:/usr/local/bin:/usr/X11R6/bin:/home/services/builder/bin
HOME=/home/services/builder
TMPDIR=/tmp/B.fca13d43-6805-4622-8e51-8b685cd9f5a3/BUILD/tmp
+ umask 022
+ cd /tmp/B.fca13d43-6805-4622-8e51-8b685cd9f5a3/BUILD
+ cd Net_SSLeay.pm-1.30
+ /usr/bin/perl Makefile.PL /usr INSTALLDIRS=vendor
Checking for OpenSSL-0.9.6j or 0.9.7b or newer...
That's is newer than what this module was tested with (0.9.6j
or 0.9.7b). You should
consider checking if there is a newer release of this module
available. Everything will probably work OK, though.
You have OpenSSL-1.0.1k installed in /usr
*** Could not figure out which C compiler was used to compile /usr/bin/openssl. It is essentiall that OpenSSL, perl, and Net::SSLeay are compiled with the same compiler and flags. Mixing and matching compilers is not supported. at Makefile.PL line 140.
Checking if your kit is complete...
Looks good
Checking if your kit is complete...
Looks good
Writing Makefile for Net::SSLeay::Handle
Writing Makefile for Net::SSLeay
+ /usr/bin/make -j4 OPTIMIZE=-O2 -march=i586 
/usr/bin/perl /usr/share/perl5/5.8.8/ExtUtils/xsubpp  -typemap /usr/share/perl5/5.8.8/ExtUtils/typemap -typemap typemap  SSLeay.xs > SSLeay.xsc && mv SSLeay.xsc SSLeay.c
Running Mkbootstrap for Net::SSLeay ()
make[1]: Entering directory `/tmp/B.fca13d43-6805-4622-8e51-8b685cd9f5a3/BUILD/Net_SSLeay.pm-1.30/Net-SSLeay-Handle-0.50'
chmod 644 SSLeay.bs
cp SSLeay.bs blib/arch/auto/Net/SSLeay/SSLeay.bs
chmod 644 blib/arch/auto/Net/SSLeay/SSLeay.bs
cp ptrtstrun.pl blib/lib/Net/ptrtstrun.pl
cp SSLeay.pm blib/lib/Net/SSLeay.pm
AutoSplitting blib/lib/Net/SSLeay.pm (blib/lib/auto/Net/SSLeay)
blib/lib/Net/SSLeay.pm: some names are not unique when truncated to 8 characters:
 directory blib/lib/auto/Net/SSLeay:
  do_https3.al, do_https2.al, do_https4.al, do_https.al truncate to do_https
  do_httpx3.al, do_httpx2.al, do_httpx4.al truncate to do_httpx
  get_https.al, get_https3.al, get_https4.al, get_http.al, get_http3.al, get_http4.al, get_httpx.al, get_httpx3.al, get_httpx4.al truncate to get_http
  head_https.al, head_https3.al, head_https4.al, head_http.al, head_http3.al, head_http4.al, head_httpx.al, head_httpx3.al, head_httpx4.al truncate to head_htt
  post_https.al, post_https3.al, post_https4.al, post_http.al, post_http3.al, post_http4.al, post_httpx.al, post_httpx3.al, post_httpx4.al truncate to post_htt
  put_https.al, put_https3.al, put_https4.al, put_http.al, put_http3.al, put_http4.al, put_httpx.al, put_httpx3.al, put_httpx4.al truncate to put_http
  ssl_read_all.al, ssl_read_until.al, ssl_read_CRLF.al truncate to ssl_read
  ssl_write_all.al, ssl_write_CRLF.al truncate to ssl_writ
  tcp_read_all.al, tcp_read_until.al, tcp_read_CRLF.al truncate to tcp_read
  tcp_write_all.al, tcp_write_CRLF.al truncate to tcp_writ
cp Handle.pm ../blib/lib/Net/SSLeay/Handle.pm
Manifying ../blib/man3/Net::SSLeay::Handle.3pm
make[1]: Leaving directory `/tmp/B.fca13d43-6805-4622-8e51-8b685cd9f5a3/BUILD/Net_SSLeay.pm-1.30/Net-SSLeay-Handle-0.50'
i586-pld-linux-gcc -c  -I/usr/include -I/usr/inc32 -I/usr/kerberos/include -D_REENTRANT -D_GNU_SOURCE -DTHREADS_HAVE_PIDS -fno-strict-aliasing -pipe -I/usr/local/include -D_LARGEFILE_SOURCE -D_FILE_OFFSET_BITS=64 -O2 -march=i586    -DVERSION=\"1.30\" -DXS_VERSION=\"1.30\" -fPIC "-I/usr/lib/perl5/5.8.8/i586-pld-linux-thread-multi/CORE"  -DPERL5 -DOPENSSL_NO_KRB5 SSLeay.c
SSLeay.c: In function `XS_Net__SSLeay_CTX_sessions':
SSLeay.c:3357: error: `LHASH' undeclared (first use in this function)
SSLeay.c:3357: error: (Each undeclared identifier is reported only once
SSLeay.c:3357: error: for each function it appears in.)
SSLeay.c:3357: error: `RETVAL' undeclared (first use in this function)
SSLeay.c: In function `XS_Net__SSLeay_SSLv2_method':
SSLeay.c:4723: warning: assignment discards qualifiers from pointer target type
SSLeay.c: In function `XS_Net__SSLeay_SSLv3_method':
SSLeay.c:4740: warning: assignment discards qualifiers from pointer target type
SSLeay.c: In function `XS_Net__SSLeay_TLSv1_method':
SSLeay.c:4757: warning: assignment discards qualifiers from pointer target type
SSLeay.c: In function `XS_Net__SSLeay_get_ssl_method':
SSLeay.c:4794: warning: assignment discards qualifiers from pointer target type
SSLeay.c: In function `XS_Net__SSLeay_get_current_cipher':
SSLeay.c:5747: warning: assignment discards qualifiers from pointer target type
make: *** [SSLeay.o] Error 1
error: Bad exit status from /tmp/B.fca13d43-6805-4622-8e51-8b685cd9f5a3/BUILD/tmp/rpm-tmp.14358 (%build)


RPM build errors:
    Bad exit status from /tmp/B.fca13d43-6805-4622-8e51-8b685cd9f5a3/BUILD/tmp/rpm-tmp.14358 (%build)
ended at: Sat Mar 28 14:28:29 2015, done in 0:00:03.700076
error: No files produced.
+ chmod -R u+rwX /tmp/B.fca13d43-6805-4622-8e51-8b685cd9f5a3/BUILD
+ rm -rf /tmp/B.fca13d43-6805-4622-8e51-8b685cd9f5a3/tmp /tmp/B.fca13d43-6805-4622-8e51-8b685cd9f5a3/BUILD
+ rm -rf /tmp/B.fca13d43-6805-4622-8e51-8b685cd9f5a3
Begin-PLD-Builder-Info
Build-Time: user:3.94s sys:0.30s real:4.50s (faults io:28 non-io:127835)

End-PLD-Builder-Info
[Back to list of logs] [View rpm -qa of builder]