FailedOk

th/SRPMS[OK]
th/x32[OK]
th/i686[OK]
th/x86_64[OK]

ac/SRPMS[OK]
ac/i386[OK]
ac/i586[OK]
ac/i686[OK]
ac/alpha[OK]
ac/amd64[OK]
ac/athlon[OK]
ac/ppc[OK]
ac/sparc[OK]
ac/sparc64[OK]

Advanced Search
main()
Powered by PLD Linux
(c) 2002-2019 PLD Team
$Revision: 1.37 $
Powered by Parallel thinking.
Your IP: 35.172.150.239

autoconf a6c33bdf-bdcb-4130-a6d2-de2079cb3068

Status:Failed
Source URL:ftp://buildlogs.pld-linux.org/ac/i686/FAIL/autoconf,a6c33bdf-bdcb-4130-a6d2-de2079cb3068.bz2
text/plain URL:View!
full text:View!
rpm -qa of builder:View!
Date:2010/08/04 17:14:57
Runtime:00

Toc:

  • error 1
  • ERROR: 414 tests were run,
  • error 2
  • make[3]: *** [check-local] Error 1
  • error 3
  • make[2]: *** [check-am] Error 2
  • error 4
  • make[1]: *** [check-recursive] Error 1
  • error 5
  • error: Bad exit status from /tmp/B.4a8aec/rpm-tmp.21158 (%build)
  • error 6
  • RPM build errors:
  • error 7
  • error: No files produced.

Content:

351: AC_PROG_SED                                     ok
352: AC_PROG_YACC                                    ok
353: AC_CHECK_TOOL_PREFIX                            ok
354: AC_DECL_YYTEXT                                  ok
355: AC_RSH                                          ok

Testing autoconf/headers macros.

356: AC_CHECK_HEADERS_ONCE                           ok
357: AC_HEADER_ASSERT                                ok
358: AC_HEADER_MAJOR                                 ok
359: AC_HEADER_RESOLV                                ok
360: AC_HEADER_STAT                                  ok
361: AC_HEADER_STDBOOL                               ok
362: AC_HEADER_TIOCGWINSZ                            ok
363: AC_DIR_HEADER                                   ok
364: AC_MEMORY_H                                     ok
365: AC_UNISTD_H                                     ok
366: AC_USG                                          ok

Testing autoconf/types macros.

367: AC_STRUCT_DIRENT_D_INO                          ok
368: AC_STRUCT_DIRENT_D_TYPE                         ok
369: AC_STRUCT_ST_BLOCKS                             ok
370: AC_STRUCT_TIMEZONE                              ok
371: AC_TYPE_INT16_T                                 ok
372: AC_TYPE_INT32_T                                 ok
373: AC_TYPE_INT64_T                                 ok
374: AC_TYPE_INT8_T                                  ok
375: AC_TYPE_INTMAX_T                                ok
376: AC_TYPE_INTPTR_T                                ok
377: AC_TYPE_LONG_DOUBLE                             ok
378: AC_TYPE_LONG_DOUBLE_WIDER                       ok
379: AC_TYPE_MODE_T                                  ok
380: AC_TYPE_OFF_T                                   ok
381: AC_TYPE_SSIZE_T                                 ok
382: AC_TYPE_UINT16_T                                ok
383: AC_TYPE_UINT32_T                                ok
384: AC_TYPE_UINT64_T                                ok
385: AC_TYPE_UINT8_T                                 ok
386: AC_TYPE_UINTMAX_T                               ok
387: AC_TYPE_UINTPTR_T                               ok
388: AC_C_LONG_DOUBLE                                ok
389: AC_INT_16_BITS                                  ok
390: AC_LONG_64_BITS                                 ok
391: AC_STRUCT_ST_BLKSIZE                            ok
392: AC_STRUCT_ST_RDEV                               ok
393: AC_TYPE_SIGNAL                                  ok
394: AM_TYPE_PTRDIFF_T                               ok

Testing autoconf/functions macros.

395: AC_CHECK_FUNCS_ONCE                             ok
396: AC_FUNC_CHOWN                                   ok
397: AC_FUNC_CLOSEDIR_VOID                           ok
398: AC_FUNC_ERROR_AT_LINE                           ok
399: AC_FUNC_FNMATCH                                 ok
400: AC_FUNC_FORK                                    ok
401: AC_FUNC_FSEEKO                                  ok
402: AC_FUNC_GETGROUPS                               ok
403: AC_FUNC_GETMNTENT                               ok
404: AC_FUNC_GETPGRP                                 ok
405: AC_FUNC_LSTAT                                   ok
406: AC_FUNC_MALLOC                                  ok
407: AC_FUNC_MBRTOWC                                 ok
408: AC_FUNC_MEMCMP                                  ok
409: AC_FUNC_MKTIME                                  ok
410: AC_FUNC_MMAP                                    ok
411: AC_FUNC_OBSTACK                                 ok
412: AC_FUNC_REALLOC                                 ok
413: AC_FUNC_SELECT_ARGTYPES                         ok
414: AC_FUNC_SETPGRP                                 ok
415: AC_FUNC_STAT                                    ok
416: AC_FUNC_STRCOLL                                 ok
417: AC_FUNC_STRERROR_R                              ok
418: AC_FUNC_STRFTIME                                ok
419: AC_FUNC_STRNLEN                                 ok
420: AC_FUNC_STRTOD                                  ok
421: AC_FUNC_STRTOLD                                 ok
422: AC_FUNC_UTIME_NULL                              ok
423: AC_FUNC_VPRINTF                                 ok

Testing autoconf/libs macros.

424: AC_HAVE_LIBRARY                                 ok

Compatibility with other tools.

425: Libtool                                         ok

Autoscan.

426: autoscan                                        ok

## ------------- ##
## Test results. ##
## ------------- ##

ERROR: 414 tests were run,
1 failed unexpectedly.
12 tests were skipped.
## -------------------------- ##
## testsuite.log was created. ##
## -------------------------- ##

Please send `tests/testsuite.log' and all information you think might help:

   To: <bug-autoconf@gnu.org>
   Subject: [GNU Autoconf 2.64] testsuite: 209 failed


You may investigate any problem if you feel able to do so, in which
case the test suite provides a good starting point.  Its output may
be found below `tests/testsuite.dir'.

make[3]: *** [check-local] Error 1
make[3]: Leaving directory `/home/users/builder/rpm/BUILD/autoconf-2.64/tests'
make[2]: *** [check-am] Error 2
make[2]: Leaving directory `/home/users/builder/rpm/BUILD/autoconf-2.64/tests'
make[1]: *** [check-recursive] Error 1
make[1]: Leaving directory `/home/users/builder/rpm/BUILD/autoconf-2.64'
make: *** [check] Error 2
error: Bad exit status from /tmp/B.4a8aec/rpm-tmp.21158 (%build)


RPM build errors:
    Bad exit status from /tmp/B.4a8aec/rpm-tmp.21158 (%build)
ended at: Wed Aug  4 17:14:57 2010, done in 00h 09m 16s
error: No files produced.
Begin-PLD-Builder-Info
Build-Time: user:311.09s sys:60.61s real:560.61s (faults io:336 non-io:48338936)

End-PLD-Builder-Info
[Back to list of logs] [View rpm -qa of builder]