FailedOk

th/SRPMS[OK]
th/x32[OK]
th/i686[OK]
th/x86_64[OK]

ac/SRPMS[OK]
ac/i386[OK]
ac/i586[OK]
ac/i686[OK]
ac/alpha[OK]
ac/amd64[OK]
ac/athlon[OK]
ac/ppc[OK]
ac/sparc[OK]
ac/sparc64[OK]

Advanced Search
main()
Powered by PLD Linux
(c) 2002-2020 PLD Team
$Revision: 1.37 $
Powered by Ken.
Your IP: 3.235.105.97

autoconf bb1520a2-27c2-4930-ae64-a90a6b22fbc3

Status:Failed
Source URL:https://buildlogs.pld-linux.org/pld/ac/i686/FAIL/autoconf,bb1520a2-27c2-4930-ae64-a90a6b22fbc3.bz2
text/plain URL:View!
full text:View!
rpm -qa of builder:View!
Date:2010/07/08 14:14:07
Runtime:00

Toc:

  • error 1
  • ERROR: 461 tests were run,
  • error 2
  • make[3]: *** [check-local] Error 1
  • error 3
  • make[2]: *** [check-am] Error 2
  • error 4
  • make[1]: *** [check-recursive] Error 1
  • error 5
  • error: Bad exit status from /tmp/B.4eb3fe/rpm-tmp.86971 (%build)
  • error 6
  • RPM build errors:
  • error 7
  • error: No files produced.

Content:

398: AC_PROG_YACC                                    ok
399: AC_CHECK_TOOL_PREFIX                            ok
400: AC_DECL_YYTEXT                                  ok
401: AC_RSH                                          ok

Testing autoconf/headers macros.

402: AC_CHECK_HEADERS_ONCE                           ok
403: AC_HEADER_ASSERT                                ok
404: AC_HEADER_MAJOR                                 ok
405: AC_HEADER_RESOLV                                ok
406: AC_HEADER_STAT                                  ok
407: AC_HEADER_STDBOOL                               ok
408: AC_HEADER_TIOCGWINSZ                            ok
409: AC_DIR_HEADER                                   ok
410: AC_MEMORY_H                                     ok
411: AC_UNISTD_H                                     ok
412: AC_USG                                          ok

Testing autoconf/types macros.

413: AC_STRUCT_DIRENT_D_INO                          ok
414: AC_STRUCT_DIRENT_D_TYPE                         ok
415: AC_STRUCT_ST_BLOCKS                             ok
416: AC_STRUCT_TIMEZONE                              ok
417: AC_TYPE_INT16_T                                 ok
418: AC_TYPE_INT32_T                                 ok
419: AC_TYPE_INT64_T                                 ok
420: AC_TYPE_INT8_T                                  ok
421: AC_TYPE_INTMAX_T                                ok
422: AC_TYPE_INTPTR_T                                ok
423: AC_TYPE_LONG_DOUBLE                             ok
424: AC_TYPE_LONG_DOUBLE_WIDER                       ok
425: AC_TYPE_MODE_T                                  ok
426: AC_TYPE_OFF_T                                   ok
427: AC_TYPE_SSIZE_T                                 ok
428: AC_TYPE_UINT16_T                                ok
429: AC_TYPE_UINT32_T                                ok
430: AC_TYPE_UINT64_T                                ok
431: AC_TYPE_UINT8_T                                 ok
432: AC_TYPE_UINTMAX_T                               ok
433: AC_TYPE_UINTPTR_T                               ok
434: AC_C_LONG_DOUBLE                                ok
435: AC_INT_16_BITS                                  ok
436: AC_LONG_64_BITS                                 ok
437: AC_STRUCT_ST_BLKSIZE                            ok
438: AC_STRUCT_ST_RDEV                               ok
439: AC_TYPE_SIGNAL                                  ok
440: AM_TYPE_PTRDIFF_T                               ok

Testing autoconf/functions macros.

441: AC_CHECK_FUNCS_ONCE                             ok
442: AC_FUNC_CHOWN                                   ok
443: AC_FUNC_CLOSEDIR_VOID                           ok
444: AC_FUNC_ERROR_AT_LINE                           ok
445: AC_FUNC_FNMATCH                                 ok
446: AC_FUNC_FORK                                    ok
447: AC_FUNC_FSEEKO                                  ok
448: AC_FUNC_GETGROUPS                               ok
449: AC_FUNC_GETMNTENT                               ok
450: AC_FUNC_GETPGRP                                 ok
451: AC_FUNC_LSTAT                                   ok
452: AC_FUNC_MALLOC                                  ok
453: AC_FUNC_MBRTOWC                                 ok
454: AC_FUNC_MEMCMP                                  ok
455: AC_FUNC_MKTIME                                  ok
456: AC_FUNC_MMAP                                    ok
457: AC_FUNC_OBSTACK                                 ok
458: AC_FUNC_REALLOC                                 ok
459: AC_FUNC_SELECT_ARGTYPES                         ok
460: AC_FUNC_SETPGRP                                 ok
461: AC_FUNC_STAT                                    ok
462: AC_FUNC_STRCOLL                                 ok
463: AC_FUNC_STRERROR_R                              ok
464: AC_FUNC_STRFTIME                                ok
465: AC_FUNC_STRNLEN                                 ok
466: AC_FUNC_STRTOD                                  ok
467: AC_FUNC_STRTOLD                                 ok
468: AC_FUNC_UTIME_NULL                              ok
469: AC_FUNC_VPRINTF                                 ok

Testing autoconf/libs macros.

470: AC_HAVE_LIBRARY                                 ok

Compatibility with other tools.

471: Libtool                                         skipped (foreign.at:33)
472: shtool                                          ok

Autoscan.

473: autoscan                                        ok

## ------------- ##
## Test results. ##
## ------------- ##

ERROR: 461 tests were run,
6 failed (4 expected failures).
12 tests were skipped.
## -------------------------- ##
## testsuite.log was created. ##
## -------------------------- ##

Please send `tests/testsuite.log' and all information you think might help:

   To: <bug-autoconf@gnu.org>
   Subject: [GNU Autoconf 2.66] testsuite: 304 306 failed

You may investigate any problem if you feel able to do so, in which
case the test suite provides a good starting point.  Its output may
be found below `tests/testsuite.dir'.

make[3]: *** [check-local] Error 1
make[3]: Leaving directory `/home/users/builder/rpm/BUILD/autoconf-2.66/tests'
make[2]: *** [check-am] Error 2
make[2]: Leaving directory `/home/users/builder/rpm/BUILD/autoconf-2.66/tests'
make[1]: *** [check-recursive] Error 1
make[1]: Leaving directory `/home/users/builder/rpm/BUILD/autoconf-2.66'
make: *** [check] Error 2
error: Bad exit status from /tmp/B.4eb3fe/rpm-tmp.86971 (%build)


RPM build errors:
    Bad exit status from /tmp/B.4eb3fe/rpm-tmp.86971 (%build)
ended at: Thu Jul  8 14:14:07 2010, done in 00h 10m 54s
error: No files produced.
Begin-PLD-Builder-Info
Build-Time: user:340.12s sys:70.25s real:656.51s (faults io:191 non-io:54787673)

End-PLD-Builder-Info
[Back to list of logs] [View rpm -qa of builder]