FailedOk

th/SRPMS[OK]
th/x32[OK]
th/i686[OK]
th/x86_64[OK]

ac/SRPMS[OK]
ac/i386[OK]
ac/i586[OK]
ac/i686[OK]
ac/alpha[OK]
ac/amd64[OK]
ac/athlon[OK]
ac/ppc[OK]
ac/sparc[OK]
ac/sparc64[OK]

Advanced Search
main()
Powered by PLD Linux
(c) 2002-2019 PLD Team
$Revision: 1.37 $
Powered by /dev/zero.
Your IP: 35.175.120.174

php-ext-pimple 7fc5b610-7390-4336-8458-badb4b1fe06c

Status:Failed
Source URL:ftp://buildlogs.pld-linux.org/ac/i686/FAIL/php-ext-pimple,7fc5b610-7390-4336-8458-badb4b1fe06c.bz2
text/plain URL:View!
rpm -qa of builder:View!
Date:2015/05/08 19:41:20
Runtime:0:00:03.818452

Toc:

  • error 1
  • rpm: error: Failed build dependencies:
  • error 2
  • rpm: error: Failed build dependencies:
  • prep
  • Executing(%prep): env -i PATH=/bin:/usr/bin:/usr/local/bin:/usr/X11R6/bin:/home/services/builder/bin HOME=/home/services/builder TMPDIR=/tmp/B.270d76df-5ba6-47bf-ad07-b2bc90441a98/BUILD/tmp /bin/sh -e /tmp/B.270d76df-5ba6-47bf-ad07-b2bc90441a98/BUILD/tmp/rpm-tmp.76241
  • build
  • Executing(%build): env -i PATH=/bin:/usr/bin:/usr/local/bin:/usr/X11R6/bin:/home/services/builder/bin HOME=/home/services/builder TMPDIR=/tmp/B.270d76df-5ba6-47bf-ad07-b2bc90441a98/BUILD/tmp /bin/sh -e /tmp/B.270d76df-5ba6-47bf-ad07-b2bc90441a98/BUILD/tmp/rpm-tmp.76241
  • error 3
  • /tmp/B.270d76df-5ba6-47bf-ad07-b2bc90441a98/BUILD/php-ext-pimple-3.0.0/pimple.c:161: error: `PHP_FE_END' undeclared here (not in a function)
  • error 4
  • /tmp/B.270d76df-5ba6-47bf-ad07-b2bc90441a98/BUILD/php-ext-pimple-3.0.0/pimple.c:161: error: initializer element is not constant
  • error 5
  • /tmp/B.270d76df-5ba6-47bf-ad07-b2bc90441a98/BUILD/php-ext-pimple-3.0.0/pimple.c:161: error: (near initialization for `pimple_ce_functions[11]')
  • error 6
  • /tmp/B.270d76df-5ba6-47bf-ad07-b2bc90441a98/BUILD/php-ext-pimple-3.0.0/pimple.c:166: error: initializer element is not constant
  • error 7
  • /tmp/B.270d76df-5ba6-47bf-ad07-b2bc90441a98/BUILD/php-ext-pimple-3.0.0/pimple.c:166: error: (near initialization for `pimple_closure_ce_functions[1]')
  • error 8
  • /tmp/B.270d76df-5ba6-47bf-ad07-b2bc90441a98/BUILD/php-ext-pimple-3.0.0/pimple.c:171: error: initializer element is not constant
  • error 9
  • /tmp/B.270d76df-5ba6-47bf-ad07-b2bc90441a98/BUILD/php-ext-pimple-3.0.0/pimple.c:171: error: (near initialization for `pimple_serviceprovider_iface_ce_functions[1]')
  • error 10
  • /tmp/B.270d76df-5ba6-47bf-ad07-b2bc90441a98/BUILD/php-ext-pimple-3.0.0/pimple.c:426: error: structure has no member named `object_ptr'
  • error 11
  • /tmp/B.270d76df-5ba6-47bf-ad07-b2bc90441a98/BUILD/php-ext-pimple-3.0.0/pimple.c:426: error: structure has no member named `object_ptr'
  • error 12
  • /tmp/B.270d76df-5ba6-47bf-ad07-b2bc90441a98/BUILD/php-ext-pimple-3.0.0/pimple.c:439: error: structure has no member named `object_ptr'
  • error 13
  • /tmp/B.270d76df-5ba6-47bf-ad07-b2bc90441a98/BUILD/php-ext-pimple-3.0.0/pimple.c:439: error: structure has no member named `object_ptr'
  • error 14
  • /tmp/B.270d76df-5ba6-47bf-ad07-b2bc90441a98/BUILD/php-ext-pimple-3.0.0/pimple.c:454: error: structure has no member named `called_scope'
  • error 15
  • /tmp/B.270d76df-5ba6-47bf-ad07-b2bc90441a98/BUILD/php-ext-pimple-3.0.0/pimple.c:458: error: structure has no member named `get_closure'
  • error 16
  • /tmp/B.270d76df-5ba6-47bf-ad07-b2bc90441a98/BUILD/php-ext-pimple-3.0.0/pimple.c:458: error: structure has no member named `get_closure'
  • error 17
  • /tmp/B.270d76df-5ba6-47bf-ad07-b2bc90441a98/BUILD/php-ext-pimple-3.0.0/pimple.c:458: error: structure has no member named `object_ptr'
  • error 18
  • /tmp/B.270d76df-5ba6-47bf-ad07-b2bc90441a98/BUILD/php-ext-pimple-3.0.0/pimple.c:459: error: structure has no member named `called_scope'
  • error 19
  • error: Bad exit status from /tmp/B.270d76df-5ba6-47bf-ad07-b2bc90441a98/BUILD/tmp/rpm-tmp.76241 (%build)
  • error 20
  • RPM build errors:
  • error 21
  • error: No files produced.

Content:

request from: glen
checking if we should skip the build
started at: Fri May  8 19:41:06 2015
fetching http://ep09.pld-linux.org/~buildsrc/srpms/7fc5b610-7390-4336-8458-badb4b1fe06c/php-ext-pimple-3.0.0-1.src.rpm
fetched 30283 bytes, 399.5 K/s
installing srpm: php-ext-pimple-3.0.0-1.src.rpm
+ install -d /tmp/B.270d76df-5ba6-47bf-ad07-b2bc90441a98/BUILD /tmp/B.270d76df-5ba6-47bf-ad07-b2bc90441a98/RPMS
+ rpm -Uhv --nodeps --define '_topdir /tmp/B.270d76df-5ba6-47bf-ad07-b2bc90441a98' --define '_specdir %{_topdir}' --define '_sourcedir %{_specdir}' --define '_rpmdir %{_topdir}/RPMS' --define '_builddir %{_topdir}/BUILD' php-ext-pimple-3.0.0-1.src.rpm
warning: php-ext-pimple-3.0.0-1.src.rpm: Header V4 DSA signature: NOKEY, key ID 793aa535
php-ext-pimple              ##################################################
+ rm -f php-ext-pimple-3.0.0-1.src.rpm
+ install -m 700 -d /tmp/B.270d76df-5ba6-47bf-ad07-b2bc90441a98/BUILD/tmp
+ TMPDIR=/tmp/B.270d76df-5ba6-47bf-ad07-b2bc90441a98/BUILD/tmp
+ exec nice -n 19 rpmbuild -bp --short-circuit --nodeps --define '_topdir /tmp/B.270d76df-5ba6-47bf-ad07-b2bc90441a98' --define '_specdir %{_topdir}' --define '_sourcedir %{_specdir}' --define '_rpmdir %{_topdir}/RPMS' --define '_builddir %{_topdir}/BUILD' --target i686-pld-linux --define 'prep exit 0' /tmp/B.270d76df-5ba6-47bf-ad07-b2bc90441a98/php-ext-pimple.spec
sh: php-config: not found
Building target platforms: i686-pld-linux
checking BuildConflict-ing packages
no BuildConflicts found
checking BR
rpm: sh: php-config: not found
rpm: error: Failed build dependencies:
rpm: 	php-devel is needed by php-ext-pimple-3.0.0-1.src
rpm: Building target platforms: i686-pld-linux
updating poldek cache...

Retrieving ac-main::packages.ndir.md...
ac-main is up to date

Retrieving ac-updates::packages.ndir.md...
ac-updates is up to date

Retrieving okas::packages.ndir.md...
okas is up to date
checking conflicting packages in BRed packages
poldek: Loading [pndir]okas...
poldek: Loading [dir]ready...
poldek: Loading [pndir]ac-main...
poldek: Loading [pndir]ac-updates...
poldek: 20008 packages read
poldek: Removed 4285 duplicate packages from available set
poldek: Processing dependencies...
poldek: There are 1 package to install:
poldek: I php-devel-5.2.17-20130717.8.i686
poldek: This operation will use 2.4MB of disk space.
poldek: Need to get 387.9KB of archives (387.9KB to download).
poldek: 
poldek: Retrieving ac-updates::php-devel-5.2.17-20130717.8.i686.rpm...
poldek: ..............................done
poldek: Executing rpm --upgrade -vh --test --root / --define _check_dirname_deps 0...
poldek: Preparing...                ##################################################
no conflicts found
checking BR
rpm: sh: php-config: not found
rpm: error: Failed build dependencies:
rpm: 	php-devel is needed by php-ext-pimple-3.0.0-1.src
rpm: Building target platforms: i686-pld-linux
installing BR: php\-devel
Loading [pndir]okas...
Loading [dir]ready...
Loading [pndir]ac-main...
Loading [pndir]ac-updates...
20008 packages read
Removed 4285 duplicate packages from available set
Processing dependencies...
There are 1 package to install:
I php-devel-5.2.17-20130717.8.i686
This operation will use 2.4MB of disk space.
Need to get 387.9KB of archives. 
Executing rpm --upgrade -vh --root / --define _check_dirname_deps 0...
Preparing...                ##################################################
php-devel                   ##################################################
building RPM using: set -ex; : build-id: 7fc5b610-7390-4336-8458-badb4b1fe06c; TMPDIR=/tmp/B.270d76df-5ba6-47bf-ad07-b2bc90441a98/BUILD/tmp exec nice -n 19 rpmbuild -bb --define '_smp_mflags -j4' --define '_pld_builder 1' --define '_topdir /tmp/B.270d76df-5ba6-47bf-ad07-b2bc90441a98' --define '_specdir %{_topdir}' --define '_sourcedir %{_specdir}' --define '_rpmdir %{_topdir}/RPMS' --define '_builddir %{_topdir}/BUILD'  --target i686-pld-linux /tmp/B.270d76df-5ba6-47bf-ad07-b2bc90441a98/php-ext-pimple.spec
+ : build-id: 7fc5b610-7390-4336-8458-badb4b1fe06c
+ TMPDIR=/tmp/B.270d76df-5ba6-47bf-ad07-b2bc90441a98/BUILD/tmp
+ exec nice -n 19 rpmbuild -bb --define '_smp_mflags -j4' --define '_pld_builder 1' --define '_topdir /tmp/B.270d76df-5ba6-47bf-ad07-b2bc90441a98' --define '_specdir %{_topdir}' --define '_sourcedir %{_specdir}' --define '_rpmdir %{_topdir}/RPMS' --define '_builddir %{_topdir}/BUILD' --target i686-pld-linux /tmp/B.270d76df-5ba6-47bf-ad07-b2bc90441a98/php-ext-pimple.spec
Building target platforms: i686-pld-linux
Executing(%prep): env -i PATH=/bin:/usr/bin:/usr/local/bin:/usr/X11R6/bin:/home/services/builder/bin HOME=/home/services/builder TMPDIR=/tmp/B.270d76df-5ba6-47bf-ad07-b2bc90441a98/BUILD/tmp  /bin/sh -e /tmp/B.270d76df-5ba6-47bf-ad07-b2bc90441a98/BUILD/tmp/rpm-tmp.76241
+ umask 022
+ cd /tmp/B.270d76df-5ba6-47bf-ad07-b2bc90441a98/BUILD
+ cd /tmp/B.270d76df-5ba6-47bf-ad07-b2bc90441a98/BUILD
+ rm -rf php-ext-pimple-3.0.0
+ /bin/mkdir -p php-ext-pimple-3.0.0
+ cd php-ext-pimple-3.0.0
+ /bin/gzip -dc /tmp/B.270d76df-5ba6-47bf-ad07-b2bc90441a98/pimple-3.0.0.tar.gz
+ tar -xf -
+ STATUS=0
+ [ 0 -ne 0 ]
+ /bin/id -u
+ [ 182 = 0 ]
+ true .
+ /bin/chmod -Rf -Rf a+rX,u+w,g-w,o-w .
+ mv Pimple-3.0.0/ext/pimple/README.md Pimple-3.0.0/ext/pimple/config.m4 Pimple-3.0.0/ext/pimple/config.w32 Pimple-3.0.0/ext/pimple/php_pimple.h Pimple-3.0.0/ext/pimple/pimple.c Pimple-3.0.0/ext/pimple/pimple_compat.h Pimple-3.0.0/ext/pimple/tests .
+ /bin/rm --interactive=never tests/015.phpt
+ exit 0
Executing(%build): env -i PATH=/bin:/usr/bin:/usr/local/bin:/usr/X11R6/bin:/home/services/builder/bin HOME=/home/services/builder TMPDIR=/tmp/B.270d76df-5ba6-47bf-ad07-b2bc90441a98/BUILD/tmp  /bin/sh -e /tmp/B.270d76df-5ba6-47bf-ad07-b2bc90441a98/BUILD/tmp/rpm-tmp.76241
PATH=/bin:/usr/bin:/usr/local/bin:/usr/X11R6/bin:/home/services/builder/bin
HOME=/home/services/builder
TMPDIR=/tmp/B.270d76df-5ba6-47bf-ad07-b2bc90441a98/BUILD/tmp
+ umask 022
+ cd /tmp/B.270d76df-5ba6-47bf-ad07-b2bc90441a98/BUILD
+ cd php-ext-pimple-3.0.0
+ phpize
Configuring for:
PHP Api Version:         20041225
Zend Module Api No:      20060613
Zend Extension Api No:   220060519
configure.in:3: warning: prefer named diversions
configure.in:3: warning: prefer named diversions
+ ./configure LDFLAGS=-Wl,--as-needed  CFLAGS=-O2 -march=i686  CXXFLAGS=-O2 -march=i686  FFLAGS=-O2 -march=i686  FCFLAGS=-O2 -march=i686  CPPFLAGS= CC=i686-pld-linux-gcc CXX=i686-pld-linux-g++ --host=i686-pld-linux --build=i686-pld-linux --prefix=/usr --exec-prefix=/usr --bindir=/usr/bin --sbindir=/usr/sbin --sysconfdir=/etc --datadir=/usr/share --includedir=/usr/include --libdir=/usr/lib --libexecdir=/usr/lib --localstatedir=/var --sharedstatedir=/var/lib --mandir=/usr/share/man --infodir=/usr/share/info --x-libraries=/usr/X11R6/lib
checking for grep that handles long lines and -e... /bin/grep
checking for egrep... /bin/grep -E
checking for a sed that does not truncate output... /bin/sed
checking for i686-pld-linux-cc... i686-pld-linux-gcc
checking whether the C compiler works... yes
checking for C compiler default output file name... a.out
checking for suffix of executables... 
checking whether we are cross compiling... no
checking for suffix of object files... o
checking whether we are using the GNU C compiler... yes
checking whether i686-pld-linux-gcc accepts -g... yes
checking for i686-pld-linux-gcc option to accept ISO C89... none needed
checking how to run the C preprocessor... i686-pld-linux-gcc -E
checking for icc... no
checking for suncc... no
checking whether i686-pld-linux-gcc and cc understand -c and -o together... yes
checking for system library directory... lib
checking if compiler supports -R... no
checking if compiler supports -Wl,-rpath,... yes
checking build system type... i686-pld-linux-gnu
checking host system type... i686-pld-linux-gnu
checking target system type... i686-pld-linux-gnu
checking for PHP prefix... /usr
checking for PHP includes... -I/usr/include/php -I/usr/include/php/main -I/usr/include/php/TSRM -I/usr/include/php/Zend -I/usr/include/php/ext -I/usr/include/php/ext/date/lib
checking for PHP extension directory... /usr/lib/php
checking for PHP installed headers prefix... /usr/include/php
checking if debug is enabled... no
checking if zts is enabled... no
checking for re2c... re2c
checking for re2c version... 0.13.5 (ok)
checking for gawk... gawk
checking whether to enable pimple support... yes, shared
checking for ld used by i686-pld-linux-gcc... /usr/bin/ld
checking if the linker (/usr/bin/ld) is GNU ld... yes
checking for /usr/bin/ld option to reload object files... -r
checking for BSD-compatible nm... /usr/bin/nm -B
checking whether ln -s works... yes
checking how to recognize dependent libraries... pass_all
checking for ANSI C header files... yes
checking for sys/types.h... yes
checking for sys/stat.h... yes
checking for stdlib.h... yes
checking for string.h... yes
checking for memory.h... yes
checking for strings.h... yes
checking for inttypes.h... yes
checking for stdint.h... yes
checking for unistd.h... yes
checking dlfcn.h usability... yes
checking dlfcn.h presence... yes
checking for dlfcn.h... yes
checking for i686-pld-linux-g77... no
checking for i686-pld-linux-xlf... no
checking for i686-pld-linux-f77... no
checking for i686-pld-linux-frt... no
checking for i686-pld-linux-pgf77... no
checking for i686-pld-linux-cf77... no
checking for i686-pld-linux-fort77... no
checking for i686-pld-linux-fl32... no
checking for i686-pld-linux-af77... no
checking for i686-pld-linux-xlf90... no
checking for i686-pld-linux-f90... no
checking for i686-pld-linux-pgf90... no
checking for i686-pld-linux-pghpf... no
checking for i686-pld-linux-epcf90... no
checking for i686-pld-linux-gfortran... no
checking for i686-pld-linux-g95... no
checking for i686-pld-linux-xlf95... no
checking for i686-pld-linux-f95... no
checking for i686-pld-linux-fort... no
checking for i686-pld-linux-ifort... no
checking for i686-pld-linux-ifc... no
checking for i686-pld-linux-efc... no
checking for i686-pld-linux-pgfortran... no
checking for i686-pld-linux-pgf95... no
checking for i686-pld-linux-lf95... no
checking for i686-pld-linux-ftn... no
checking for g77... no
checking for xlf... no
checking for f77... no
checking for frt... no
checking for pgf77... no
checking for cf77... no
checking for fort77... no
checking for fl32... no
checking for af77... no
checking for xlf90... no
checking for f90... no
checking for pgf90... no
checking for pghpf... no
checking for epcf90... no
checking for gfortran... no
checking for g95... no
checking for xlf95... no
checking for f95... no
checking for fort... no
checking for ifort... no
checking for ifc... no
checking for efc... no
checking for pgfortran... no
checking for pgf95... no
checking for lf95... no
checking for ftn... no
checking whether we are using the GNU Fortran 77 compiler... no
checking whether  accepts -g... no
checking the maximum length of command line arguments... 98304
checking command to parse /usr/bin/nm -B output from i686-pld-linux-gcc object... ok
checking for objdir... .libs
checking for i686-pld-linux-ar... no
checking for ar... ar
checking for i686-pld-linux-ranlib... no
checking for ranlib... ranlib
checking for i686-pld-linux-strip... no
checking for strip... strip
checking if i686-pld-linux-gcc supports -fno-rtti -fno-exceptions... no
checking for i686-pld-linux-gcc option to produce PIC... -fPIC
checking if i686-pld-linux-gcc PIC flag -fPIC works... yes
checking if i686-pld-linux-gcc static flag -static works... yes
checking if i686-pld-linux-gcc supports -c -o file.o... yes
checking whether the i686-pld-linux-gcc linker (/usr/bin/ld) supports shared libraries... yes
checking whether -lc should be explicitly linked in... no
checking dynamic linker characteristics... GNU/Linux ld.so
checking how to hardcode library paths into programs... immediate
checking whether stripping libraries is possible... yes
checking if libtool supports shared libraries... yes
checking whether to build shared libraries... yes
checking whether to build static libraries... no
configure: creating libtool
appending configuration tag "CXX" to libtool
checking whether the i686-pld-linux-g++ linker (/usr/bin/ld) supports shared libraries... yes
checking for i686-pld-linux-g++ option to produce PIC... 
checking if i686-pld-linux-g++ static flag  works... yes
checking if i686-pld-linux-g++ supports -c -o file.o... yes
checking whether the i686-pld-linux-g++ linker (/usr/bin/ld) supports shared libraries... yes
checking dynamic linker characteristics... GNU/Linux ld.so
(cached) (cached) checking how to hardcode library paths into programs... unsupported
appending configuration tag "F77" to libtool
configure: creating ./config.status
config.status: creating config.h
+ /usr/bin/make -j4
/bin/sh /tmp/B.270d76df-5ba6-47bf-ad07-b2bc90441a98/BUILD/php-ext-pimple-3.0.0/libtool --mode=compile i686-pld-linux-gcc  -I. -I/tmp/B.270d76df-5ba6-47bf-ad07-b2bc90441a98/BUILD/php-ext-pimple-3.0.0 -DPHP_ATOM_INC -I/tmp/B.270d76df-5ba6-47bf-ad07-b2bc90441a98/BUILD/php-ext-pimple-3.0.0/include -I/tmp/B.270d76df-5ba6-47bf-ad07-b2bc90441a98/BUILD/php-ext-pimple-3.0.0/main -I/tmp/B.270d76df-5ba6-47bf-ad07-b2bc90441a98/BUILD/php-ext-pimple-3.0.0 -I/usr/include/php -I/usr/include/php/main -I/usr/include/php/TSRM -I/usr/include/php/Zend -I/usr/include/php/ext -I/usr/include/php/ext/date/lib  -DHAVE_CONFIG_H  -O2 -march=i686   -c /tmp/B.270d76df-5ba6-47bf-ad07-b2bc90441a98/BUILD/php-ext-pimple-3.0.0/pimple.c -o pimple.lo 
mkdir .libs
 i686-pld-linux-gcc -I. -I/tmp/B.270d76df-5ba6-47bf-ad07-b2bc90441a98/BUILD/php-ext-pimple-3.0.0 -DPHP_ATOM_INC -I/tmp/B.270d76df-5ba6-47bf-ad07-b2bc90441a98/BUILD/php-ext-pimple-3.0.0/include -I/tmp/B.270d76df-5ba6-47bf-ad07-b2bc90441a98/BUILD/php-ext-pimple-3.0.0/main -I/tmp/B.270d76df-5ba6-47bf-ad07-b2bc90441a98/BUILD/php-ext-pimple-3.0.0 -I/usr/include/php -I/usr/include/php/main -I/usr/include/php/TSRM -I/usr/include/php/Zend -I/usr/include/php/ext -I/usr/include/php/ext/date/lib -DHAVE_CONFIG_H -O2 -march=i686 -c /tmp/B.270d76df-5ba6-47bf-ad07-b2bc90441a98/BUILD/php-ext-pimple-3.0.0/pimple.c  -fPIC -DPIC -o .libs/pimple.o
/tmp/B.270d76df-5ba6-47bf-ad07-b2bc90441a98/BUILD/php-ext-pimple-3.0.0/pimple.c:161: error: `PHP_FE_END' undeclared here (not in a function)
/tmp/B.270d76df-5ba6-47bf-ad07-b2bc90441a98/BUILD/php-ext-pimple-3.0.0/pimple.c:161: error: initializer element is not constant
/tmp/B.270d76df-5ba6-47bf-ad07-b2bc90441a98/BUILD/php-ext-pimple-3.0.0/pimple.c:161: error: (near initialization for `pimple_ce_functions[11]')
/tmp/B.270d76df-5ba6-47bf-ad07-b2bc90441a98/BUILD/php-ext-pimple-3.0.0/pimple.c:166: error: initializer element is not constant
/tmp/B.270d76df-5ba6-47bf-ad07-b2bc90441a98/BUILD/php-ext-pimple-3.0.0/pimple.c:166: error: (near initialization for `pimple_closure_ce_functions[1]')
/tmp/B.270d76df-5ba6-47bf-ad07-b2bc90441a98/BUILD/php-ext-pimple-3.0.0/pimple.c:171: error: initializer element is not constant
/tmp/B.270d76df-5ba6-47bf-ad07-b2bc90441a98/BUILD/php-ext-pimple-3.0.0/pimple.c:171: error: (near initialization for `pimple_serviceprovider_iface_ce_functions[1]')
/tmp/B.270d76df-5ba6-47bf-ad07-b2bc90441a98/BUILD/php-ext-pimple-3.0.0/pimple.c: In function `pimple_object_read_dimension':
/tmp/B.270d76df-5ba6-47bf-ad07-b2bc90441a98/BUILD/php-ext-pimple-3.0.0/pimple.c:426: error: structure has no member named `object_ptr'
/tmp/B.270d76df-5ba6-47bf-ad07-b2bc90441a98/BUILD/php-ext-pimple-3.0.0/pimple.c:426: error: structure has no member named `object_ptr'
/tmp/B.270d76df-5ba6-47bf-ad07-b2bc90441a98/BUILD/php-ext-pimple-3.0.0/pimple.c:439: error: structure has no member named `object_ptr'
/tmp/B.270d76df-5ba6-47bf-ad07-b2bc90441a98/BUILD/php-ext-pimple-3.0.0/pimple.c:439: error: structure has no member named `object_ptr'
/tmp/B.270d76df-5ba6-47bf-ad07-b2bc90441a98/BUILD/php-ext-pimple-3.0.0/pimple.c: In function `pimple_zval_is_valid_callback':
/tmp/B.270d76df-5ba6-47bf-ad07-b2bc90441a98/BUILD/php-ext-pimple-3.0.0/pimple.c:454: error: structure has no member named `called_scope'
/tmp/B.270d76df-5ba6-47bf-ad07-b2bc90441a98/BUILD/php-ext-pimple-3.0.0/pimple.c:458: error: structure has no member named `get_closure'
/tmp/B.270d76df-5ba6-47bf-ad07-b2bc90441a98/BUILD/php-ext-pimple-3.0.0/pimple.c:458: error: structure has no member named `get_closure'
/tmp/B.270d76df-5ba6-47bf-ad07-b2bc90441a98/BUILD/php-ext-pimple-3.0.0/pimple.c:458: error: structure has no member named `object_ptr'
/tmp/B.270d76df-5ba6-47bf-ad07-b2bc90441a98/BUILD/php-ext-pimple-3.0.0/pimple.c:459: error: structure has no member named `called_scope'
make: *** [pimple.lo] Error 1
error: Bad exit status from /tmp/B.270d76df-5ba6-47bf-ad07-b2bc90441a98/BUILD/tmp/rpm-tmp.76241 (%build)


RPM build errors:
    Bad exit status from /tmp/B.270d76df-5ba6-47bf-ad07-b2bc90441a98/BUILD/tmp/rpm-tmp.76241 (%build)
ended at: Fri May  8 19:41:20 2015, done in 0:00:03.818452
error: No files produced.
+ chmod -R u+rwX /tmp/B.270d76df-5ba6-47bf-ad07-b2bc90441a98/BUILD
+ rm -rf /tmp/B.270d76df-5ba6-47bf-ad07-b2bc90441a98/tmp /tmp/B.270d76df-5ba6-47bf-ad07-b2bc90441a98/BUILD
+ rm -rf /tmp/B.270d76df-5ba6-47bf-ad07-b2bc90441a98
Begin-PLD-Builder-Info
Build-Time: user:6.84s sys:0.91s real:14.74s (faults io:0 non-io:615814)

End-PLD-Builder-Info
[Back to list of logs] [View rpm -qa of builder]