FailedOk

th/SRPMS[OK]
th/x32[OK]
th/i686[OK]
th/x86_64[OK]

ac/SRPMS[OK]
ac/i386[OK]
ac/i586[OK]
ac/i686[OK]
ac/alpha[OK]
ac/amd64[OK]
ac/athlon[OK]
ac/ppc[OK]
ac/sparc[OK]
ac/sparc64[OK]

Advanced Search
main()
Powered by PLD Linux
(c) 2002-2019 PLD Team
$Revision: 1.37 $
Powered by BOFH.
Your IP: 100.24.122.228

apache1-mod_rpaf 362f160b-a493-4773-a7bb-932e761b3fe8

Status:Failed
Source URL:ftp://buildlogs.pld-linux.org/ac/ppc/FAIL/apache1-mod_rpaf,362f160b-a493-4773-a7bb-932e761b3fe8.bz2
text/plain URL:View!
rpm -qa of builder:View!
Date:2011/12/22 17:08:46
Runtime:01

Toc:

  • error 1
  • rpm: error: Failed build dependencies:
  • error 2
  • rpm: error: Failed build dependencies:
  • prep
  • Executing(%prep): env -i PATH=/bin:/usr/bin:/usr/local/bin:/usr/X11R6/bin:/home/services/builder/bin HOME=/home/services/builder TMPDIR=/tmp/B.d8355a /bin/sh -e /tmp/B.d8355a/rpm-tmp.46393
  • build
  • Executing(%build): env -i PATH=/bin:/usr/bin:/usr/local/bin:/usr/X11R6/bin:/home/services/builder/bin HOME=/home/services/builder TMPDIR=/tmp/B.d8355a /bin/sh -e /tmp/B.d8355a/rpm-tmp.50896
  • error 3
  • HTTP::Response=HASH(0x10314628)make[1]: *** [test] Error 111
  • error 4
  • error: Bad exit status from /tmp/B.d8355a/rpm-tmp.50896 (%build)
  • error 5
  • RPM build errors:
  • error 6
  • error: No files produced.

Content:

request from: glen
checking if we should skip the build
started at: Thu Dec 22 18:05:05 2011
fetching http://src.ac.pld-linux.org/~buildsrc//srpms/362f160b-a493-4773-a7bb-932e761b3fe8/apache1-mod_rpaf-0.6-2.src.rpm
fetched 17363 bytes, 8.1 K/s
installing srpm: apache1-mod_rpaf-0.6-2.src.rpm
Can't find java virtual machine, aborting.
Can't find java virtual machine, aborting.
Can't find java virtual machine, aborting.
Building target platforms: ppc-pld-linux
checking BuildConflict-ing packages
no BuildConflicts found
checking BR
rpm: error: Failed build dependencies:
rpm: 	apache1-base is needed by apache1-mod_rpaf-0.6-2.src
rpm: 	apache1-mod_alias is needed by apache1-mod_rpaf-0.6-2.src
rpm: 	apache1-mod_cgi is needed by apache1-mod_rpaf-0.6-2.src
rpm: 	apache1-mod_log_config is needed by apache1-mod_rpaf-0.6-2.src
rpm: 	apache1-mod_mime is needed by apache1-mod_rpaf-0.6-2.src
rpm: 	apache1-mod_rewrite is needed by apache1-mod_rpaf-0.6-2.src
rpm: 	perl-libwww is needed by apache1-mod_rpaf-0.6-2.src
updating poldek cache...
Can't find java virtual machine, aborting.

Retrieving ac-main::packages.ndir.md...
ac-main is up to date

Retrieving ac-updates::packages.ndir.md...
Retrieving ac-updates::packages.ndir.diff.toc.gz...
..............................done

Retrieving diff::packages.ndir.2011.12.21-18.24.58.gz...
Retrieving diff::packages.ndir.dscr.2011.12.21-18.24.58.gz...
Loading [pndir]ac-updates...
Applying packages.ndir.2011.12.21-18.24.58.gz...

Writing /root/tmp/poldek-cache-root/[...]/packages.ndir.gz...

Retrieving okas::packages.ndir.md...
okas is up to date
checking conflicting packages in BRed packages
poldek: Loading [pndir]okas...
poldek: Loading [dir]ready...
poldek: Loading [pndir]ac-main...
poldek: Loading [pndir]ac-updates...
poldek: 19227 packages read
poldek: Removed 4267 duplicate packages from available set
poldek: Processing dependencies...
poldek: There are 7 packages to install:
poldek: I apache1-base-1.3.42-3  apache1-mod_alias-1.3.42-3
poldek: I apache1-mod_cgi-1.3.42-3  apache1-mod_log_config-1.3.42-3
poldek: I apache1-mod_mime-1.3.42-3  apache1-mod_rewrite-1.3.42-3
poldek: I perl-libwww-5.808-2
poldek: This operation will use 1.2MB of disk space.
poldek: Need to get 731.0KB of archives (731.0KB to download).
poldek: 
poldek: Retrieving [1/7] ac-updates::apache1-base-1.3.42-3.ppc.rpm...
poldek: ..............................done
poldek: Retrieving [2/7] ac-updates::apache1-mod_alias-1.3.42-3.ppc.rpm...
poldek: ..............................done
poldek: Retrieving [3/7] ac-updates::apache1-mod_cgi-1.3.42-3.ppc.rpm...
poldek: ..............................done
poldek: Retrieving [4/7] ac-updates::apache1-mod_log_config-1.3.42-3.ppc.rpm...
poldek: ..............................done
poldek: Retrieving [5/7] ac-updates::apache1-mod_mime-1.3.42-3.ppc.rpm...
poldek: ..............................done
poldek: Retrieving [6/7] ac-updates::apache1-mod_rewrite-1.3.42-3.ppc.rpm...
poldek: ..............................done
poldek: Retrieving [7/7] ac-updates::perl-libwww-5.808-2.noarch.rpm...
poldek: ..............................done
poldek: Executing rpm --upgrade -vh --test --root /...
poldek: Preparing...                ##################################################
no conflicts found
checking BR
rpm: error: Failed build dependencies:
rpm: 	apache1-base is needed by apache1-mod_rpaf-0.6-2.src
rpm: 	apache1-mod_alias is needed by apache1-mod_rpaf-0.6-2.src
rpm: 	apache1-mod_cgi is needed by apache1-mod_rpaf-0.6-2.src
rpm: 	apache1-mod_log_config is needed by apache1-mod_rpaf-0.6-2.src
rpm: 	apache1-mod_mime is needed by apache1-mod_rpaf-0.6-2.src
rpm: 	apache1-mod_rewrite is needed by apache1-mod_rpaf-0.6-2.src
rpm: 	perl-libwww is needed by apache1-mod_rpaf-0.6-2.src
installing BR: apache1\-mod\_rewrite apache1\-mod\_alias perl\-libwww apache1\-mod\_mime apache1\-base apache1\-mod\_cgi apache1\-mod\_log\_config
Can't find java virtual machine, aborting.
Loading [pndir]okas...
Loading [dir]ready...
Loading [pndir]ac-main...
Loading [pndir]ac-updates...
19227 packages read
Removed 4267 duplicate packages from available set
Processing dependencies...
There are 6 packages to install:
I apache1-base-1.3.42-3  apache1-mod_alias-1.3.42-3  
I apache1-mod_cgi-1.3.42-3  apache1-mod_log_config-1.3.42-3  
I apache1-mod_mime-1.3.42-3  apache1-mod_rewrite-1.3.42-3
This operation will use 628.5KB of disk space.
Need to get 431.0KB of archives. 
Executing rpm --upgrade -vh --root /...
Preparing...                ##################################################
apache1-base                ##################################################
apache1-mod_alias           ##################################################
apache1-mod_cgi             ##################################################
apache1-mod_log_config      ##################################################
apache1-mod_mime            ##################################################
apache1-mod_rewrite         ##################################################
Run "/sbin/service apache start" to start Apache HTTP daemon.
Installing set #2
Processing dependencies...
There are 1 package to install:
I perl-libwww-5.808-2
This operation will use 623.1KB of disk space.
Need to get 300.0KB of archives. 
Executing rpm --upgrade -vh --root /...
Preparing...                ##################################################
perl-libwww                 ##################################################
building RPM using: echo build-id: 362f160b-a493-4773-a7bb-932e761b3fe8; cd rpm/SPECS; TMPDIR=/tmp/B.d8355a exec nice -n 0 rpmbuild -bb --define '_smp_mflags -j1'  --target ppc-pld-linux   apache1-mod_rpaf.spec
Can't find java virtual machine, aborting.
build-id: 362f160b-a493-4773-a7bb-932e761b3fe8
Building target platforms: ppc-pld-linux
Executing(%prep):  env -i PATH=/bin:/usr/bin:/usr/local/bin:/usr/X11R6/bin:/home/services/builder/bin HOME=/home/services/builder TMPDIR=/tmp/B.d8355a  /bin/sh -e /tmp/B.d8355a/rpm-tmp.46393
+ umask 022
+ cd /home/services/builder/rpm/BUILD
+ cd /home/services/builder/rpm/BUILD
+ rm -rf apache1-mod_rpaf-0.6
+ /bin/mkdir -p apache1-mod_rpaf-0.6
+ cd apache1-mod_rpaf-0.6
+ /bin/gzip -dc /home/services/builder/rpm/SOURCES/mod_rpaf-0.6.tar.gz
+ tar -xf -
+ STATUS=0
+ [ 0 -ne 0 ]
+ /bin/id -u
+ [ 182 = 0 ]
+ true .
+ /bin/chmod -Rf -Rf a+rX,u+w,g-w,o-w .
+ mv mod_rpaf-0.6/CHANGES mod_rpaf-0.6/Makefile mod_rpaf-0.6/README mod_rpaf-0.6/gen_tests.sh mod_rpaf-0.6/httpd-rpaf.conf-template mod_rpaf-0.6/httpd-rpaf.conf-template-2.0 mod_rpaf-0.6/mod_rpaf-2.0.c mod_rpaf-0.6/mod_rpaf.c mod_rpaf-0.6/t mod_rpaf-0.6/test-Makefile-template .
+ echo Patch #0 (mod_rpaf_degtine.patch):
Patch #0 (mod_rpaf_degtine.patch):
+ patch -p1 -s
+ < /home/services/builder/rpm/SOURCES/mod_rpaf_degtine.patch 
+ echo Patch #1 (tests.patch):
Patch #1 (tests.patch):
+ patch -p1 -s
+ < /home/services/builder/rpm/SOURCES/tests.patch 
+ exit 0
Executing(%build):  env -i PATH=/bin:/usr/bin:/usr/local/bin:/usr/X11R6/bin:/home/services/builder/bin HOME=/home/services/builder TMPDIR=/tmp/B.d8355a  /bin/sh -e /tmp/B.d8355a/rpm-tmp.50896
+ umask 022
+ cd /home/services/builder/rpm/BUILD
+ cd apache1-mod_rpaf-0.6
+ /usr/sbin/apxs1 -c mod_rpaf.c -o mod_rpaf.so
ppc-pld-linux-gcc -O2 -fsigned-char  -DHARD_SERVER_LIMIT=2048 -DLINUX=22 -DTARGET="apache" -DHAVE_SET_DUMPABLE -DINET6 -Dss_family=__ss_family -Dss_len=__ss_len -DDEV_RANDOM=/dev/random -DEAPI -DEAPI_MM -fPIC -DSHARED_MODULE -I/usr/include/apache1  -c mod_rpaf.c
gcc -shared -o mod_rpaf.so mod_rpaf.o -o mod_rpaf.so 
+ ln -sf /usr/lib/apache1 modules
+ /usr/bin/make -j1 test
make done
type "make test" to test mod_rpaf
type "make install" to install mod_rpaf
Found httpd as /usr/sbin/apache
Creating test configuration for apache 1.3.x
in directory /home/services/builder/rpm/BUILD/apache1-mod_rpaf-0.6/t
cd t && /usr/bin/make test
make[1]: Entering directory `/home/services/builder/rpm/BUILD/apache1-mod_rpaf-0.6/t'
rm -f rpaf-error_log rpaf_access_log
running rpaf apache 1.3.x tests
test 1 - no rpaf
starting apache ..
[Thu Dec 22 16:08:32 2011] [warn] Connection to lingerd socket (/var/run/lingerd/lingerd.sock) failed
apache: cannot determine local host name.
Use the ServerName directive to set it manually.
HTTP::Response=HASH(0x10314628)make[1]: *** [test] Error 111
make[1]: Leaving directory `/home/services/builder/rpm/BUILD/apache1-mod_rpaf-0.6/t'
make: *** [test] Error 2
error: Bad exit status from /tmp/B.d8355a/rpm-tmp.50896 (%build)


RPM build errors:
    Bad exit status from /tmp/B.d8355a/rpm-tmp.50896 (%build)
ended at: Thu Dec 22 18:08:36 2011, done in 01days 00h 00m 20s
error: No files produced.
Can't find java virtual machine, aborting.
Can't find java virtual machine, aborting.
Begin-PLD-Builder-Info
Build-Time: user:138.49s sys:60.60s real:221.57s (faults io:4 non-io:276557)

End-PLD-Builder-Info
[Back to list of logs] [View rpm -qa of builder]