FailedOk

th/SRPMS[OK]
th/x32[OK]
th/i686[OK]
th/x86_64[OK]

ac/SRPMS[OK]
ac/i386[OK]
ac/i586[OK]
ac/i686[OK]
ac/alpha[OK]
ac/amd64[OK]
ac/athlon[OK]
ac/ppc[OK]
ac/sparc[OK]
ac/sparc64[OK]

Advanced Search
main()
Powered by PLD Linux
(c) 2002-2020 PLD Team
$Revision: 1.37 $
Powered by Real Computer.
Your IP: 3.231.25.104

apcupsd 67d438e5-89ec-4f1e-8f3a-cfc8811e801b

Status:Failed
Source URL:https://buildlogs.pld-linux.org/pld/ac/ppc/FAIL/apcupsd,67d438e5-89ec-4f1e-8f3a-cfc8811e801b.bz2
text/plain URL:View!
full text:View!
rpm -qa of builder:View!
Date:2011/11/26 17:49:55
Runtime:01

Toc:

  • error 1
  • make[2]: *** [apctest.man.txt] Error 1
  • error 2
  • make[1]: *** [all] Error 2
  • error 3
  • error: Bad exit status from /tmp/B.d9064b/rpm-tmp.69944 (%build)
  • error 4
  • RPM build errors:
  • error 5
  • error: No files produced.

Content:

  enable-pthreads:            yes
  enable-dist-install:        yes
  enable-gapcmon:             yes
  enable-apcagent:            no
  
Configuration complete: Run 'make' to build apcuspd.

+ /usr/bin/make -j1
        src
        src/lib
  CXX   src/lib/apcconfig.c
  CXX   src/lib/apcerror.c
  CXX   src/lib/apcevents.c
  CXX   src/lib/apcexec.c
  CXX   src/lib/apcfile.c
  CXX   src/lib/apclibnis.c
  CXX   src/lib/apclock.c
  CXX   src/lib/apclog.c
  CXX   src/lib/apcsignal.c
  CXX   src/lib/apcstatus.c
  CXX   src/lib/asys.c
  CXX   src/lib/newups.c
  CXX   src/lib/md5.c
  CXX   src/lib/statmgr.cpp
  CXX   src/lib/gethostname.c
  CXX   src/lib/amutex.cpp
  CXX   src/lib/astring.cpp
  CXX   src/lib/autil.cpp
  CXX   src/lib/atimer.cpp
  CXX   src/lib/athread.cpp
  CXX   src/lib/libsupc++fix.cpp
  AR    src/lib/libapc.a
        src/drivers
        src/drivers/apcsmart
  CXX   src/drivers/apcsmart/smart.c
  CXX   src/drivers/apcsmart/smarteeprom.c
  CXX   src/drivers/apcsmart/smartoper.c
  CXX   src/drivers/apcsmart/smartsetup.c
  CXX   src/drivers/apcsmart/smartsetup2.c
        src/drivers/dumb
  CXX   src/drivers/dumb/dumboper.c
  CXX   src/drivers/dumb/dumbsetup.c
        src/drivers/net
  CXX   src/drivers/net/net.c
        src/drivers/pcnet
  CXX   src/drivers/pcnet/pcnet.c
        src/drivers/usb
        src/drivers/usb/linux
  CXX   src/drivers/usb/linux/linux-usb.c
  CXX   src/drivers/usb/usb.c
        src/drivers/snmplite
  CXX   src/drivers/snmplite/apc-mib.cpp
  CXX   src/drivers/snmplite/asn.cpp
  CXX   src/drivers/snmplite/mge-mib.cpp
  CXX   src/drivers/snmplite/mibs.cpp
  CXX   src/drivers/snmplite/rfc1628-mib.cpp
  CXX   src/drivers/snmplite/snmp.cpp
  CXX   src/drivers/snmplite/snmplite.cpp
        src/drivers/test
  CXX   src/drivers/test/testdriver.c
  CXX   src/drivers/drivers.c
  AR    src/drivers/libdrivers.a
        src/cgi
  CXX   src/cgi/upsfetch.c
  CXX   src/cgi/cgilib.c
  CXX   src/cgi/multimon.c
  LD    src/cgi/multimon.cgi
  CXX   src/cgi/upsstats.c
  LD    src/cgi/upsstats.cgi
  CXX   src/cgi/upsfstats.c
  LD    src/cgi/upsfstats.cgi
  CXX   src/cgi/upsimage.c
  LD    src/cgi/upsimage.cgi
        src/gapcmon
  CXX   src/gapcmon/eggtrayicon.c
  CXX   src/gapcmon/gapcmon.c
  CXX   src/gapcmon/gethostname.c
  LD    src/gapcmon/gapcmon
  CXX   src/options.c
  CXX   src/device.c
  CXX   src/reports.c
  CXX   src/action.c
  CXX   src/apcupsd.c
  CXX   src/apcnis.c
  LD    src/apcupsd
  CXX   src/apcaccess.c
  LD    src/apcaccess
  CXX   src/apctest.c
  LD    src/apctest
  CXX   src/smtp.c
  LD    src/smtp
        platforms
        platforms/etc
        platforms/unknown
        doc
  MAN   apcupsd.8 -> apcupsd.man.txt
  MAN   apcaccess.8 -> apcaccess.man.txt
  MAN   apctest.8 -> apctest.man.txt
col: Invalid or incomplete multibyte or wide character
make[2]: *** [apctest.man.txt] Error 1
make[1]: *** [all] Error 2
make: *** [doc_DIR] Error 2
error: Bad exit status from /tmp/B.d9064b/rpm-tmp.69944 (%build)


RPM build errors:
    Bad exit status from /tmp/B.d9064b/rpm-tmp.69944 (%build)
ended at: Sat Nov 26 18:49:44 2011, done in 01days 00h 18m 54s
error: No files produced.
Can't find java virtual machine, aborting.
Can't find java virtual machine, aborting.
Begin-PLD-Builder-Info
Build-Time: user:767.43s sys:323.35s real:1180.42s (faults io:59 non-io:1099863)

End-PLD-Builder-Info
[Back to list of logs] [View rpm -qa of builder]