FailedOk

th/SRPMS[OK]
th/x32[OK]
th/i686[OK]
th/x86_64[OK]

ac/SRPMS[OK]
ac/i386[OK]
ac/i586[OK]
ac/i686[OK]
ac/alpha[OK]
ac/amd64[OK]
ac/athlon[OK]
ac/ppc[OK]
ac/sparc[OK]
ac/sparc64[OK]

Advanced Search
main()
Powered by PLD Linux
(c) 2002-2024 PLD Team
$Revision: 1.37 $
Powered by /dev/zero.
Your IP: 44.220.44.148

OpenImageIO 794b3870-4b6f-4b9d-9867-3a095da95f7f

Status:Failed
Source URL:https://buildlogs.pld-linux.org/pld/th/i486/FAIL/OpenImageIO,794b3870-4b6f-4b9d-9867-3a095da95f7f.bz2
text/plain URL:View!
full text:View!
rpm -qa of builder:View!
Date:2015/02/17 23:42:57
Runtime:0:04:13.058701

Toc:

  • error 1
  • rpm: error: Failed build dependencies:
  • error 2
  • rpm: error: Failed build dependencies:
  • prep
  • Executing(%prep): /bin/sh -e /tmp/B.ce933447-a97a-4447-bbf0-fefd2ffafca1/BUILD/tmp/rpm-tmp.31291
  • build
  • Executing(%build): /bin/sh -e /tmp/B.ce933447-a97a-4447-bbf0-fefd2ffafca1/BUILD/tmp/rpm-tmp.10184
  • error 3
  • /tmp/B.ce933447-a97a-4447-bbf0-fefd2ffafca1/BUILD/OpenImageIO-oiio-bcdad81/src/libOpenImageIO/imagebufalgo.cpp:1066:28: error: comparison between signed and unsigned integer expressions [-Werror=sign-compare]
  • error 4
  • /tmp/B.ce933447-a97a-4447-bbf0-fefd2ffafca1/BUILD/OpenImageIO-oiio-bcdad81/src/libOpenImageIO/imagebufalgo.cpp:1068:32: error: comparison between signed and unsigned integer expressions [-Werror=sign-compare]
  • error 5
  • libOpenImageIO/CMakeFiles/OpenImageIO.dir/build.make:287: recipe for target 'libOpenImageIO/CMakeFiles/OpenImageIO.dir/imagebufalgo.cpp.o' failed
  • error 6
  • make[2]: *** [libOpenImageIO/CMakeFiles/OpenImageIO.dir/imagebufalgo.cpp.o] Error 1
  • error 7
  • CMakeFiles/Makefile2:974: recipe for target 'libOpenImageIO/CMakeFiles/OpenImageIO.dir/all' failed
  • error 8
  • make[1]: *** [libOpenImageIO/CMakeFiles/OpenImageIO.dir/all] Error 2
  • error 9
  • Makefile:150: recipe for target 'all' failed
  • error 10
  • error: Bad exit status from /tmp/B.ce933447-a97a-4447-bbf0-fefd2ffafca1/BUILD/tmp/rpm-tmp.10184 (%build)
  • error 11
  • RPM build errors:
  • error 12
  • error: No files produced.

Content:

checking if we should skip the build
started at: Tue Feb 17 23:37:32 2015
fetching https://srcbuilder.pld-linux.org/th//srpms/794b3870-4b6f-4b9d-9867-3a095da95f7f/OpenImageIO-1.2.3-13.src.rpm
fetched 12415584 bytes, 11931.1 K/s
installing srpm: OpenImageIO-1.2.3-13.src.rpm
+ install -d /tmp/B.ce933447-a97a-4447-bbf0-fefd2ffafca1/BUILD /tmp/B.ce933447-a97a-4447-bbf0-fefd2ffafca1/RPMS
+ LC_ALL=en_US.UTF-8
+ rpm -qp --changelog OpenImageIO-1.2.3-13.src.rpm
* Tue Feb 17 2015 PLD Linux Team <feedback@pld-linux.org>
- For complete changelog see: http://git.pld-linux.org/?p=packages/OpenImageIO.git;a=log;h=master
* Sun Nov 23 2014 Jan Rękorajski <baggins@pld-linux.org> 21abb5e
- rebuild with hdf5 1.8.14 - release 13 (by relup.sh) * Sat Oct 25 2014 Jan Rękorajski <baggins@pld-linux.org> 8800655
- rebuild with boost 1.56.0 - release 12 (by relup.sh) * Mon Apr 14 2014 Jan Rękorajski <baggins@pld-linux.org> b63794a
- release 11 (by relup.sh) * Thu Apr 03 2014 Elan Ruusamäe <glen@delfi.ee> 73eae24
- noarch apidocs + rpm -Uhv --nodeps --define '_topdir /tmp/B.ce933447-a97a-4447-bbf0-fefd2ffafca1' --define '_specdir %{_topdir}' --define '_sourcedir %{_specdir}' --define '_rpmdir %{_topdir}/RPMS' --define '_builddir %{_topdir}/BUILD' OpenImageIO-1.2.3-13.src.rpm Preparing... ################################################## OpenImageIO ################################################## + rm -f OpenImageIO-1.2.3-13.src.rpm + install -m 700 -d /tmp/B.ce933447-a97a-4447-bbf0-fefd2ffafca1/BUILD/tmp + TMPDIR=/tmp/B.ce933447-a97a-4447-bbf0-fefd2ffafca1/BUILD/tmp + exec nice -n 0 rpmbuild -bp --short-circuit --nodeps --define '_topdir /tmp/B.ce933447-a97a-4447-bbf0-fefd2ffafca1' --define '_specdir %{_topdir}' --define '_sourcedir %{_specdir}' --define '_rpmdir %{_topdir}/RPMS' --define '_builddir %{_topdir}/BUILD' --target i486-pld-linux --define 'prep exit 0' /tmp/B.ce933447-a97a-4447-bbf0-fefd2ffafca1/OpenImageIO.spec Building target platforms: i486-pld-linux checking BuildConflict-ing packages no BuildConflicts found checking BR rpm: error: Failed build dependencies: rpm: Field3D-devel is needed by OpenImageIO-1.2.3-13.src rpm: Building target platforms: i486-pld-linux updating poldek cache... ready is up to date Retrieving th::packages.ndir.md... th is up to date Retrieving th::packages.ndir.md... th is up to date Retrieving th-ready::packages.ndir.md... th-ready is up to date Retrieving th-ready::packages.ndir.md... th-ready is up to date Retrieving th-test::packages.ndir.md... th-test is up to date Retrieving th-test::packages.ndir.md... th-test is up to date checking conflicting packages in BRed packages poldek: Loading [pndir]ready... poldek: Loading [pndir]th-test... poldek: Loading [pndir]th-test... poldek: Loading [pndir]th-ready... poldek: Loading [pndir]th-ready... poldek: Loading [pndir]th... poldek: Loading [pndir]th... poldek: 25875 packages read poldek: Removed 2116 duplicate packages from available set poldek: Processing dependencies... poldek: Field3D-devel-1.3.2-10.i486 marks Field3D-1.3.2-10.i486 (cap Field3D = 1.3.2-10) poldek: There are 2 packages to install (1 marked by dependencies): poldek: I Field3D-devel-1.3.2-10.i486 poldek: D Field3D-1.3.2-10.i486 poldek: This operation will use 1.4MB of disk space. poldek: Need to get 291.1KB of archives. poldek: Executing rpm --upgrade -vh --test --root / --define _check_dirname_deps 1... poldek: Preparing... ################################################## no conflicts found checking BR rpm: error: Failed build dependencies: rpm: Field3D-devel is needed by OpenImageIO-1.2.3-13.src rpm: Building target platforms: i486-pld-linux installing BR: Field3D\-devel Loading [pndir]ready... Loading [pndir]th-test... Loading [pndir]th-test... Loading [pndir]th-ready... Loading [pndir]th-ready... Loading [pndir]th... Loading [pndir]th... 25875 packages read Removed 2116 duplicate packages from available set Processing dependencies... Field3D-devel-1.3.2-10.i486 marks Field3D-1.3.2-10.i486 (cap Field3D = 1.3.2-10) There are 2 packages to install (1 marked by dependencies): I Field3D-devel-1.3.2-10.i486 D Field3D-1.3.2-10.i486 This operation will use 1.4MB of disk space. Need to get 291.1KB of archives. Executing rpm --upgrade -vh --root / --define _check_dirname_deps 1... Preparing... ################################################## Field3D ################################################## Field3D-devel ################################################## building RPM using: set -ex; : build-id: 794b3870-4b6f-4b9d-9867-3a095da95f7f; TMPDIR=/tmp/B.ce933447-a97a-4447-bbf0-fefd2ffafca1/BUILD/tmp exec nice -n 0 rpmbuild -bb --define '_smp_mflags -j9' --define '_make_opts -Otarget' --define '_pld_builder 1' --define '_topdir /tmp/B.ce933447-a97a-4447-bbf0-fefd2ffafca1' --define '_specdir %{_topdir}' --define '_sourcedir %{_specdir}' --define '_rpmdir %{_topdir}/RPMS' --define '_builddir %{_topdir}/BUILD' --target i486-pld-linux /tmp/B.ce933447-a97a-4447-bbf0-fefd2ffafca1/OpenImageIO.spec + : build-id: 794b3870-4b6f-4b9d-9867-3a095da95f7f + TMPDIR=/tmp/B.ce933447-a97a-4447-bbf0-fefd2ffafca1/BUILD/tmp + exec nice -n 0 rpmbuild -bb --define '_smp_mflags -j9' --define '_make_opts -Otarget' --define '_pld_builder 1' --define '_topdir /tmp/B.ce933447-a97a-4447-bbf0-fefd2ffafca1' --define '_specdir %{_topdir}' --define '_sourcedir %{_specdir}' --define '_rpmdir %{_topdir}/RPMS' --define '_builddir %{_topdir}/BUILD' --target i486-pld-linux /tmp/B.ce933447-a97a-4447-bbf0-fefd2ffafca1/OpenImageIO.spec Building target platforms: i486-pld-linux Executing(%prep): /bin/sh -e /tmp/B.ce933447-a97a-4447-bbf0-fefd2ffafca1/BUILD/tmp/rpm-tmp.31291 + umask 022 + cd /tmp/B.ce933447-a97a-4447-bbf0-fefd2ffafca1/BUILD + cd /tmp/B.ce933447-a97a-4447-bbf0-fefd2ffafca1/BUILD + rm -rf OpenImageIO-oiio-bcdad81 + /usr/bin/gzip -dc /tmp/B.ce933447-a97a-4447-bbf0-fefd2ffafca1/OpenImageIO-1.2.3.tar.gz + /bin/tar -xf - + STATUS=0 + '[' 0 -ne 0 ']' + cd OpenImageIO-oiio-bcdad81 + /bin/id -u + '[' 2001 '=' 0 ']' + /bin/id -u + '[' 2001 '=' 0 ']' + /bin/chmod -Rf a+rX,u+w,g-w,o-w . + echo 'Patch #0 (OpenImageIO-link.patch):' Patch #0 (OpenImageIO-link.patch): + '[' -f /tmp/B.ce933447-a97a-4447-bbf0-fefd2ffafca1/OpenImageIO-link.patch ']' + /bin/cat /tmp/B.ce933447-a97a-4447-bbf0-fefd2ffafca1/OpenImageIO-link.patch + /usr/bin/patch -s -p1 + echo 'Patch #2 (OpenImageIO-build.patch):' Patch #2 (OpenImageIO-build.patch): + '[' -f /tmp/B.ce933447-a97a-4447-bbf0-fefd2ffafca1/OpenImageIO-build.patch ']' + /bin/cat /tmp/B.ce933447-a97a-4447-bbf0-fefd2ffafca1/OpenImageIO-build.patch + /usr/bin/patch -s -p1 + echo 'Patch #3 (OpenImageIO-system-squish.patch):' Patch #3 (OpenImageIO-system-squish.patch): + '[' -f /tmp/B.ce933447-a97a-4447-bbf0-fefd2ffafca1/OpenImageIO-system-squish.patch ']' + /bin/cat /tmp/B.ce933447-a97a-4447-bbf0-fefd2ffafca1/OpenImageIO-system-squish.patch + /usr/bin/patch -s -p1 + echo 'Patch #4 (OpenImageIO-system-ptex.patch):' Patch #4 (OpenImageIO-system-ptex.patch): + '[' -f /tmp/B.ce933447-a97a-4447-bbf0-fefd2ffafca1/OpenImageIO-system-ptex.patch ']' + /bin/cat /tmp/B.ce933447-a97a-4447-bbf0-fefd2ffafca1/OpenImageIO-system-ptex.patch + /usr/bin/patch -s -p1 + echo 'Patch #5 (OpenImageIO-system-dpx.patch):' Patch #5 (OpenImageIO-system-dpx.patch): + '[' -f /tmp/B.ce933447-a97a-4447-bbf0-fefd2ffafca1/OpenImageIO-system-dpx.patch ']' + /bin/cat /tmp/B.ce933447-a97a-4447-bbf0-fefd2ffafca1/OpenImageIO-system-dpx.patch + /usr/bin/patch -s -p1 + echo 'Patch #6 (OpenImageIO-system-libcineon.patch):' Patch #6 (OpenImageIO-system-libcineon.patch): + '[' -f /tmp/B.ce933447-a97a-4447-bbf0-fefd2ffafca1/OpenImageIO-system-libcineon.patch ']' + /bin/cat /tmp/B.ce933447-a97a-4447-bbf0-fefd2ffafca1/OpenImageIO-system-libcineon.patch + /usr/bin/patch -s -p1 + echo 'Patch #7 (OpenImageIO-werror.patch):' Patch #7 (OpenImageIO-werror.patch): + '[' -f /tmp/B.ce933447-a97a-4447-bbf0-fefd2ffafca1/OpenImageIO-werror.patch ']' + /bin/cat /tmp/B.ce933447-a97a-4447-bbf0-fefd2ffafca1/OpenImageIO-werror.patch + /usr/bin/patch -s -p1 + echo 'Patch #8 (0002-Fix_IlmBase_issue.patch):' Patch #8 (0002-Fix_IlmBase_issue.patch): + '[' -f /tmp/B.ce933447-a97a-4447-bbf0-fefd2ffafca1/0002-Fix_IlmBase_issue.patch ']' + /bin/cat /tmp/B.ce933447-a97a-4447-bbf0-fefd2ffafca1/0002-Fix_IlmBase_issue.patch + /usr/bin/patch -s -p1 + echo 'Patch #9 (0003-Fix_multiarch_paths.patch):' Patch #9 (0003-Fix_multiarch_paths.patch): + '[' -f /tmp/B.ce933447-a97a-4447-bbf0-fefd2ffafca1/0003-Fix_multiarch_paths.patch ']' + /bin/cat /tmp/B.ce933447-a97a-4447-bbf0-fefd2ffafca1/0003-Fix_multiarch_paths.patch + /usr/bin/patch -s -p1 + /bin/rm '--interactive=never' -r src/dds.imageio/squish src/ptex.imageio/ptex + /bin/rm '--interactive=never' src/include/pugiconfig.hpp src/include/pugixml.hpp + exit 0 Executing(%build): /bin/sh -e /tmp/B.ce933447-a97a-4447-bbf0-fefd2ffafca1/BUILD/tmp/rpm-tmp.10184 TMP=/home/users/builder/tmp HOME=/home/users/builder PATH=/home/users/builder/GNUstep/Tools:/usr/local/bin:/usr/bin:/bin:/home/users/builder/bin TMPDIR=/tmp/B.ce933447-a97a-4447-bbf0-fefd2ffafca1/BUILD/tmp + umask 022 + cd /tmp/B.ce933447-a97a-4447-bbf0-fefd2ffafca1/BUILD + cd OpenImageIO-oiio-bcdad81 + install -d build + cd build + CC=i486-pld-linux-gcc CXX=i486-pld-linux-g++ CPPFLAGS= /usr/bin/cmake '-DCMAKE_VERBOSE_MAKEFILE=ON' '-DCMAKE_BUILD_TYPE=PLD' '-DCMAKE_INSTALL_BINDIR:PATH=/usr/bin' '-DCMAKE_INSTALL_SBINDIR:PATH=/usr/sbin' '-DCMAKE_INSTALL_LIBEXECDIR:PATH=/usr/lib' '-DCMAKE_INSTALL_SYSCONFDIR:PATH=/etc' '-DCMAKE_INSTALL_SHAREDSTATEDIRPATH:PATH=/var/lib' '-DCMAKE_INSTALL_LOCALSTATEDIRPATH:PATH=/var' '-DCMAKE_INSTALL_LIBDIR:PATH=/usr/lib' '-DCMAKE_INSTALL_INCLUDEDIR:PATH=/usr/include' '-DCMAKE_INSTALL_OLDINCLUDEDIR:PATH=/usr/include' '-DCMAKE_INSTALL_DATAROOTDIR:PATH=/usr/share' '-DCMAKE_INSTALL_DATADIR:PATH=/usr/share' '-DCMAKE_INSTALL_INFODIR:PATH=/usr/share/info' '-DCMAKE_INSTALL_LOCALEDIR:PATH=/usr/share/locale' '-DCMAKE_INSTALL_MANDIR:PATH=/usr/share/man' '-DCMAKE_INSTALL_DOCDIR:PATH=/usr/share/doc' '-DCMAKE_INSTALL_PREFIX:PATH=/usr' '-DSYSCONF_INSTALL_DIR:PATH=/etc' '-DCMAKE_CXX_FLAGS_PLD=-O2 -fwrapv -pipe -Wformat -Werror=format-security -gdwarf-4 -fno-debug-types-section -fvar-tracking-assignments -g2 -Wp,-D_FORTIFY_SOURCE=2 -fstack-protector --param=ssp-buffer-size=4 -fomit-frame-pointer -march=i486 -fasynchronous-unwind-tables -gdwarf-4 -fno-debug-types-section -fvar-tracking-assignments -g2 -DNDEBUG -DQT_NO_DEBUG' '-DCMAKE_C_FLAGS_PLD=-O2 -fwrapv -pipe -Wformat -Werror=format-security -gdwarf-4 -fno-debug-types-section -fvar-tracking-assignments -g2 -Wp,-D_FORTIFY_SOURCE=2 -fstack-protector --param=ssp-buffer-size=4 -fomit-frame-pointer -march=i486 -fasynchronous-unwind-tables -gdwarf-4 -fno-debug-types-section -fvar-tracking-assignments -g2 -DNDEBUG -DQT_NO_DEBUG' '-DCMAKE_Fortran_FLAGS_PLD=-O2 -fwrapv -pipe -Wformat -Werror=format-security -gdwarf-4 -fno-debug-types-section -fvar-tracking-assignments -g2 -Wp,-D_FORTIFY_SOURCE=2 -fstack-protector --param=ssp-buffer-size=4 -fomit-frame-pointer -march=i486 -fasynchronous-unwind-tables -gdwarf-4 -fno-debug-types-section -fvar-tracking-assignments -g2 -DNDEBUG -DQT_NO_DEBUG' '-DCMAKE_EXE_LINKER_FLAGS_PLD=-Wl,--as-needed -Wl,--no-copy-dt-needed-entries -Wl,-z,relro -Wl,-z,combreloc ' '-DCMAKE_SHARED_LINKER_FLAGS_PLD=-Wl,--as-needed -Wl,--no-copy-dt-needed-entries -Wl,-z,relro -Wl,-z,combreloc ' '-DCMAKE_MODULE_LINKER_FLAGS_PLD=-Wl,--as-needed -Wl,--no-copy-dt-needed-entries -Wl,-z,relro -Wl,-z,combreloc ' '-DBUILD_SHARED_LIBS:BOOL=ON' ../src '-DNOTHREADS=1' '-DEMBEDPLUGINS=OFF' '-DOPENJPEG_INCLUDE_DIR=/usr/include/openjpeg-1.5' '-DINCLUDE_INSTALL_DIR=/usr/include/OpenImageIO' '-DLIB_INSTALL_DIR:PATH=/usr/lib' '-DPYLIB_INSTALL_DIR=/usr/lib/python2.7/site-packages' '-DPYTHON_VERSION=2.7' '-DUSE_EXTERNAL_PUGIXML=ON' '-DUSE_TBB=OFF' -- The C compiler identification is GNU 4.9.2 -- The CXX compiler identification is GNU 4.9.2 -- Check for working C compiler: /usr/bin/i486-pld-linux-gcc -- Check for working C compiler: /usr/bin/i486-pld-linux-gcc -- works -- Detecting C compiler ABI info -- Detecting C compiler ABI info - done -- Detecting C compile features -- Detecting C compile features - done -- Check for working CXX compiler: /usr/bin/i486-pld-linux-g++ -- Check for working CXX compiler: /usr/bin/i486-pld-linux-g++ -- works -- Detecting CXX compiler ABI info -- Detecting CXX compiler ABI info - done -- Detecting CXX compile features -- Detecting CXX compile features - done -- Project source dir = /tmp/B.ce933447-a97a-4447-bbf0-fefd2ffafca1/BUILD/OpenImageIO-oiio-bcdad81/src -- Project build dir = /tmp/B.ce933447-a97a-4447-bbf0-fefd2ffafca1/BUILD/OpenImageIO-oiio-bcdad81/build -- Using gcc 4.9.2 as the compiler -- CMAKE_CXX_COMPILER_ID is GNU -- NO THREADS! -- TBB will not be used -- Setting Namespace to: OpenImageIO -- platform = linux -- Looking for include file pthread.h -- Looking for include file pthread.h - found -- Looking for pthread_create -- Looking for pthread_create - not found -- Looking for pthread_create in pthreads -- Looking for pthread_create in pthreads - not found -- Looking for pthread_create in pthread -- Looking for pthread_create in pthread - found -- Found Threads: TRUE -- Found IlmBase: /usr/include -- Found OpenEXR: /usr/include -- BOOST_ROOT -- Boost version: 1.57.0 -- Found the following Boost libraries: -- filesystem -- regex -- system -- thread -- Looking for XOpenDisplay in /usr/lib/libX11.so;/usr/lib/libXext.so -- Looking for XOpenDisplay in /usr/lib/libX11.so;/usr/lib/libXext.so - found -- Looking for gethostbyname -- Looking for gethostbyname - found -- Looking for connect -- Looking for connect - found -- Looking for remove -- Looking for remove - found -- Looking for shmat -- Looking for shmat - found -- Looking for IceConnectionNumber in ICE -- Looking for IceConnectionNumber in ICE - found -- Found X11: /usr/lib/libX11.so -- Found OpenGL: /usr/lib/libGL.so -- OPENGL_FOUND=TRUE USE_OPENGL=ON -- OpenColorIO enabled -- Looking for Q_WS_X11 -- Looking for Q_WS_X11 - found -- Looking for Q_WS_WIN -- Looking for Q_WS_WIN - not found -- Looking for Q_WS_QWS -- Looking for Q_WS_QWS - not found -- Looking for Q_WS_MAC -- Looking for Q_WS_MAC - not found -- Found Qt4: /usr/bin/qmake-qt4 (found version "4.8.6") -- Found OpenJpeg: /usr/include/openjpeg-1.5 -- Found PugiXML: /usr/lib/libpugixml.so -- PugiXML include = /usr/include -- PugiXML library = /usr/lib/libpugixml.so -- Found Freetype: /usr/lib/libfreetype.so (found version "2.5.5") -- Found OpenSSL: /usr/lib/libssl.so;/usr/lib/libcrypto.so (found version "1.0.1k") -- OpenSSL enabled -- Found TIFF: /usr/lib/libtiff.so (found version "4.0.3") -- Linking OpenColorIO /usr/lib/libOpenColorIO.so -- Setting SOVERSION to: 1.2 -- Found ZLIB: /usr/lib/libz.so (found version "1.2.8") -- Found PNG: /usr/lib/libpng.so (found version "1.6.16") -- Found JPEG: /usr/lib/libjpeg.so -- Found PythonLibs: /usr/lib/libpython2.7.so (found suitable version "2.7.9", minimum required is "2.6") -- Boost version: 1.57.0 -- Found the following Boost libraries: -- python -- Python found TRUE -- Python include dirs /usr/include/python2.7 -- Python libraries /usr/lib/libpython2.7.so -- Python to include 'lib' prefix: OFF -- Python to include SO version: OFF -- Create version.h from version.h.in -- Found PythonInterp: /usr/bin/python (found version "2.7.9") -- Unix man page documentation will be generated -- Did not find /tmp/B.ce933447-a97a-4447-bbf0-fefd2ffafca1/BUILD/OpenImageIO-oiio-bcdad81/src/../../bmpsuite -- -> Will not run tests bmp -- -> You can find it at http://entropymine.com/jason/bmpsuite/bmpsuite.zip -- Did not find /tmp/B.ce933447-a97a-4447-bbf0-fefd2ffafca1/BUILD/OpenImageIO-oiio-bcdad81/src/../../libtiffpic -- -> Will not run tests tiff-suite;tiff-depths -- -> You can find it at http://www.remotesensing.org/libtiff/images.html -- Did not find /tmp/B.ce933447-a97a-4447-bbf0-fefd2ffafca1/BUILD/OpenImageIO-oiio-bcdad81/src/../../openexr-images -- -> Will not run tests openexr-suite;openexr-multires;openexr-chroma;openexr-v2 -- -> You can find it at http://www.openexr.com/downloads.html -- Did not find /tmp/B.ce933447-a97a-4447-bbf0-fefd2ffafca1/BUILD/OpenImageIO-oiio-bcdad81/src/../../j2kp4files_v1_5 -- -> Will not run tests jpeg2000 -- -> You can find it at http://www.itu.int/net/ITU-T/sigdb/speimage/ImageForm-s.aspx?val=10100803 -- Did not find /tmp/B.ce933447-a97a-4447-bbf0-fefd2ffafca1/BUILD/OpenImageIO-oiio-bcdad81/src/../../TGAUTILS -- -> Will not run tests targa-tgautils -- -> You can find it at http://tgautils.inequation.org/ -- Did not find /tmp/B.ce933447-a97a-4447-bbf0-fefd2ffafca1/BUILD/OpenImageIO-oiio-bcdad81/src/../../fits-images -- -> Will not run tests fits -- -> You can find it at http://www.cv.nrao.edu/fits/data/tests/ -- Did not find /tmp/B.ce933447-a97a-4447-bbf0-fefd2ffafca1/BUILD/OpenImageIO-oiio-bcdad81/src/../../webp-images -- -> Will not run tests webp -- -> You can find it at http://code.google.com/speed/webp/gallery.html running cmake -E copy /tmp/B.ce933447-a97a-4447-bbf0-fefd2ffafca1/BUILD/OpenImageIO-oiio-bcdad81/src/../LICENSE /tmp/B.ce933447-a97a-4447-bbf0-fefd2ffafca1/BUILD/OpenImageIO-oiio-bcdad81/build/License.txt 2>&1 running cmake -E copy /tmp/B.ce933447-a97a-4447-bbf0-fefd2ffafca1/BUILD/OpenImageIO-oiio-bcdad81/src/../README.rst /tmp/B.ce933447-a97a-4447-bbf0-fefd2ffafca1/BUILD/OpenImageIO-oiio-bcdad81/build/Readme.rst 2>&1 -- Configuring done CMake Warning (dev) at libOpenImageIO/CMakeLists.txt:253 (add_dependencies): Policy CMP0046 is not set: Error on non-existent dependency in add_dependencies. Run "cmake --help-policy CMP0046" for policy details. Use the cmake_policy command to set the policy and suppress this warning. The dependency target "/tmp/B.ce933447-a97a-4447-bbf0-fefd2ffafca1/BUILD/OpenImageIO-oiio-bcdad81/src/libOpenImageIO/libOpenImageIO.map" of target "OpenImageIO" does not exist. This warning is for project developers. Use -Wno-dev to suppress it. -- Generating done CMake Warning: Manually-specified variables were not used by the project: CMAKE_C_FLAGS_PLD CMAKE_Fortran_FLAGS_PLD CMAKE_INSTALL_BINDIR CMAKE_INSTALL_DATADIR CMAKE_INSTALL_DATAROOTDIR CMAKE_INSTALL_DOCDIR CMAKE_INSTALL_INCLUDEDIR CMAKE_INSTALL_INFODIR CMAKE_INSTALL_LIBDIR CMAKE_INSTALL_LIBEXECDIR CMAKE_INSTALL_LOCALEDIR CMAKE_INSTALL_LOCALSTATEDIRPATH CMAKE_INSTALL_MANDIR CMAKE_INSTALL_OLDINCLUDEDIR CMAKE_INSTALL_SBINDIR CMAKE_INSTALL_SHAREDSTATEDIRPATH CMAKE_INSTALL_SYSCONFDIR CMAKE_MODULE_LINKER_FLAGS_PLD SYSCONF_INSTALL_DIR -- Build files have been written to: /tmp/B.ce933447-a97a-4447-bbf0-fefd2ffafca1/BUILD/OpenImageIO-oiio-bcdad81/build + /usr/bin/make -Otarget -j9 /usr/bin/cmake -H/tmp/B.ce933447-a97a-4447-bbf0-fefd2ffafca1/BUILD/OpenImageIO-oiio-bcdad81/src -B/tmp/B.ce933447-a97a-4447-bbf0-fefd2ffafca1/BUILD/OpenImageIO-oiio-bcdad81/build --check-build-system CMakeFiles/Makefile.cmake 0 /usr/bin/cmake -E cmake_progress_start /tmp/B.ce933447-a97a-4447-bbf0-fefd2ffafca1/BUILD/OpenImageIO-oiio-bcdad81/build/CMakeFiles /tmp/B.ce933447-a97a-4447-bbf0-fefd2ffafca1/BUILD/OpenImageIO-oiio-bcdad81/build/CMakeFiles/progress.marks /usr/bin/make -f CMakeFiles/Makefile2 all /usr/bin/make -f libOpenImageIO/CMakeFiles/OpenImageIO.dir/build.make libOpenImageIO/CMakeFiles/OpenImageIO.dir/depend make[2]: Entering directory '/tmp/B.ce933447-a97a-4447-bbf0-fefd2ffafca1/BUILD/OpenImageIO-oiio-bcdad81/build' cd /tmp/B.ce933447-a97a-4447-bbf0-fefd2ffafca1/BUILD/OpenImageIO-oiio-bcdad81/build && /usr/bin/cmake -E cmake_depends "Unix Makefiles" /tmp/B.ce933447-a97a-4447-bbf0-fefd2ffafca1/BUILD/OpenImageIO-oiio-bcdad81/src /tmp/B.ce933447-a97a-4447-bbf0-fefd2ffafca1/BUILD/OpenImageIO-oiio-bcdad81/src/libOpenImageIO /tmp/B.ce933447-a97a-4447-bbf0-fefd2ffafca1/BUILD/OpenImageIO-oiio-bcdad81/build /tmp/B.ce933447-a97a-4447-bbf0-fefd2ffafca1/BUILD/OpenImageIO-oiio-bcdad81/build/libOpenImageIO /tmp/B.ce933447-a97a-4447-bbf0-fefd2ffafca1/BUILD/OpenImageIO-oiio-bcdad81/build/libOpenImageIO/CMakeFiles/OpenImageIO.dir/DependInfo.cmake --color= Scanning dependencies of target OpenImageIO make[2]: Leaving directory '/tmp/B.ce933447-a97a-4447-bbf0-fefd2ffafca1/BUILD/OpenImageIO-oiio-bcdad81/build' /usr/bin/make -f libOpenImageIO/CMakeFiles/OpenImageIO.dir/build.make libOpenImageIO/CMakeFiles/OpenImageIO.dir/build make[2]: Entering directory '/tmp/B.ce933447-a97a-4447-bbf0-fefd2ffafca1/BUILD/OpenImageIO-oiio-bcdad81/build' /usr/bin/cmake -E cmake_progress_report /tmp/B.ce933447-a97a-4447-bbf0-fefd2ffafca1/BUILD/OpenImageIO-oiio-bcdad81/build/CMakeFiles [ 5%] Building CXX object libOpenImageIO/CMakeFiles/OpenImageIO.dir/iptc.cpp.o cd /tmp/B.ce933447-a97a-4447-bbf0-fefd2ffafca1/BUILD/OpenImageIO-oiio-bcdad81/build/libOpenImageIO && /usr/bin/i486-pld-linux-g++ -DBOOST_TEST_DYN_LINK -DNOTHREADS=1 -DOpenImageIO_EXPORTS -DPTEX_EXPORTS -DUSE_FIELD3D=1 -DUSE_FREETYPE -DUSE_OCIO=1 -DUSE_OPENCV -DUSE_OPENEXR_VERSION2=1 -DUSE_OPENSSL=1 -DUSE_TBB=0 -O2 -fwrapv -pipe -Wformat -Werror=format-security -gdwarf-4 -fno-debug-types-section -fvar-tracking-assignments -g2 -Wp,-D_FORTIFY_SOURCE=2 -fstack-protector --param=ssp-buffer-size=4 -fomit-frame-pointer -march=i486 -fasynchronous-unwind-tables -gdwarf-4 -fno-debug-types-section -fvar-tracking-assignments -g2 -DNDEBUG -DQT_NO_DEBUG -fPIC -I/usr/include/OpenEXR -I/tmp/B.ce933447-a97a-4447-bbf0-fefd2ffafca1/BUILD/OpenImageIO-oiio-bcdad81/src/include -I/tmp/B.ce933447-a97a-4447-bbf0-fefd2ffafca1/BUILD/OpenImageIO-oiio-bcdad81/build/include -I/usr/include/freetype2 -Wall -Werror -o CMakeFiles/OpenImageIO.dir/iptc.cpp.o -c /tmp/B.ce933447-a97a-4447-bbf0-fefd2ffafca1/BUILD/OpenImageIO-oiio-bcdad81/src/libOpenImageIO/iptc.cpp make[2]: Leaving directory '/tmp/B.ce933447-a97a-4447-bbf0-fefd2ffafca1/BUILD/OpenImageIO-oiio-bcdad81/build' make[2]: Entering directory '/tmp/B.ce933447-a97a-4447-bbf0-fefd2ffafca1/BUILD/OpenImageIO-oiio-bcdad81/build' /usr/bin/cmake -E cmake_progress_report /tmp/B.ce933447-a97a-4447-bbf0-fefd2ffafca1/BUILD/OpenImageIO-oiio-bcdad81/build/CMakeFiles [ 0%] Building CXX object libOpenImageIO/CMakeFiles/OpenImageIO.dir/exif.cpp.o cd /tmp/B.ce933447-a97a-4447-bbf0-fefd2ffafca1/BUILD/OpenImageIO-oiio-bcdad81/build/libOpenImageIO && /usr/bin/i486-pld-linux-g++ -DBOOST_TEST_DYN_LINK -DNOTHREADS=1 -DOpenImageIO_EXPORTS -DPTEX_EXPORTS -DUSE_FIELD3D=1 -DUSE_FREETYPE -DUSE_OCIO=1 -DUSE_OPENCV -DUSE_OPENEXR_VERSION2=1 -DUSE_OPENSSL=1 -DUSE_TBB=0 -O2 -fwrapv -pipe -Wformat -Werror=format-security -gdwarf-4 -fno-debug-types-section -fvar-tracking-assignments -g2 -Wp,-D_FORTIFY_SOURCE=2 -fstack-protector --param=ssp-buffer-size=4 -fomit-frame-pointer -march=i486 -fasynchronous-unwind-tables -gdwarf-4 -fno-debug-types-section -fvar-tracking-assignments -g2 -DNDEBUG -DQT_NO_DEBUG -fPIC -I/usr/include/OpenEXR -I/tmp/B.ce933447-a97a-4447-bbf0-fefd2ffafca1/BUILD/OpenImageIO-oiio-bcdad81/src/include -I/tmp/B.ce933447-a97a-4447-bbf0-fefd2ffafca1/BUILD/OpenImageIO-oiio-bcdad81/build/include -I/usr/include/freetype2 -Wall -Werror -o CMakeFiles/OpenImageIO.dir/exif.cpp.o -c /tmp/B.ce933447-a97a-4447-bbf0-fefd2ffafca1/BUILD/OpenImageIO-oiio-bcdad81/src/libOpenImageIO/exif.cpp make[2]: Leaving directory '/tmp/B.ce933447-a97a-4447-bbf0-fefd2ffafca1/BUILD/OpenImageIO-oiio-bcdad81/build' make[2]: Entering directory '/tmp/B.ce933447-a97a-4447-bbf0-fefd2ffafca1/BUILD/OpenImageIO-oiio-bcdad81/build' /usr/bin/cmake -E cmake_progress_report /tmp/B.ce933447-a97a-4447-bbf0-fefd2ffafca1/BUILD/OpenImageIO-oiio-bcdad81/build/CMakeFiles 1 [ 1%] Building CXX object libOpenImageIO/CMakeFiles/OpenImageIO.dir/formatspec.cpp.o cd /tmp/B.ce933447-a97a-4447-bbf0-fefd2ffafca1/BUILD/OpenImageIO-oiio-bcdad81/build/libOpenImageIO && /usr/bin/i486-pld-linux-g++ -DBOOST_TEST_DYN_LINK -DNOTHREADS=1 -DOpenImageIO_EXPORTS -DPTEX_EXPORTS -DUSE_FIELD3D=1 -DUSE_FREETYPE -DUSE_OCIO=1 -DUSE_OPENCV -DUSE_OPENEXR_VERSION2=1 -DUSE_OPENSSL=1 -DUSE_TBB=0 -O2 -fwrapv -pipe -Wformat -Werror=format-security -gdwarf-4 -fno-debug-types-section -fvar-tracking-assignments -g2 -Wp,-D_FORTIFY_SOURCE=2 -fstack-protector --param=ssp-buffer-size=4 -fomit-frame-pointer -march=i486 -fasynchronous-unwind-tables -gdwarf-4 -fno-debug-types-section -fvar-tracking-assignments -g2 -DNDEBUG -DQT_NO_DEBUG -fPIC -I/usr/include/OpenEXR -I/tmp/B.ce933447-a97a-4447-bbf0-fefd2ffafca1/BUILD/OpenImageIO-oiio-bcdad81/src/include -I/tmp/B.ce933447-a97a-4447-bbf0-fefd2ffafca1/BUILD/OpenImageIO-oiio-bcdad81/build/include -I/usr/include/freetype2 -Wall -Werror -o CMakeFiles/OpenImageIO.dir/formatspec.cpp.o -c /tmp/B.ce933447-a97a-4447-bbf0-fefd2ffafca1/BUILD/OpenImageIO-oiio-bcdad81/src/libOpenImageIO/formatspec.cpp make[2]: Leaving directory '/tmp/B.ce933447-a97a-4447-bbf0-fefd2ffafca1/BUILD/OpenImageIO-oiio-bcdad81/build' make[2]: Entering directory '/tmp/B.ce933447-a97a-4447-bbf0-fefd2ffafca1/BUILD/OpenImageIO-oiio-bcdad81/build' /usr/bin/cmake -E cmake_progress_report /tmp/B.ce933447-a97a-4447-bbf0-fefd2ffafca1/BUILD/OpenImageIO-oiio-bcdad81/build/CMakeFiles 7 [ 7%] Building CXX object libOpenImageIO/CMakeFiles/OpenImageIO.dir/color_ocio.cpp.o cd /tmp/B.ce933447-a97a-4447-bbf0-fefd2ffafca1/BUILD/OpenImageIO-oiio-bcdad81/build/libOpenImageIO && /usr/bin/i486-pld-linux-g++ -DBOOST_TEST_DYN_LINK -DNOTHREADS=1 -DOpenImageIO_EXPORTS -DPTEX_EXPORTS -DUSE_FIELD3D=1 -DUSE_FREETYPE -DUSE_OCIO=1 -DUSE_OPENCV -DUSE_OPENEXR_VERSION2=1 -DUSE_OPENSSL=1 -DUSE_TBB=0 -O2 -fwrapv -pipe -Wformat -Werror=format-security -gdwarf-4 -fno-debug-types-section -fvar-tracking-assignments -g2 -Wp,-D_FORTIFY_SOURCE=2 -fstack-protector --param=ssp-buffer-size=4 -fomit-frame-pointer -march=i486 -fasynchronous-unwind-tables -gdwarf-4 -fno-debug-types-section -fvar-tracking-assignments -g2 -DNDEBUG -DQT_NO_DEBUG -fPIC -I/usr/include/OpenEXR -I/tmp/B.ce933447-a97a-4447-bbf0-fefd2ffafca1/BUILD/OpenImageIO-oiio-bcdad81/src/include -I/tmp/B.ce933447-a97a-4447-bbf0-fefd2ffafca1/BUILD/OpenImageIO-oiio-bcdad81/build/include -I/usr/include/freetype2 -Wall -Werror -o CMakeFiles/OpenImageIO.dir/color_ocio.cpp.o -c /tmp/B.ce933447-a97a-4447-bbf0-fefd2ffafca1/BUILD/OpenImageIO-oiio-bcdad81/src/libOpenImageIO/color_ocio.cpp make[2]: Leaving directory '/tmp/B.ce933447-a97a-4447-bbf0-fefd2ffafca1/BUILD/OpenImageIO-oiio-bcdad81/build' make[2]: Entering directory '/tmp/B.ce933447-a97a-4447-bbf0-fefd2ffafca1/BUILD/OpenImageIO-oiio-bcdad81/build' /usr/bin/cmake -E cmake_progress_report /tmp/B.ce933447-a97a-4447-bbf0-fefd2ffafca1/BUILD/OpenImageIO-oiio-bcdad81/build/CMakeFiles 5 [ 5%] Building CXX object libOpenImageIO/CMakeFiles/OpenImageIO.dir/imageoutput.cpp.o cd /tmp/B.ce933447-a97a-4447-bbf0-fefd2ffafca1/BUILD/OpenImageIO-oiio-bcdad81/build/libOpenImageIO && /usr/bin/i486-pld-linux-g++ -DBOOST_TEST_DYN_LINK -DNOTHREADS=1 -DOpenImageIO_EXPORTS -DPTEX_EXPORTS -DUSE_FIELD3D=1 -DUSE_FREETYPE -DUSE_OCIO=1 -DUSE_OPENCV -DUSE_OPENEXR_VERSION2=1 -DUSE_OPENSSL=1 -DUSE_TBB=0 -O2 -fwrapv -pipe -Wformat -Werror=format-security -gdwarf-4 -fno-debug-types-section -fvar-tracking-assignments -g2 -Wp,-D_FORTIFY_SOURCE=2 -fstack-protector --param=ssp-buffer-size=4 -fomit-frame-pointer -march=i486 -fasynchronous-unwind-tables -gdwarf-4 -fno-debug-types-section -fvar-tracking-assignments -g2 -DNDEBUG -DQT_NO_DEBUG -fPIC -I/usr/include/OpenEXR -I/tmp/B.ce933447-a97a-4447-bbf0-fefd2ffafca1/BUILD/OpenImageIO-oiio-bcdad81/src/include -I/tmp/B.ce933447-a97a-4447-bbf0-fefd2ffafca1/BUILD/OpenImageIO-oiio-bcdad81/build/include -I/usr/include/freetype2 -Wall -Werror -o CMakeFiles/OpenImageIO.dir/imageoutput.cpp.o -c /tmp/B.ce933447-a97a-4447-bbf0-fefd2ffafca1/BUILD/OpenImageIO-oiio-bcdad81/src/libOpenImageIO/imageoutput.cpp make[2]: Leaving directory '/tmp/B.ce933447-a97a-4447-bbf0-fefd2ffafca1/BUILD/OpenImageIO-oiio-bcdad81/build' make[2]: Entering directory '/tmp/B.ce933447-a97a-4447-bbf0-fefd2ffafca1/BUILD/OpenImageIO-oiio-bcdad81/build' /usr/bin/cmake -E cmake_progress_report /tmp/B.ce933447-a97a-4447-bbf0-fefd2ffafca1/BUILD/OpenImageIO-oiio-bcdad81/build/CMakeFiles 3 [ 2%] Building CXX object libOpenImageIO/CMakeFiles/OpenImageIO.dir/imageio.cpp.o cd /tmp/B.ce933447-a97a-4447-bbf0-fefd2ffafca1/BUILD/OpenImageIO-oiio-bcdad81/build/libOpenImageIO && /usr/bin/i486-pld-linux-g++ -DBOOST_TEST_DYN_LINK -DNOTHREADS=1 -DOpenImageIO_EXPORTS -DPTEX_EXPORTS -DUSE_FIELD3D=1 -DUSE_FREETYPE -DUSE_OCIO=1 -DUSE_OPENCV -DUSE_OPENEXR_VERSION2=1 -DUSE_OPENSSL=1 -DUSE_TBB=0 -O2 -fwrapv -pipe -Wformat -Werror=format-security -gdwarf-4 -fno-debug-types-section -fvar-tracking-assignments -g2 -Wp,-D_FORTIFY_SOURCE=2 -fstack-protector --param=ssp-buffer-size=4 -fomit-frame-pointer -march=i486 -fasynchronous-unwind-tables -gdwarf-4 -fno-debug-types-section -fvar-tracking-assignments -g2 -DNDEBUG -DQT_NO_DEBUG -fPIC -I/usr/include/OpenEXR -I/tmp/B.ce933447-a97a-4447-bbf0-fefd2ffafca1/BUILD/OpenImageIO-oiio-bcdad81/src/include -I/tmp/B.ce933447-a97a-4447-bbf0-fefd2ffafca1/BUILD/OpenImageIO-oiio-bcdad81/build/include -I/usr/include/freetype2 -Wall -Werror -o CMakeFiles/OpenImageIO.dir/imageio.cpp.o -c /tmp/B.ce933447-a97a-4447-bbf0-fefd2ffafca1/BUILD/OpenImageIO-oiio-bcdad81/src/libOpenImageIO/imageio.cpp make[2]: Leaving directory '/tmp/B.ce933447-a97a-4447-bbf0-fefd2ffafca1/BUILD/OpenImageIO-oiio-bcdad81/build' make[2]: Entering directory '/tmp/B.ce933447-a97a-4447-bbf0-fefd2ffafca1/BUILD/OpenImageIO-oiio-bcdad81/build' /usr/bin/cmake -E cmake_progress_report /tmp/B.ce933447-a97a-4447-bbf0-fefd2ffafca1/BUILD/OpenImageIO-oiio-bcdad81/build/CMakeFiles [ 4%] Building CXX object libOpenImageIO/CMakeFiles/OpenImageIO.dir/imageinput.cpp.o cd /tmp/B.ce933447-a97a-4447-bbf0-fefd2ffafca1/BUILD/OpenImageIO-oiio-bcdad81/build/libOpenImageIO && /usr/bin/i486-pld-linux-g++ -DBOOST_TEST_DYN_LINK -DNOTHREADS=1 -DOpenImageIO_EXPORTS -DPTEX_EXPORTS -DUSE_FIELD3D=1 -DUSE_FREETYPE -DUSE_OCIO=1 -DUSE_OPENCV -DUSE_OPENEXR_VERSION2=1 -DUSE_OPENSSL=1 -DUSE_TBB=0 -O2 -fwrapv -pipe -Wformat -Werror=format-security -gdwarf-4 -fno-debug-types-section -fvar-tracking-assignments -g2 -Wp,-D_FORTIFY_SOURCE=2 -fstack-protector --param=ssp-buffer-size=4 -fomit-frame-pointer -march=i486 -fasynchronous-unwind-tables -gdwarf-4 -fno-debug-types-section -fvar-tracking-assignments -g2 -DNDEBUG -DQT_NO_DEBUG -fPIC -I/usr/include/OpenEXR -I/tmp/B.ce933447-a97a-4447-bbf0-fefd2ffafca1/BUILD/OpenImageIO-oiio-bcdad81/src/include -I/tmp/B.ce933447-a97a-4447-bbf0-fefd2ffafca1/BUILD/OpenImageIO-oiio-bcdad81/build/include -I/usr/include/freetype2 -Wall -Werror -o CMakeFiles/OpenImageIO.dir/imageinput.cpp.o -c /tmp/B.ce933447-a97a-4447-bbf0-fefd2ffafca1/BUILD/OpenImageIO-oiio-bcdad81/src/libOpenImageIO/imageinput.cpp make[2]: Leaving directory '/tmp/B.ce933447-a97a-4447-bbf0-fefd2ffafca1/BUILD/OpenImageIO-oiio-bcdad81/build' make[2]: Entering directory '/tmp/B.ce933447-a97a-4447-bbf0-fefd2ffafca1/BUILD/OpenImageIO-oiio-bcdad81/build' /usr/bin/cmake -E cmake_progress_report /tmp/B.ce933447-a97a-4447-bbf0-fefd2ffafca1/BUILD/OpenImageIO-oiio-bcdad81/build/CMakeFiles 6 [ 6%] Building CXX object libOpenImageIO/CMakeFiles/OpenImageIO.dir/xmp.cpp.o cd /tmp/B.ce933447-a97a-4447-bbf0-fefd2ffafca1/BUILD/OpenImageIO-oiio-bcdad81/build/libOpenImageIO && /usr/bin/i486-pld-linux-g++ -DBOOST_TEST_DYN_LINK -DNOTHREADS=1 -DOpenImageIO_EXPORTS -DPTEX_EXPORTS -DUSE_FIELD3D=1 -DUSE_FREETYPE -DUSE_OCIO=1 -DUSE_OPENCV -DUSE_OPENEXR_VERSION2=1 -DUSE_OPENSSL=1 -DUSE_TBB=0 -O2 -fwrapv -pipe -Wformat -Werror=format-security -gdwarf-4 -fno-debug-types-section -fvar-tracking-assignments -g2 -Wp,-D_FORTIFY_SOURCE=2 -fstack-protector --param=ssp-buffer-size=4 -fomit-frame-pointer -march=i486 -fasynchronous-unwind-tables -gdwarf-4 -fno-debug-types-section -fvar-tracking-assignments -g2 -DNDEBUG -DQT_NO_DEBUG -fPIC -I/usr/include/OpenEXR -I/tmp/B.ce933447-a97a-4447-bbf0-fefd2ffafca1/BUILD/OpenImageIO-oiio-bcdad81/src/include -I/tmp/B.ce933447-a97a-4447-bbf0-fefd2ffafca1/BUILD/OpenImageIO-oiio-bcdad81/build/include -I/usr/include/freetype2 -Wall -Werror -o CMakeFiles/OpenImageIO.dir/xmp.cpp.o -c /tmp/B.ce933447-a97a-4447-bbf0-fefd2ffafca1/BUILD/OpenImageIO-oiio-bcdad81/src/libOpenImageIO/xmp.cpp make[2]: Leaving directory '/tmp/B.ce933447-a97a-4447-bbf0-fefd2ffafca1/BUILD/OpenImageIO-oiio-bcdad81/build' make[2]: Entering directory '/tmp/B.ce933447-a97a-4447-bbf0-fefd2ffafca1/BUILD/OpenImageIO-oiio-bcdad81/build' /usr/bin/cmake -E cmake_progress_report /tmp/B.ce933447-a97a-4447-bbf0-fefd2ffafca1/BUILD/OpenImageIO-oiio-bcdad81/build/CMakeFiles 4 [ 3%] Building CXX object libOpenImageIO/CMakeFiles/OpenImageIO.dir/imageioplugin.cpp.o cd /tmp/B.ce933447-a97a-4447-bbf0-fefd2ffafca1/BUILD/OpenImageIO-oiio-bcdad81/build/libOpenImageIO && /usr/bin/i486-pld-linux-g++ -DBOOST_TEST_DYN_LINK -DNOTHREADS=1 -DOpenImageIO_EXPORTS -DPTEX_EXPORTS -DUSE_FIELD3D=1 -DUSE_FREETYPE -DUSE_OCIO=1 -DUSE_OPENCV -DUSE_OPENEXR_VERSION2=1 -DUSE_OPENSSL=1 -DUSE_TBB=0 -O2 -fwrapv -pipe -Wformat -Werror=format-security -gdwarf-4 -fno-debug-types-section -fvar-tracking-assignments -g2 -Wp,-D_FORTIFY_SOURCE=2 -fstack-protector --param=ssp-buffer-size=4 -fomit-frame-pointer -march=i486 -fasynchronous-unwind-tables -gdwarf-4 -fno-debug-types-section -fvar-tracking-assignments -g2 -DNDEBUG -DQT_NO_DEBUG -fPIC -I/usr/include/OpenEXR -I/tmp/B.ce933447-a97a-4447-bbf0-fefd2ffafca1/BUILD/OpenImageIO-oiio-bcdad81/src/include -I/tmp/B.ce933447-a97a-4447-bbf0-fefd2ffafca1/BUILD/OpenImageIO-oiio-bcdad81/build/include -I/usr/include/freetype2 -Wall -Werror -o CMakeFiles/OpenImageIO.dir/imageioplugin.cpp.o -c /tmp/B.ce933447-a97a-4447-bbf0-fefd2ffafca1/BUILD/OpenImageIO-oiio-bcdad81/src/libOpenImageIO/imageioplugin.cpp make[2]: Leaving directory '/tmp/B.ce933447-a97a-4447-bbf0-fefd2ffafca1/BUILD/OpenImageIO-oiio-bcdad81/build' make[2]: Entering directory '/tmp/B.ce933447-a97a-4447-bbf0-fefd2ffafca1/BUILD/OpenImageIO-oiio-bcdad81/build' /usr/bin/cmake -E cmake_progress_report /tmp/B.ce933447-a97a-4447-bbf0-fefd2ffafca1/BUILD/OpenImageIO-oiio-bcdad81/build/CMakeFiles [ 12%] Building CXX object libOpenImageIO/CMakeFiles/OpenImageIO.dir/__/libutil/argparse.cpp.o cd /tmp/B.ce933447-a97a-4447-bbf0-fefd2ffafca1/BUILD/OpenImageIO-oiio-bcdad81/build/libOpenImageIO && /usr/bin/i486-pld-linux-g++ -DBOOST_TEST_DYN_LINK -DNOTHREADS=1 -DOpenImageIO_EXPORTS -DPTEX_EXPORTS -DUSE_FIELD3D=1 -DUSE_FREETYPE -DUSE_OCIO=1 -DUSE_OPENCV -DUSE_OPENEXR_VERSION2=1 -DUSE_OPENSSL=1 -DUSE_TBB=0 -O2 -fwrapv -pipe -Wformat -Werror=format-security -gdwarf-4 -fno-debug-types-section -fvar-tracking-assignments -g2 -Wp,-D_FORTIFY_SOURCE=2 -fstack-protector --param=ssp-buffer-size=4 -fomit-frame-pointer -march=i486 -fasynchronous-unwind-tables -gdwarf-4 -fno-debug-types-section -fvar-tracking-assignments -g2 -DNDEBUG -DQT_NO_DEBUG -fPIC -I/usr/include/OpenEXR -I/tmp/B.ce933447-a97a-4447-bbf0-fefd2ffafca1/BUILD/OpenImageIO-oiio-bcdad81/src/include -I/tmp/B.ce933447-a97a-4447-bbf0-fefd2ffafca1/BUILD/OpenImageIO-oiio-bcdad81/build/include -I/usr/include/freetype2 -Wall -Werror -o CMakeFiles/OpenImageIO.dir/__/libutil/argparse.cpp.o -c /tmp/B.ce933447-a97a-4447-bbf0-fefd2ffafca1/BUILD/OpenImageIO-oiio-bcdad81/src/libutil/argparse.cpp make[2]: Leaving directory '/tmp/B.ce933447-a97a-4447-bbf0-fefd2ffafca1/BUILD/OpenImageIO-oiio-bcdad81/build' make[2]: Entering directory '/tmp/B.ce933447-a97a-4447-bbf0-fefd2ffafca1/BUILD/OpenImageIO-oiio-bcdad81/build' /usr/bin/cmake -E cmake_progress_report /tmp/B.ce933447-a97a-4447-bbf0-fefd2ffafca1/BUILD/OpenImageIO-oiio-bcdad81/build/CMakeFiles 2 [ 4%] Building CXX object libOpenImageIO/CMakeFiles/OpenImageIO.dir/imagebuf.cpp.o cd /tmp/B.ce933447-a97a-4447-bbf0-fefd2ffafca1/BUILD/OpenImageIO-oiio-bcdad81/build/libOpenImageIO && /usr/bin/i486-pld-linux-g++ -DBOOST_TEST_DYN_LINK -DNOTHREADS=1 -DOpenImageIO_EXPORTS -DPTEX_EXPORTS -DUSE_FIELD3D=1 -DUSE_FREETYPE -DUSE_OCIO=1 -DUSE_OPENCV -DUSE_OPENEXR_VERSION2=1 -DUSE_OPENSSL=1 -DUSE_TBB=0 -O2 -fwrapv -pipe -Wformat -Werror=format-security -gdwarf-4 -fno-debug-types-section -fvar-tracking-assignments -g2 -Wp,-D_FORTIFY_SOURCE=2 -fstack-protector --param=ssp-buffer-size=4 -fomit-frame-pointer -march=i486 -fasynchronous-unwind-tables -gdwarf-4 -fno-debug-types-section -fvar-tracking-assignments -g2 -DNDEBUG -DQT_NO_DEBUG -fPIC -I/usr/include/OpenEXR -I/tmp/B.ce933447-a97a-4447-bbf0-fefd2ffafca1/BUILD/OpenImageIO-oiio-bcdad81/src/include -I/tmp/B.ce933447-a97a-4447-bbf0-fefd2ffafca1/BUILD/OpenImageIO-oiio-bcdad81/build/include -I/usr/include/freetype2 -Wall -Werror -o CMakeFiles/OpenImageIO.dir/imagebuf.cpp.o -c /tmp/B.ce933447-a97a-4447-bbf0-fefd2ffafca1/BUILD/OpenImageIO-oiio-bcdad81/src/libOpenImageIO/imagebuf.cpp make[2]: Leaving directory '/tmp/B.ce933447-a97a-4447-bbf0-fefd2ffafca1/BUILD/OpenImageIO-oiio-bcdad81/build' make[2]: Entering directory '/tmp/B.ce933447-a97a-4447-bbf0-fefd2ffafca1/BUILD/OpenImageIO-oiio-bcdad81/build' /usr/bin/cmake -E cmake_progress_report /tmp/B.ce933447-a97a-4447-bbf0-fefd2ffafca1/BUILD/OpenImageIO-oiio-bcdad81/build/CMakeFiles 14 [ 14%] Building CXX object libOpenImageIO/CMakeFiles/OpenImageIO.dir/__/libutil/filesystem.cpp.o cd /tmp/B.ce933447-a97a-4447-bbf0-fefd2ffafca1/BUILD/OpenImageIO-oiio-bcdad81/build/libOpenImageIO && /usr/bin/i486-pld-linux-g++ -DBOOST_TEST_DYN_LINK -DNOTHREADS=1 -DOpenImageIO_EXPORTS -DPTEX_EXPORTS -DUSE_FIELD3D=1 -DUSE_FREETYPE -DUSE_OCIO=1 -DUSE_OPENCV -DUSE_OPENEXR_VERSION2=1 -DUSE_OPENSSL=1 -DUSE_TBB=0 -O2 -fwrapv -pipe -Wformat -Werror=format-security -gdwarf-4 -fno-debug-types-section -fvar-tracking-assignments -g2 -Wp,-D_FORTIFY_SOURCE=2 -fstack-protector --param=ssp-buffer-size=4 -fomit-frame-pointer -march=i486 -fasynchronous-unwind-tables -gdwarf-4 -fno-debug-types-section -fvar-tracking-assignments -g2 -DNDEBUG -DQT_NO_DEBUG -fPIC -I/usr/include/OpenEXR -I/tmp/B.ce933447-a97a-4447-bbf0-fefd2ffafca1/BUILD/OpenImageIO-oiio-bcdad81/src/include -I/tmp/B.ce933447-a97a-4447-bbf0-fefd2ffafca1/BUILD/OpenImageIO-oiio-bcdad81/build/include -I/usr/include/freetype2 -Wall -Werror -o CMakeFiles/OpenImageIO.dir/__/libutil/filesystem.cpp.o -c /tmp/B.ce933447-a97a-4447-bbf0-fefd2ffafca1/BUILD/OpenImageIO-oiio-bcdad81/src/libutil/filesystem.cpp make[2]: Leaving directory '/tmp/B.ce933447-a97a-4447-bbf0-fefd2ffafca1/BUILD/OpenImageIO-oiio-bcdad81/build' make[2]: Entering directory '/tmp/B.ce933447-a97a-4447-bbf0-fefd2ffafca1/BUILD/OpenImageIO-oiio-bcdad81/build' /usr/bin/cmake -E cmake_progress_report /tmp/B.ce933447-a97a-4447-bbf0-fefd2ffafca1/BUILD/OpenImageIO-oiio-bcdad81/build/CMakeFiles 11 [ 11%] Building CXX object libOpenImageIO/CMakeFiles/OpenImageIO.dir/imagebufalgo_opencv.cpp.o cd /tmp/B.ce933447-a97a-4447-bbf0-fefd2ffafca1/BUILD/OpenImageIO-oiio-bcdad81/build/libOpenImageIO && /usr/bin/i486-pld-linux-g++ -DBOOST_TEST_DYN_LINK -DNOTHREADS=1 -DOpenImageIO_EXPORTS -DPTEX_EXPORTS -DUSE_FIELD3D=1 -DUSE_FREETYPE -DUSE_OCIO=1 -DUSE_OPENCV -DUSE_OPENEXR_VERSION2=1 -DUSE_OPENSSL=1 -DUSE_TBB=0 -O2 -fwrapv -pipe -Wformat -Werror=format-security -gdwarf-4 -fno-debug-types-section -fvar-tracking-assignments -g2 -Wp,-D_FORTIFY_SOURCE=2 -fstack-protector --param=ssp-buffer-size=4 -fomit-frame-pointer -march=i486 -fasynchronous-unwind-tables -gdwarf-4 -fno-debug-types-section -fvar-tracking-assignments -g2 -DNDEBUG -DQT_NO_DEBUG -fPIC -I/usr/include/OpenEXR -I/tmp/B.ce933447-a97a-4447-bbf0-fefd2ffafca1/BUILD/OpenImageIO-oiio-bcdad81/src/include -I/tmp/B.ce933447-a97a-4447-bbf0-fefd2ffafca1/BUILD/OpenImageIO-oiio-bcdad81/build/include -I/usr/include/freetype2 -Wall -Werror -o CMakeFiles/OpenImageIO.dir/imagebufalgo_opencv.cpp.o -c /tmp/B.ce933447-a97a-4447-bbf0-fefd2ffafca1/BUILD/OpenImageIO-oiio-bcdad81/src/libOpenImageIO/imagebufalgo_opencv.cpp make[2]: Leaving directory '/tmp/B.ce933447-a97a-4447-bbf0-fefd2ffafca1/BUILD/OpenImageIO-oiio-bcdad81/build' make[2]: Entering directory '/tmp/B.ce933447-a97a-4447-bbf0-fefd2ffafca1/BUILD/OpenImageIO-oiio-bcdad81/build' /usr/bin/cmake -E cmake_progress_report /tmp/B.ce933447-a97a-4447-bbf0-fefd2ffafca1/BUILD/OpenImageIO-oiio-bcdad81/build/CMakeFiles 13 [ 13%] Building CXX object libOpenImageIO/CMakeFiles/OpenImageIO.dir/__/libutil/errorhandler.cpp.o cd /tmp/B.ce933447-a97a-4447-bbf0-fefd2ffafca1/BUILD/OpenImageIO-oiio-bcdad81/build/libOpenImageIO && /usr/bin/i486-pld-linux-g++ -DBOOST_TEST_DYN_LINK -DNOTHREADS=1 -DOpenImageIO_EXPORTS -DPTEX_EXPORTS -DUSE_FIELD3D=1 -DUSE_FREETYPE -DUSE_OCIO=1 -DUSE_OPENCV -DUSE_OPENEXR_VERSION2=1 -DUSE_OPENSSL=1 -DUSE_TBB=0 -O2 -fwrapv -pipe -Wformat -Werror=format-security -gdwarf-4 -fno-debug-types-section -fvar-tracking-assignments -g2 -Wp,-D_FORTIFY_SOURCE=2 -fstack-protector --param=ssp-buffer-size=4 -fomit-frame-pointer -march=i486 -fasynchronous-unwind-tables -gdwarf-4 -fno-debug-types-section -fvar-tracking-assignments -g2 -DNDEBUG -DQT_NO_DEBUG -fPIC -I/usr/include/OpenEXR -I/tmp/B.ce933447-a97a-4447-bbf0-fefd2ffafca1/BUILD/OpenImageIO-oiio-bcdad81/src/include -I/tmp/B.ce933447-a97a-4447-bbf0-fefd2ffafca1/BUILD/OpenImageIO-oiio-bcdad81/build/include -I/usr/include/freetype2 -Wall -Werror -o CMakeFiles/OpenImageIO.dir/__/libutil/errorhandler.cpp.o -c /tmp/B.ce933447-a97a-4447-bbf0-fefd2ffafca1/BUILD/OpenImageIO-oiio-bcdad81/src/libutil/errorhandler.cpp make[2]: Leaving directory '/tmp/B.ce933447-a97a-4447-bbf0-fefd2ffafca1/BUILD/OpenImageIO-oiio-bcdad81/build' make[2]: Entering directory '/tmp/B.ce933447-a97a-4447-bbf0-fefd2ffafca1/BUILD/OpenImageIO-oiio-bcdad81/build' /usr/bin/cmake -E cmake_progress_report /tmp/B.ce933447-a97a-4447-bbf0-fefd2ffafca1/BUILD/OpenImageIO-oiio-bcdad81/build/CMakeFiles 15 [ 15%] Building CXX object libOpenImageIO/CMakeFiles/OpenImageIO.dir/__/libutil/filter.cpp.o cd /tmp/B.ce933447-a97a-4447-bbf0-fefd2ffafca1/BUILD/OpenImageIO-oiio-bcdad81/build/libOpenImageIO && /usr/bin/i486-pld-linux-g++ -DBOOST_TEST_DYN_LINK -DNOTHREADS=1 -DOpenImageIO_EXPORTS -DPTEX_EXPORTS -DUSE_FIELD3D=1 -DUSE_FREETYPE -DUSE_OCIO=1 -DUSE_OPENCV -DUSE_OPENEXR_VERSION2=1 -DUSE_OPENSSL=1 -DUSE_TBB=0 -O2 -fwrapv -pipe -Wformat -Werror=format-security -gdwarf-4 -fno-debug-types-section -fvar-tracking-assignments -g2 -Wp,-D_FORTIFY_SOURCE=2 -fstack-protector --param=ssp-buffer-size=4 -fomit-frame-pointer -march=i486 -fasynchronous-unwind-tables -gdwarf-4 -fno-debug-types-section -fvar-tracking-assignments -g2 -DNDEBUG -DQT_NO_DEBUG -fPIC -I/usr/include/OpenEXR -I/tmp/B.ce933447-a97a-4447-bbf0-fefd2ffafca1/BUILD/OpenImageIO-oiio-bcdad81/src/include -I/tmp/B.ce933447-a97a-4447-bbf0-fefd2ffafca1/BUILD/OpenImageIO-oiio-bcdad81/build/include -I/usr/include/freetype2 -Wall -Werror -o CMakeFiles/OpenImageIO.dir/__/libutil/filter.cpp.o -c /tmp/B.ce933447-a97a-4447-bbf0-fefd2ffafca1/BUILD/OpenImageIO-oiio-bcdad81/src/libutil/filter.cpp make[2]: Leaving directory '/tmp/B.ce933447-a97a-4447-bbf0-fefd2ffafca1/BUILD/OpenImageIO-oiio-bcdad81/build' make[2]: Entering directory '/tmp/B.ce933447-a97a-4447-bbf0-fefd2ffafca1/BUILD/OpenImageIO-oiio-bcdad81/build' /usr/bin/cmake -E cmake_progress_report /tmp/B.ce933447-a97a-4447-bbf0-fefd2ffafca1/BUILD/OpenImageIO-oiio-bcdad81/build/CMakeFiles 16 [ 16%] Building CXX object libOpenImageIO/CMakeFiles/OpenImageIO.dir/__/libutil/paramlist.cpp.o cd /tmp/B.ce933447-a97a-4447-bbf0-fefd2ffafca1/BUILD/OpenImageIO-oiio-bcdad81/build/libOpenImageIO && /usr/bin/i486-pld-linux-g++ -DBOOST_TEST_DYN_LINK -DNOTHREADS=1 -DOpenImageIO_EXPORTS -DPTEX_EXPORTS -DUSE_FIELD3D=1 -DUSE_FREETYPE -DUSE_OCIO=1 -DUSE_OPENCV -DUSE_OPENEXR_VERSION2=1 -DUSE_OPENSSL=1 -DUSE_TBB=0 -O2 -fwrapv -pipe -Wformat -Werror=format-security -gdwarf-4 -fno-debug-types-section -fvar-tracking-assignments -g2 -Wp,-D_FORTIFY_SOURCE=2 -fstack-protector --param=ssp-buffer-size=4 -fomit-frame-pointer -march=i486 -fasynchronous-unwind-tables -gdwarf-4 -fno-debug-types-section -fvar-tracking-assignments -g2 -DNDEBUG -DQT_NO_DEBUG -fPIC -I/usr/include/OpenEXR -I/tmp/B.ce933447-a97a-4447-bbf0-fefd2ffafca1/BUILD/OpenImageIO-oiio-bcdad81/src/include -I/tmp/B.ce933447-a97a-4447-bbf0-fefd2ffafca1/BUILD/OpenImageIO-oiio-bcdad81/build/include -I/usr/include/freetype2 -Wall -Werror -o CMakeFiles/OpenImageIO.dir/__/libutil/paramlist.cpp.o -c /tmp/B.ce933447-a97a-4447-bbf0-fefd2ffafca1/BUILD/OpenImageIO-oiio-bcdad81/src/libutil/paramlist.cpp make[2]: Leaving directory '/tmp/B.ce933447-a97a-4447-bbf0-fefd2ffafca1/BUILD/OpenImageIO-oiio-bcdad81/build' make[2]: Entering directory '/tmp/B.ce933447-a97a-4447-bbf0-fefd2ffafca1/BUILD/OpenImageIO-oiio-bcdad81/build' /usr/bin/cmake -E cmake_progress_report /tmp/B.ce933447-a97a-4447-bbf0-fefd2ffafca1/BUILD/OpenImageIO-oiio-bcdad81/build/CMakeFiles [ 10%] Building CXX object libOpenImageIO/CMakeFiles/OpenImageIO.dir/imagebufalgo_yee.cpp.o cd /tmp/B.ce933447-a97a-4447-bbf0-fefd2ffafca1/BUILD/OpenImageIO-oiio-bcdad81/build/libOpenImageIO && /usr/bin/i486-pld-linux-g++ -DBOOST_TEST_DYN_LINK -DNOTHREADS=1 -DOpenImageIO_EXPORTS -DPTEX_EXPORTS -DUSE_FIELD3D=1 -DUSE_FREETYPE -DUSE_OCIO=1 -DUSE_OPENCV -DUSE_OPENEXR_VERSION2=1 -DUSE_OPENSSL=1 -DUSE_TBB=0 -O2 -fwrapv -pipe -Wformat -Werror=format-security -gdwarf-4 -fno-debug-types-section -fvar-tracking-assignments -g2 -Wp,-D_FORTIFY_SOURCE=2 -fstack-protector --param=ssp-buffer-size=4 -fomit-frame-pointer -march=i486 -fasynchronous-unwind-tables -gdwarf-4 -fno-debug-types-section -fvar-tracking-assignments -g2 -DNDEBUG -DQT_NO_DEBUG -fPIC -I/usr/include/OpenEXR -I/tmp/B.ce933447-a97a-4447-bbf0-fefd2ffafca1/BUILD/OpenImageIO-oiio-bcdad81/src/include -I/tmp/B.ce933447-a97a-4447-bbf0-fefd2ffafca1/BUILD/OpenImageIO-oiio-bcdad81/build/include -I/usr/include/freetype2 -Wall -Werror -o CMakeFiles/OpenImageIO.dir/imagebufalgo_yee.cpp.o -c /tmp/B.ce933447-a97a-4447-bbf0-fefd2ffafca1/BUILD/OpenImageIO-oiio-bcdad81/src/libOpenImageIO/imagebufalgo_yee.cpp make[2]: Leaving directory '/tmp/B.ce933447-a97a-4447-bbf0-fefd2ffafca1/BUILD/OpenImageIO-oiio-bcdad81/build' make[2]: Entering directory '/tmp/B.ce933447-a97a-4447-bbf0-fefd2ffafca1/BUILD/OpenImageIO-oiio-bcdad81/build' /usr/bin/cmake -E cmake_progress_report /tmp/B.ce933447-a97a-4447-bbf0-fefd2ffafca1/BUILD/OpenImageIO-oiio-bcdad81/build/CMakeFiles [ 17%] Building CXX object libOpenImageIO/CMakeFiles/OpenImageIO.dir/__/libutil/pystring.cpp.o cd /tmp/B.ce933447-a97a-4447-bbf0-fefd2ffafca1/BUILD/OpenImageIO-oiio-bcdad81/build/libOpenImageIO && /usr/bin/i486-pld-linux-g++ -DBOOST_TEST_DYN_LINK -DNOTHREADS=1 -DOpenImageIO_EXPORTS -DPTEX_EXPORTS -DUSE_FIELD3D=1 -DUSE_FREETYPE -DUSE_OCIO=1 -DUSE_OPENCV -DUSE_OPENEXR_VERSION2=1 -DUSE_OPENSSL=1 -DUSE_TBB=0 -O2 -fwrapv -pipe -Wformat -Werror=format-security -gdwarf-4 -fno-debug-types-section -fvar-tracking-assignments -g2 -Wp,-D_FORTIFY_SOURCE=2 -fstack-protector --param=ssp-buffer-size=4 -fomit-frame-pointer -march=i486 -fasynchronous-unwind-tables -gdwarf-4 -fno-debug-types-section -fvar-tracking-assignments -g2 -DNDEBUG -DQT_NO_DEBUG -fPIC -I/usr/include/OpenEXR -I/tmp/B.ce933447-a97a-4447-bbf0-fefd2ffafca1/BUILD/OpenImageIO-oiio-bcdad81/src/include -I/tmp/B.ce933447-a97a-4447-bbf0-fefd2ffafca1/BUILD/OpenImageIO-oiio-bcdad81/build/include -I/usr/include/freetype2 -Wall -Werror -o CMakeFiles/OpenImageIO.dir/__/libutil/pystring.cpp.o -c /tmp/B.ce933447-a97a-4447-bbf0-fefd2ffafca1/BUILD/OpenImageIO-oiio-bcdad81/src/libutil/pystring.cpp make[2]: Leaving directory '/tmp/B.ce933447-a97a-4447-bbf0-fefd2ffafca1/BUILD/OpenImageIO-oiio-bcdad81/build' make[2]: Entering directory '/tmp/B.ce933447-a97a-4447-bbf0-fefd2ffafca1/BUILD/OpenImageIO-oiio-bcdad81/build' /usr/bin/cmake -E cmake_progress_report /tmp/B.ce933447-a97a-4447-bbf0-fefd2ffafca1/BUILD/OpenImageIO-oiio-bcdad81/build/CMakeFiles 18 [ 18%] Building CXX object libOpenImageIO/CMakeFiles/OpenImageIO.dir/__/libutil/SHA1.cpp.o cd /tmp/B.ce933447-a97a-4447-bbf0-fefd2ffafca1/BUILD/OpenImageIO-oiio-bcdad81/build/libOpenImageIO && /usr/bin/i486-pld-linux-g++ -DBOOST_TEST_DYN_LINK -DNOTHREADS=1 -DOpenImageIO_EXPORTS -DPTEX_EXPORTS -DUSE_FIELD3D=1 -DUSE_FREETYPE -DUSE_OCIO=1 -DUSE_OPENCV -DUSE_OPENEXR_VERSION2=1 -DUSE_OPENSSL=1 -DUSE_TBB=0 -O2 -fwrapv -pipe -Wformat -Werror=format-security -gdwarf-4 -fno-debug-types-section -fvar-tracking-assignments -g2 -Wp,-D_FORTIFY_SOURCE=2 -fstack-protector --param=ssp-buffer-size=4 -fomit-frame-pointer -march=i486 -fasynchronous-unwind-tables -gdwarf-4 -fno-debug-types-section -fvar-tracking-assignments -g2 -DNDEBUG -DQT_NO_DEBUG -fPIC -I/usr/include/OpenEXR -I/tmp/B.ce933447-a97a-4447-bbf0-fefd2ffafca1/BUILD/OpenImageIO-oiio-bcdad81/src/include -I/tmp/B.ce933447-a97a-4447-bbf0-fefd2ffafca1/BUILD/OpenImageIO-oiio-bcdad81/build/include -I/usr/include/freetype2 -Wall -Werror -o CMakeFiles/OpenImageIO.dir/__/libutil/SHA1.cpp.o -c /tmp/B.ce933447-a97a-4447-bbf0-fefd2ffafca1/BUILD/OpenImageIO-oiio-bcdad81/src/libutil/SHA1.cpp make[2]: Leaving directory '/tmp/B.ce933447-a97a-4447-bbf0-fefd2ffafca1/BUILD/OpenImageIO-oiio-bcdad81/build' make[2]: Entering directory '/tmp/B.ce933447-a97a-4447-bbf0-fefd2ffafca1/BUILD/OpenImageIO-oiio-bcdad81/build' /usr/bin/cmake -E cmake_progress_report /tmp/B.ce933447-a97a-4447-bbf0-fefd2ffafca1/BUILD/OpenImageIO-oiio-bcdad81/build/CMakeFiles [ 15%] Building CXX object libOpenImageIO/CMakeFiles/OpenImageIO.dir/__/libutil/hashes.cpp.o cd /tmp/B.ce933447-a97a-4447-bbf0-fefd2ffafca1/BUILD/OpenImageIO-oiio-bcdad81/build/libOpenImageIO && /usr/bin/i486-pld-linux-g++ -DBOOST_TEST_DYN_LINK -DNOTHREADS=1 -DOpenImageIO_EXPORTS -DPTEX_EXPORTS -DUSE_FIELD3D=1 -DUSE_FREETYPE -DUSE_OCIO=1 -DUSE_OPENCV -DUSE_OPENEXR_VERSION2=1 -DUSE_OPENSSL=1 -DUSE_TBB=0 -O2 -fwrapv -pipe -Wformat -Werror=format-security -gdwarf-4 -fno-debug-types-section -fvar-tracking-assignments -g2 -Wp,-D_FORTIFY_SOURCE=2 -fstack-protector --param=ssp-buffer-size=4 -fomit-frame-pointer -march=i486 -fasynchronous-unwind-tables -gdwarf-4 -fno-debug-types-section -fvar-tracking-assignments -g2 -DNDEBUG -DQT_NO_DEBUG -fPIC -I/usr/include/OpenEXR -I/tmp/B.ce933447-a97a-4447-bbf0-fefd2ffafca1/BUILD/OpenImageIO-oiio-bcdad81/src/include -I/tmp/B.ce933447-a97a-4447-bbf0-fefd2ffafca1/BUILD/OpenImageIO-oiio-bcdad81/build/include -I/usr/include/freetype2 -Wall -Werror -o CMakeFiles/OpenImageIO.dir/__/libutil/hashes.cpp.o -c /tmp/B.ce933447-a97a-4447-bbf0-fefd2ffafca1/BUILD/OpenImageIO-oiio-bcdad81/src/libutil/hashes.cpp make[2]: Leaving directory '/tmp/B.ce933447-a97a-4447-bbf0-fefd2ffafca1/BUILD/OpenImageIO-oiio-bcdad81/build' make[2]: Entering directory '/tmp/B.ce933447-a97a-4447-bbf0-fefd2ffafca1/BUILD/OpenImageIO-oiio-bcdad81/build' /usr/bin/cmake -E cmake_progress_report /tmp/B.ce933447-a97a-4447-bbf0-fefd2ffafca1/BUILD/OpenImageIO-oiio-bcdad81/build/CMakeFiles 20 [ 20%] Building CXX object libOpenImageIO/CMakeFiles/OpenImageIO.dir/__/libutil/sysutil.cpp.o cd /tmp/B.ce933447-a97a-4447-bbf0-fefd2ffafca1/BUILD/OpenImageIO-oiio-bcdad81/build/libOpenImageIO && /usr/bin/i486-pld-linux-g++ -DBOOST_TEST_DYN_LINK -DNOTHREADS=1 -DOpenImageIO_EXPORTS -DPTEX_EXPORTS -DUSE_FIELD3D=1 -DUSE_FREETYPE -DUSE_OCIO=1 -DUSE_OPENCV -DUSE_OPENEXR_VERSION2=1 -DUSE_OPENSSL=1 -DUSE_TBB=0 -O2 -fwrapv -pipe -Wformat -Werror=format-security -gdwarf-4 -fno-debug-types-section -fvar-tracking-assignments -g2 -Wp,-D_FORTIFY_SOURCE=2 -fstack-protector --param=ssp-buffer-size=4 -fomit-frame-pointer -march=i486 -fasynchronous-unwind-tables -gdwarf-4 -fno-debug-types-section -fvar-tracking-assignments -g2 -DNDEBUG -DQT_NO_DEBUG -fPIC -I/usr/include/OpenEXR -I/tmp/B.ce933447-a97a-4447-bbf0-fefd2ffafca1/BUILD/OpenImageIO-oiio-bcdad81/src/include -I/tmp/B.ce933447-a97a-4447-bbf0-fefd2ffafca1/BUILD/OpenImageIO-oiio-bcdad81/build/include -I/usr/include/freetype2 -Wall -Werror -o CMakeFiles/OpenImageIO.dir/__/libutil/sysutil.cpp.o -c /tmp/B.ce933447-a97a-4447-bbf0-fefd2ffafca1/BUILD/OpenImageIO-oiio-bcdad81/src/libutil/sysutil.cpp make[2]: Leaving directory '/tmp/B.ce933447-a97a-4447-bbf0-fefd2ffafca1/BUILD/OpenImageIO-oiio-bcdad81/build' make[2]: Entering directory '/tmp/B.ce933447-a97a-4447-bbf0-fefd2ffafca1/BUILD/OpenImageIO-oiio-bcdad81/build' /usr/bin/cmake -E cmake_progress_report /tmp/B.ce933447-a97a-4447-bbf0-fefd2ffafca1/BUILD/OpenImageIO-oiio-bcdad81/build/CMakeFiles [ 20%] Building CXX object libOpenImageIO/CMakeFiles/OpenImageIO.dir/__/libutil/typedesc.cpp.o cd /tmp/B.ce933447-a97a-4447-bbf0-fefd2ffafca1/BUILD/OpenImageIO-oiio-bcdad81/build/libOpenImageIO && /usr/bin/i486-pld-linux-g++ -DBOOST_TEST_DYN_LINK -DNOTHREADS=1 -DOpenImageIO_EXPORTS -DPTEX_EXPORTS -DUSE_FIELD3D=1 -DUSE_FREETYPE -DUSE_OCIO=1 -DUSE_OPENCV -DUSE_OPENEXR_VERSION2=1 -DUSE_OPENSSL=1 -DUSE_TBB=0 -O2 -fwrapv -pipe -Wformat -Werror=format-security -gdwarf-4 -fno-debug-types-section -fvar-tracking-assignments -g2 -Wp,-D_FORTIFY_SOURCE=2 -fstack-protector --param=ssp-buffer-size=4 -fomit-frame-pointer -march=i486 -fasynchronous-unwind-tables -gdwarf-4 -fno-debug-types-section -fvar-tracking-assignments -g2 -DNDEBUG -DQT_NO_DEBUG -fPIC -I/usr/include/OpenEXR -I/tmp/B.ce933447-a97a-4447-bbf0-fefd2ffafca1/BUILD/OpenImageIO-oiio-bcdad81/src/include -I/tmp/B.ce933447-a97a-4447-bbf0-fefd2ffafca1/BUILD/OpenImageIO-oiio-bcdad81/build/include -I/usr/include/freetype2 -Wall -Werror -o CMakeFiles/OpenImageIO.dir/__/libutil/typedesc.cpp.o -c /tmp/B.ce933447-a97a-4447-bbf0-fefd2ffafca1/BUILD/OpenImageIO-oiio-bcdad81/src/libutil/typedesc.cpp make[2]: Leaving directory '/tmp/B.ce933447-a97a-4447-bbf0-fefd2ffafca1/BUILD/OpenImageIO-oiio-bcdad81/build' make[2]: Entering directory '/tmp/B.ce933447-a97a-4447-bbf0-fefd2ffafca1/BUILD/OpenImageIO-oiio-bcdad81/build' /usr/bin/cmake -E cmake_progress_report /tmp/B.ce933447-a97a-4447-bbf0-fefd2ffafca1/BUILD/OpenImageIO-oiio-bcdad81/build/CMakeFiles 19 [ 19%] Building CXX object libOpenImageIO/CMakeFiles/OpenImageIO.dir/__/libutil/strutil.cpp.o cd /tmp/B.ce933447-a97a-4447-bbf0-fefd2ffafca1/BUILD/OpenImageIO-oiio-bcdad81/build/libOpenImageIO && /usr/bin/i486-pld-linux-g++ -DBOOST_TEST_DYN_LINK -DNOTHREADS=1 -DOpenImageIO_EXPORTS -DPTEX_EXPORTS -DUSE_FIELD3D=1 -DUSE_FREETYPE -DUSE_OCIO=1 -DUSE_OPENCV -DUSE_OPENEXR_VERSION2=1 -DUSE_OPENSSL=1 -DUSE_TBB=0 -O2 -fwrapv -pipe -Wformat -Werror=format-security -gdwarf-4 -fno-debug-types-section -fvar-tracking-assignments -g2 -Wp,-D_FORTIFY_SOURCE=2 -fstack-protector --param=ssp-buffer-size=4 -fomit-frame-pointer -march=i486 -fasynchronous-unwind-tables -gdwarf-4 -fno-debug-types-section -fvar-tracking-assignments -g2 -DNDEBUG -DQT_NO_DEBUG -fPIC -I/usr/include/OpenEXR -I/tmp/B.ce933447-a97a-4447-bbf0-fefd2ffafca1/BUILD/OpenImageIO-oiio-bcdad81/src/include -I/tmp/B.ce933447-a97a-4447-bbf0-fefd2ffafca1/BUILD/OpenImageIO-oiio-bcdad81/build/include -I/usr/include/freetype2 -Wall -Werror -o CMakeFiles/OpenImageIO.dir/__/libutil/strutil.cpp.o -c /tmp/B.ce933447-a97a-4447-bbf0-fefd2ffafca1/BUILD/OpenImageIO-oiio-bcdad81/src/libutil/strutil.cpp make[2]: Leaving directory '/tmp/B.ce933447-a97a-4447-bbf0-fefd2ffafca1/BUILD/OpenImageIO-oiio-bcdad81/build' make[2]: Entering directory '/tmp/B.ce933447-a97a-4447-bbf0-fefd2ffafca1/BUILD/OpenImageIO-oiio-bcdad81/build' /usr/bin/cmake -E cmake_progress_report /tmp/B.ce933447-a97a-4447-bbf0-fefd2ffafca1/BUILD/OpenImageIO-oiio-bcdad81/build/CMakeFiles 17 [ 17%] Building CXX object libOpenImageIO/CMakeFiles/OpenImageIO.dir/__/libutil/plugin.cpp.o cd /tmp/B.ce933447-a97a-4447-bbf0-fefd2ffafca1/BUILD/OpenImageIO-oiio-bcdad81/build/libOpenImageIO && /usr/bin/i486-pld-linux-g++ -DBOOST_TEST_DYN_LINK -DNOTHREADS=1 -DOpenImageIO_EXPORTS -DPTEX_EXPORTS -DUSE_FIELD3D=1 -DUSE_FREETYPE -DUSE_OCIO=1 -DUSE_OPENCV -DUSE_OPENEXR_VERSION2=1 -DUSE_OPENSSL=1 -DUSE_TBB=0 -O2 -fwrapv -pipe -Wformat -Werror=format-security -gdwarf-4 -fno-debug-types-section -fvar-tracking-assignments -g2 -Wp,-D_FORTIFY_SOURCE=2 -fstack-protector --param=ssp-buffer-size=4 -fomit-frame-pointer -march=i486 -fasynchronous-unwind-tables -gdwarf-4 -fno-debug-types-section -fvar-tracking-assignments -g2 -DNDEBUG -DQT_NO_DEBUG -fPIC -I/usr/include/OpenEXR -I/tmp/B.ce933447-a97a-4447-bbf0-fefd2ffafca1/BUILD/OpenImageIO-oiio-bcdad81/src/include -I/tmp/B.ce933447-a97a-4447-bbf0-fefd2ffafca1/BUILD/OpenImageIO-oiio-bcdad81/build/include -I/usr/include/freetype2 -Wall -Werror -o CMakeFiles/OpenImageIO.dir/__/libutil/plugin.cpp.o -c /tmp/B.ce933447-a97a-4447-bbf0-fefd2ffafca1/BUILD/OpenImageIO-oiio-bcdad81/src/libutil/plugin.cpp make[2]: Leaving directory '/tmp/B.ce933447-a97a-4447-bbf0-fefd2ffafca1/BUILD/OpenImageIO-oiio-bcdad81/build' make[2]: Entering directory '/tmp/B.ce933447-a97a-4447-bbf0-fefd2ffafca1/BUILD/OpenImageIO-oiio-bcdad81/build' /usr/bin/cmake -E cmake_progress_report /tmp/B.ce933447-a97a-4447-bbf0-fefd2ffafca1/BUILD/OpenImageIO-oiio-bcdad81/build/CMakeFiles 21 [ 21%] Building CXX object libOpenImageIO/CMakeFiles/OpenImageIO.dir/__/libutil/ustring.cpp.o cd /tmp/B.ce933447-a97a-4447-bbf0-fefd2ffafca1/BUILD/OpenImageIO-oiio-bcdad81/build/libOpenImageIO && /usr/bin/i486-pld-linux-g++ -DBOOST_TEST_DYN_LINK -DNOTHREADS=1 -DOpenImageIO_EXPORTS -DPTEX_EXPORTS -DUSE_FIELD3D=1 -DUSE_FREETYPE -DUSE_OCIO=1 -DUSE_OPENCV -DUSE_OPENEXR_VERSION2=1 -DUSE_OPENSSL=1 -DUSE_TBB=0 -O2 -fwrapv -pipe -Wformat -Werror=format-security -gdwarf-4 -fno-debug-types-section -fvar-tracking-assignments -g2 -Wp,-D_FORTIFY_SOURCE=2 -fstack-protector --param=ssp-buffer-size=4 -fomit-frame-pointer -march=i486 -fasynchronous-unwind-tables -gdwarf-4 -fno-debug-types-section -fvar-tracking-assignments -g2 -DNDEBUG -DQT_NO_DEBUG -fPIC -I/usr/include/OpenEXR -I/tmp/B.ce933447-a97a-4447-bbf0-fefd2ffafca1/BUILD/OpenImageIO-oiio-bcdad81/src/include -I/tmp/B.ce933447-a97a-4447-bbf0-fefd2ffafca1/BUILD/OpenImageIO-oiio-bcdad81/build/include -I/usr/include/freetype2 -Wall -Werror -o CMakeFiles/OpenImageIO.dir/__/libutil/ustring.cpp.o -c /tmp/B.ce933447-a97a-4447-bbf0-fefd2ffafca1/BUILD/OpenImageIO-oiio-bcdad81/src/libutil/ustring.cpp make[2]: Leaving directory '/tmp/B.ce933447-a97a-4447-bbf0-fefd2ffafca1/BUILD/OpenImageIO-oiio-bcdad81/build' make[2]: Entering directory '/tmp/B.ce933447-a97a-4447-bbf0-fefd2ffafca1/BUILD/OpenImageIO-oiio-bcdad81/build' /usr/bin/cmake -E cmake_progress_report /tmp/B.ce933447-a97a-4447-bbf0-fefd2ffafca1/BUILD/OpenImageIO-oiio-bcdad81/build/CMakeFiles 8 [ 8%] Building CXX object libOpenImageIO/CMakeFiles/OpenImageIO.dir/imagebufalgo_compare.cpp.o cd /tmp/B.ce933447-a97a-4447-bbf0-fefd2ffafca1/BUILD/OpenImageIO-oiio-bcdad81/build/libOpenImageIO && /usr/bin/i486-pld-linux-g++ -DBOOST_TEST_DYN_LINK -DNOTHREADS=1 -DOpenImageIO_EXPORTS -DPTEX_EXPORTS -DUSE_FIELD3D=1 -DUSE_FREETYPE -DUSE_OCIO=1 -DUSE_OPENCV -DUSE_OPENEXR_VERSION2=1 -DUSE_OPENSSL=1 -DUSE_TBB=0 -O2 -fwrapv -pipe -Wformat -Werror=format-security -gdwarf-4 -fno-debug-types-section -fvar-tracking-assignments -g2 -Wp,-D_FORTIFY_SOURCE=2 -fstack-protector --param=ssp-buffer-size=4 -fomit-frame-pointer -march=i486 -fasynchronous-unwind-tables -gdwarf-4 -fno-debug-types-section -fvar-tracking-assignments -g2 -DNDEBUG -DQT_NO_DEBUG -fPIC -I/usr/include/OpenEXR -I/tmp/B.ce933447-a97a-4447-bbf0-fefd2ffafca1/BUILD/OpenImageIO-oiio-bcdad81/src/include -I/tmp/B.ce933447-a97a-4447-bbf0-fefd2ffafca1/BUILD/OpenImageIO-oiio-bcdad81/build/include -I/usr/include/freetype2 -Wall -Werror -o CMakeFiles/OpenImageIO.dir/imagebufalgo_compare.cpp.o -c /tmp/B.ce933447-a97a-4447-bbf0-fefd2ffafca1/BUILD/OpenImageIO-oiio-bcdad81/src/libOpenImageIO/imagebufalgo_compare.cpp make[2]: Leaving directory '/tmp/B.ce933447-a97a-4447-bbf0-fefd2ffafca1/BUILD/OpenImageIO-oiio-bcdad81/build' make[2]: Entering directory '/tmp/B.ce933447-a97a-4447-bbf0-fefd2ffafca1/BUILD/OpenImageIO-oiio-bcdad81/build' /usr/bin/cmake -E cmake_progress_report /tmp/B.ce933447-a97a-4447-bbf0-fefd2ffafca1/BUILD/OpenImageIO-oiio-bcdad81/build/CMakeFiles 12 [ 12%] Building CXX object libOpenImageIO/CMakeFiles/OpenImageIO.dir/maketexture.cpp.o cd /tmp/B.ce933447-a97a-4447-bbf0-fefd2ffafca1/BUILD/OpenImageIO-oiio-bcdad81/build/libOpenImageIO && /usr/bin/i486-pld-linux-g++ -DBOOST_TEST_DYN_LINK -DNOTHREADS=1 -DOpenImageIO_EXPORTS -DPTEX_EXPORTS -DUSE_FIELD3D=1 -DUSE_FREETYPE -DUSE_OCIO=1 -DUSE_OPENCV -DUSE_OPENEXR_VERSION2=1 -DUSE_OPENSSL=1 -DUSE_TBB=0 -O2 -fwrapv -pipe -Wformat -Werror=format-security -gdwarf-4 -fno-debug-types-section -fvar-tracking-assignments -g2 -Wp,-D_FORTIFY_SOURCE=2 -fstack-protector --param=ssp-buffer-size=4 -fomit-frame-pointer -march=i486 -fasynchronous-unwind-tables -gdwarf-4 -fno-debug-types-section -fvar-tracking-assignments -g2 -DNDEBUG -DQT_NO_DEBUG -fPIC -I/usr/include/OpenEXR -I/tmp/B.ce933447-a97a-4447-bbf0-fefd2ffafca1/BUILD/OpenImageIO-oiio-bcdad81/src/include -I/tmp/B.ce933447-a97a-4447-bbf0-fefd2ffafca1/BUILD/OpenImageIO-oiio-bcdad81/build/include -I/usr/include/freetype2 -Wall -Werror -o CMakeFiles/OpenImageIO.dir/maketexture.cpp.o -c /tmp/B.ce933447-a97a-4447-bbf0-fefd2ffafca1/BUILD/OpenImageIO-oiio-bcdad81/src/libOpenImageIO/maketexture.cpp make[2]: Leaving directory '/tmp/B.ce933447-a97a-4447-bbf0-fefd2ffafca1/BUILD/OpenImageIO-oiio-bcdad81/build' make[2]: Entering directory '/tmp/B.ce933447-a97a-4447-bbf0-fefd2ffafca1/BUILD/OpenImageIO-oiio-bcdad81/build' /usr/bin/cmake -E cmake_progress_report /tmp/B.ce933447-a97a-4447-bbf0-fefd2ffafca1/BUILD/OpenImageIO-oiio-bcdad81/build/CMakeFiles 10 [ 10%] Building CXX object libOpenImageIO/CMakeFiles/OpenImageIO.dir/imagebufalgo_pixelmath.cpp.o cd /tmp/B.ce933447-a97a-4447-bbf0-fefd2ffafca1/BUILD/OpenImageIO-oiio-bcdad81/build/libOpenImageIO && /usr/bin/i486-pld-linux-g++ -DBOOST_TEST_DYN_LINK -DNOTHREADS=1 -DOpenImageIO_EXPORTS -DPTEX_EXPORTS -DUSE_FIELD3D=1 -DUSE_FREETYPE -DUSE_OCIO=1 -DUSE_OPENCV -DUSE_OPENEXR_VERSION2=1 -DUSE_OPENSSL=1 -DUSE_TBB=0 -O2 -fwrapv -pipe -Wformat -Werror=format-security -gdwarf-4 -fno-debug-types-section -fvar-tracking-assignments -g2 -Wp,-D_FORTIFY_SOURCE=2 -fstack-protector --param=ssp-buffer-size=4 -fomit-frame-pointer -march=i486 -fasynchronous-unwind-tables -gdwarf-4 -fno-debug-types-section -fvar-tracking-assignments -g2 -DNDEBUG -DQT_NO_DEBUG -fPIC -I/usr/include/OpenEXR -I/tmp/B.ce933447-a97a-4447-bbf0-fefd2ffafca1/BUILD/OpenImageIO-oiio-bcdad81/src/include -I/tmp/B.ce933447-a97a-4447-bbf0-fefd2ffafca1/BUILD/OpenImageIO-oiio-bcdad81/build/include -I/usr/include/freetype2 -Wall -Werror -o CMakeFiles/OpenImageIO.dir/imagebufalgo_pixelmath.cpp.o -c /tmp/B.ce933447-a97a-4447-bbf0-fefd2ffafca1/BUILD/OpenImageIO-oiio-bcdad81/src/libOpenImageIO/imagebufalgo_pixelmath.cpp make[2]: Leaving directory '/tmp/B.ce933447-a97a-4447-bbf0-fefd2ffafca1/BUILD/OpenImageIO-oiio-bcdad81/build' make[2]: Entering directory '/tmp/B.ce933447-a97a-4447-bbf0-fefd2ffafca1/BUILD/OpenImageIO-oiio-bcdad81/build' /usr/bin/cmake -E cmake_progress_report /tmp/B.ce933447-a97a-4447-bbf0-fefd2ffafca1/BUILD/OpenImageIO-oiio-bcdad81/build/CMakeFiles 9 [ 9%] Building CXX object libOpenImageIO/CMakeFiles/OpenImageIO.dir/imagebufalgo_copy.cpp.o cd /tmp/B.ce933447-a97a-4447-bbf0-fefd2ffafca1/BUILD/OpenImageIO-oiio-bcdad81/build/libOpenImageIO && /usr/bin/i486-pld-linux-g++ -DBOOST_TEST_DYN_LINK -DNOTHREADS=1 -DOpenImageIO_EXPORTS -DPTEX_EXPORTS -DUSE_FIELD3D=1 -DUSE_FREETYPE -DUSE_OCIO=1 -DUSE_OPENCV -DUSE_OPENEXR_VERSION2=1 -DUSE_OPENSSL=1 -DUSE_TBB=0 -O2 -fwrapv -pipe -Wformat -Werror=format-security -gdwarf-4 -fno-debug-types-section -fvar-tracking-assignments -g2 -Wp,-D_FORTIFY_SOURCE=2 -fstack-protector --param=ssp-buffer-size=4 -fomit-frame-pointer -march=i486 -fasynchronous-unwind-tables -gdwarf-4 -fno-debug-types-section -fvar-tracking-assignments -g2 -DNDEBUG -DQT_NO_DEBUG -fPIC -I/usr/include/OpenEXR -I/tmp/B.ce933447-a97a-4447-bbf0-fefd2ffafca1/BUILD/OpenImageIO-oiio-bcdad81/src/include -I/tmp/B.ce933447-a97a-4447-bbf0-fefd2ffafca1/BUILD/OpenImageIO-oiio-bcdad81/build/include -I/usr/include/freetype2 -Wall -Werror -o CMakeFiles/OpenImageIO.dir/imagebufalgo_copy.cpp.o -c /tmp/B.ce933447-a97a-4447-bbf0-fefd2ffafca1/BUILD/OpenImageIO-oiio-bcdad81/src/libOpenImageIO/imagebufalgo_copy.cpp make[2]: Leaving directory '/tmp/B.ce933447-a97a-4447-bbf0-fefd2ffafca1/BUILD/OpenImageIO-oiio-bcdad81/build' make[2]: Entering directory '/tmp/B.ce933447-a97a-4447-bbf0-fefd2ffafca1/BUILD/OpenImageIO-oiio-bcdad81/build' /usr/bin/cmake -E cmake_progress_report /tmp/B.ce933447-a97a-4447-bbf0-fefd2ffafca1/BUILD/OpenImageIO-oiio-bcdad81/build/CMakeFiles 24 [ 24%] Building CXX object libOpenImageIO/CMakeFiles/OpenImageIO.dir/__/libtexture/texoptions.cpp.o cd /tmp/B.ce933447-a97a-4447-bbf0-fefd2ffafca1/BUILD/OpenImageIO-oiio-bcdad81/build/libOpenImageIO && /usr/bin/i486-pld-linux-g++ -DBOOST_TEST_DYN_LINK -DNOTHREADS=1 -DOpenImageIO_EXPORTS -DPTEX_EXPORTS -DUSE_FIELD3D=1 -DUSE_FREETYPE -DUSE_OCIO=1 -DUSE_OPENCV -DUSE_OPENEXR_VERSION2=1 -DUSE_OPENSSL=1 -DUSE_TBB=0 -O2 -fwrapv -pipe -Wformat -Werror=format-security -gdwarf-4 -fno-debug-types-section -fvar-tracking-assignments -g2 -Wp,-D_FORTIFY_SOURCE=2 -fstack-protector --param=ssp-buffer-size=4 -fomit-frame-pointer -march=i486 -fasynchronous-unwind-tables -gdwarf-4 -fno-debug-types-section -fvar-tracking-assignments -g2 -DNDEBUG -DQT_NO_DEBUG -fPIC -I/usr/include/OpenEXR -I/tmp/B.ce933447-a97a-4447-bbf0-fefd2ffafca1/BUILD/OpenImageIO-oiio-bcdad81/src/include -I/tmp/B.ce933447-a97a-4447-bbf0-fefd2ffafca1/BUILD/OpenImageIO-oiio-bcdad81/build/include -I/usr/include/freetype2 -Wall -Werror -o CMakeFiles/OpenImageIO.dir/__/libtexture/texoptions.cpp.o -c /tmp/B.ce933447-a97a-4447-bbf0-fefd2ffafca1/BUILD/OpenImageIO-oiio-bcdad81/src/libtexture/texoptions.cpp make[2]: Leaving directory '/tmp/B.ce933447-a97a-4447-bbf0-fefd2ffafca1/BUILD/OpenImageIO-oiio-bcdad81/build' make[2]: Entering directory '/tmp/B.ce933447-a97a-4447-bbf0-fefd2ffafca1/BUILD/OpenImageIO-oiio-bcdad81/build' /usr/bin/cmake -E cmake_progress_report /tmp/B.ce933447-a97a-4447-bbf0-fefd2ffafca1/BUILD/OpenImageIO-oiio-bcdad81/build/CMakeFiles 23 [ 23%] Building CXX object libOpenImageIO/CMakeFiles/OpenImageIO.dir/__/libtexture/environment.cpp.o cd /tmp/B.ce933447-a97a-4447-bbf0-fefd2ffafca1/BUILD/OpenImageIO-oiio-bcdad81/build/libOpenImageIO && /usr/bin/i486-pld-linux-g++ -DBOOST_TEST_DYN_LINK -DNOTHREADS=1 -DOpenImageIO_EXPORTS -DPTEX_EXPORTS -DUSE_FIELD3D=1 -DUSE_FREETYPE -DUSE_OCIO=1 -DUSE_OPENCV -DUSE_OPENEXR_VERSION2=1 -DUSE_OPENSSL=1 -DUSE_TBB=0 -O2 -fwrapv -pipe -Wformat -Werror=format-security -gdwarf-4 -fno-debug-types-section -fvar-tracking-assignments -g2 -Wp,-D_FORTIFY_SOURCE=2 -fstack-protector --param=ssp-buffer-size=4 -fomit-frame-pointer -march=i486 -fasynchronous-unwind-tables -gdwarf-4 -fno-debug-types-section -fvar-tracking-assignments -g2 -DNDEBUG -DQT_NO_DEBUG -fPIC -I/usr/include/OpenEXR -I/tmp/B.ce933447-a97a-4447-bbf0-fefd2ffafca1/BUILD/OpenImageIO-oiio-bcdad81/src/include -I/tmp/B.ce933447-a97a-4447-bbf0-fefd2ffafca1/BUILD/OpenImageIO-oiio-bcdad81/build/include -I/usr/include/freetype2 -Wall -Werror -o CMakeFiles/OpenImageIO.dir/__/libtexture/environment.cpp.o -c /tmp/B.ce933447-a97a-4447-bbf0-fefd2ffafca1/BUILD/OpenImageIO-oiio-bcdad81/src/libtexture/environment.cpp make[2]: Leaving directory '/tmp/B.ce933447-a97a-4447-bbf0-fefd2ffafca1/BUILD/OpenImageIO-oiio-bcdad81/build' make[2]: Entering directory '/tmp/B.ce933447-a97a-4447-bbf0-fefd2ffafca1/BUILD/OpenImageIO-oiio-bcdad81/build' /usr/bin/cmake -E cmake_progress_report /tmp/B.ce933447-a97a-4447-bbf0-fefd2ffafca1/BUILD/OpenImageIO-oiio-bcdad81/build/CMakeFiles [ 22%] Building CXX object libOpenImageIO/CMakeFiles/OpenImageIO.dir/__/libtexture/texture3d.cpp.o cd /tmp/B.ce933447-a97a-4447-bbf0-fefd2ffafca1/BUILD/OpenImageIO-oiio-bcdad81/build/libOpenImageIO && /usr/bin/i486-pld-linux-g++ -DBOOST_TEST_DYN_LINK -DNOTHREADS=1 -DOpenImageIO_EXPORTS -DPTEX_EXPORTS -DUSE_FIELD3D=1 -DUSE_FREETYPE -DUSE_OCIO=1 -DUSE_OPENCV -DUSE_OPENEXR_VERSION2=1 -DUSE_OPENSSL=1 -DUSE_TBB=0 -O2 -fwrapv -pipe -Wformat -Werror=format-security -gdwarf-4 -fno-debug-types-section -fvar-tracking-assignments -g2 -Wp,-D_FORTIFY_SOURCE=2 -fstack-protector --param=ssp-buffer-size=4 -fomit-frame-pointer -march=i486 -fasynchronous-unwind-tables -gdwarf-4 -fno-debug-types-section -fvar-tracking-assignments -g2 -DNDEBUG -DQT_NO_DEBUG -fPIC -I/usr/include/OpenEXR -I/tmp/B.ce933447-a97a-4447-bbf0-fefd2ffafca1/BUILD/OpenImageIO-oiio-bcdad81/src/include -I/tmp/B.ce933447-a97a-4447-bbf0-fefd2ffafca1/BUILD/OpenImageIO-oiio-bcdad81/build/include -I/usr/include/freetype2 -Wall -Werror -o CMakeFiles/OpenImageIO.dir/__/libtexture/texture3d.cpp.o -c /tmp/B.ce933447-a97a-4447-bbf0-fefd2ffafca1/BUILD/OpenImageIO-oiio-bcdad81/src/libtexture/texture3d.cpp make[2]: Leaving directory '/tmp/B.ce933447-a97a-4447-bbf0-fefd2ffafca1/BUILD/OpenImageIO-oiio-bcdad81/build' make[2]: Entering directory '/tmp/B.ce933447-a97a-4447-bbf0-fefd2ffafca1/BUILD/OpenImageIO-oiio-bcdad81/build' /usr/bin/cmake -E cmake_progress_report /tmp/B.ce933447-a97a-4447-bbf0-fefd2ffafca1/BUILD/OpenImageIO-oiio-bcdad81/build/CMakeFiles 22 [ 22%] Building CXX object libOpenImageIO/CMakeFiles/OpenImageIO.dir/__/libtexture/texturesys.cpp.o cd /tmp/B.ce933447-a97a-4447-bbf0-fefd2ffafca1/BUILD/OpenImageIO-oiio-bcdad81/build/libOpenImageIO && /usr/bin/i486-pld-linux-g++ -DBOOST_TEST_DYN_LINK -DNOTHREADS=1 -DOpenImageIO_EXPORTS -DPTEX_EXPORTS -DUSE_FIELD3D=1 -DUSE_FREETYPE -DUSE_OCIO=1 -DUSE_OPENCV -DUSE_OPENEXR_VERSION2=1 -DUSE_OPENSSL=1 -DUSE_TBB=0 -O2 -fwrapv -pipe -Wformat -Werror=format-security -gdwarf-4 -fno-debug-types-section -fvar-tracking-assignments -g2 -Wp,-D_FORTIFY_SOURCE=2 -fstack-protector --param=ssp-buffer-size=4 -fomit-frame-pointer -march=i486 -fasynchronous-unwind-tables -gdwarf-4 -fno-debug-types-section -fvar-tracking-assignments -g2 -DNDEBUG -DQT_NO_DEBUG -fPIC -I/usr/include/OpenEXR -I/tmp/B.ce933447-a97a-4447-bbf0-fefd2ffafca1/BUILD/OpenImageIO-oiio-bcdad81/src/include -I/tmp/B.ce933447-a97a-4447-bbf0-fefd2ffafca1/BUILD/OpenImageIO-oiio-bcdad81/build/include -I/usr/include/freetype2 -Wall -Werror -o CMakeFiles/OpenImageIO.dir/__/libtexture/texturesys.cpp.o -c /tmp/B.ce933447-a97a-4447-bbf0-fefd2ffafca1/BUILD/OpenImageIO-oiio-bcdad81/src/libtexture/texturesys.cpp make[2]: Leaving directory '/tmp/B.ce933447-a97a-4447-bbf0-fefd2ffafca1/BUILD/OpenImageIO-oiio-bcdad81/build' make[2]: Entering directory '/tmp/B.ce933447-a97a-4447-bbf0-fefd2ffafca1/BUILD/OpenImageIO-oiio-bcdad81/build' /usr/bin/cmake -E cmake_progress_report /tmp/B.ce933447-a97a-4447-bbf0-fefd2ffafca1/BUILD/OpenImageIO-oiio-bcdad81/build/CMakeFiles 25 [ 25%] Building CXX object libOpenImageIO/CMakeFiles/OpenImageIO.dir/__/libtexture/imagecache.cpp.o cd /tmp/B.ce933447-a97a-4447-bbf0-fefd2ffafca1/BUILD/OpenImageIO-oiio-bcdad81/build/libOpenImageIO && /usr/bin/i486-pld-linux-g++ -DBOOST_TEST_DYN_LINK -DNOTHREADS=1 -DOpenImageIO_EXPORTS -DPTEX_EXPORTS -DUSE_FIELD3D=1 -DUSE_FREETYPE -DUSE_OCIO=1 -DUSE_OPENCV -DUSE_OPENEXR_VERSION2=1 -DUSE_OPENSSL=1 -DUSE_TBB=0 -O2 -fwrapv -pipe -Wformat -Werror=format-security -gdwarf-4 -fno-debug-types-section -fvar-tracking-assignments -g2 -Wp,-D_FORTIFY_SOURCE=2 -fstack-protector --param=ssp-buffer-size=4 -fomit-frame-pointer -march=i486 -fasynchronous-unwind-tables -gdwarf-4 -fno-debug-types-section -fvar-tracking-assignments -g2 -DNDEBUG -DQT_NO_DEBUG -fPIC -I/usr/include/OpenEXR -I/tmp/B.ce933447-a97a-4447-bbf0-fefd2ffafca1/BUILD/OpenImageIO-oiio-bcdad81/src/include -I/tmp/B.ce933447-a97a-4447-bbf0-fefd2ffafca1/BUILD/OpenImageIO-oiio-bcdad81/build/include -I/usr/include/freetype2 -Wall -Werror -o CMakeFiles/OpenImageIO.dir/__/libtexture/imagecache.cpp.o -c /tmp/B.ce933447-a97a-4447-bbf0-fefd2ffafca1/BUILD/OpenImageIO-oiio-bcdad81/src/libtexture/imagecache.cpp make[2]: Leaving directory '/tmp/B.ce933447-a97a-4447-bbf0-fefd2ffafca1/BUILD/OpenImageIO-oiio-bcdad81/build' make[2]: Entering directory '/tmp/B.ce933447-a97a-4447-bbf0-fefd2ffafca1/BUILD/OpenImageIO-oiio-bcdad81/build' /usr/bin/cmake -E cmake_progress_report /tmp/B.ce933447-a97a-4447-bbf0-fefd2ffafca1/BUILD/OpenImageIO-oiio-bcdad81/build/CMakeFiles [ 7%] Building CXX object libOpenImageIO/CMakeFiles/OpenImageIO.dir/imagebufalgo.cpp.o cd /tmp/B.ce933447-a97a-4447-bbf0-fefd2ffafca1/BUILD/OpenImageIO-oiio-bcdad81/build/libOpenImageIO && /usr/bin/i486-pld-linux-g++ -DBOOST_TEST_DYN_LINK -DNOTHREADS=1 -DOpenImageIO_EXPORTS -DPTEX_EXPORTS -DUSE_FIELD3D=1 -DUSE_FREETYPE -DUSE_OCIO=1 -DUSE_OPENCV -DUSE_OPENEXR_VERSION2=1 -DUSE_OPENSSL=1 -DUSE_TBB=0 -O2 -fwrapv -pipe -Wformat -Werror=format-security -gdwarf-4 -fno-debug-types-section -fvar-tracking-assignments -g2 -Wp,-D_FORTIFY_SOURCE=2 -fstack-protector --param=ssp-buffer-size=4 -fomit-frame-pointer -march=i486 -fasynchronous-unwind-tables -gdwarf-4 -fno-debug-types-section -fvar-tracking-assignments -g2 -DNDEBUG -DQT_NO_DEBUG -fPIC -I/usr/include/OpenEXR -I/tmp/B.ce933447-a97a-4447-bbf0-fefd2ffafca1/BUILD/OpenImageIO-oiio-bcdad81/src/include -I/tmp/B.ce933447-a97a-4447-bbf0-fefd2ffafca1/BUILD/OpenImageIO-oiio-bcdad81/build/include -I/usr/include/freetype2 -Wall -Werror -o CMakeFiles/OpenImageIO.dir/imagebufalgo.cpp.o -c /tmp/B.ce933447-a97a-4447-bbf0-fefd2ffafca1/BUILD/OpenImageIO-oiio-bcdad81/src/libOpenImageIO/imagebufalgo.cpp /tmp/B.ce933447-a97a-4447-bbf0-fefd2ffafca1/BUILD/OpenImageIO-oiio-bcdad81/src/libOpenImageIO/imagebufalgo.cpp: In function 'bool OpenImageIO::v1_2::ImageBufAlgo::render_text(OpenImageIO::v1_2::ImageBuf&, int, int, const string&, int, const string&, const float*)': /tmp/B.ce933447-a97a-4447-bbf0-fefd2ffafca1/BUILD/OpenImageIO-oiio-bcdad81/src/libOpenImageIO/imagebufalgo.cpp:1066:28: error: comparison between signed and unsigned integer expressions [-Werror=sign-compare] for (int j = 0; j < slot->bitmap.rows; ++j) { ^ /tmp/B.ce933447-a97a-4447-bbf0-fefd2ffafca1/BUILD/OpenImageIO-oiio-bcdad81/src/libOpenImageIO/imagebufalgo.cpp:1068:32: error: comparison between signed and unsigned integer expressions [-Werror=sign-compare] for (int i = 0; i < slot->bitmap.width; ++i) { ^ cc1plus: all warnings being treated as errors libOpenImageIO/CMakeFiles/OpenImageIO.dir/build.make:287: recipe for target 'libOpenImageIO/CMakeFiles/OpenImageIO.dir/imagebufalgo.cpp.o' failed make[2]: *** [libOpenImageIO/CMakeFiles/OpenImageIO.dir/imagebufalgo.cpp.o] Error 1 make[2]: Leaving directory '/tmp/B.ce933447-a97a-4447-bbf0-fefd2ffafca1/BUILD/OpenImageIO-oiio-bcdad81/build' CMakeFiles/Makefile2:974: recipe for target 'libOpenImageIO/CMakeFiles/OpenImageIO.dir/all' failed make[1]: *** [libOpenImageIO/CMakeFiles/OpenImageIO.dir/all] Error 2 Makefile:150: recipe for target 'all' failed make: *** [all] Error 2 error: Bad exit status from /tmp/B.ce933447-a97a-4447-bbf0-fefd2ffafca1/BUILD/tmp/rpm-tmp.10184 (%build) RPM build errors: Bad exit status from /tmp/B.ce933447-a97a-4447-bbf0-fefd2ffafca1/BUILD/tmp/rpm-tmp.10184 (%build) ended at: Tue Feb 17 23:42:54 2015, done in 0:04:13.058701 error: No files produced. + chmod -R u+rwX /tmp/B.ce933447-a97a-4447-bbf0-fefd2ffafca1/BUILD + rm -rf /tmp/B.ce933447-a97a-4447-bbf0-fefd2ffafca1/tmp /tmp/B.ce933447-a97a-4447-bbf0-fefd2ffafca1/BUILD + rm -rf /tmp/B.ce933447-a97a-4447-bbf0-fefd2ffafca1 Begin-PLD-Builder-Info Build-Time: user:367.92s sys:90.70s real:325.53s (faults io:43733 non-io:3487775) End-PLD-Builder-Info
[Back to list of logs] [View rpm -qa of builder]