FailedOk

th/SRPMS[OK]
th/x32[OK]
th/i686[OK]
th/x86_64[OK]

ac/SRPMS[OK]
ac/i386[OK]
ac/i586[OK]
ac/i686[OK]
ac/alpha[OK]
ac/amd64[OK]
ac/athlon[OK]
ac/ppc[OK]
ac/sparc[OK]
ac/sparc64[OK]

Advanced Search
main()
Powered by PLD Linux
(c) 2002-2024 PLD Team
$Revision: 1.37 $
Powered by coffee.
Your IP: 3.238.235.248

grive c4ddf985-3365-449d-9389-62f8da551f64

Status:Failed
Source URL:https://buildlogs.pld-linux.org/pld/th/i486/FAIL/grive,c4ddf985-3365-449d-9389-62f8da551f64.bz2
text/plain URL:View!
full text:View!
rpm -qa of builder:View!
Date:2015/02/16 02:26:43
Runtime:0:00:20.869125

Toc:

  • error 1
  • /tmp/B.c9cbc6ee-2c18-40ce-9011-e6869c1e1265/BUILD/grive-27817e835fe115ebbda5410ec904aa49a2ad01f1/libgrive/src/protocol/Json.cc:32:31: fatal error: json/json_tokener.h: No such file or directory
  • error 2
  • compilation terminated.
  • error 3
  • libgrive/CMakeFiles/grive.dir/build.make:448: recipe for target 'libgrive/CMakeFiles/grive.dir/src/protocol/Json.cc.o' failed
  • error 4
  • make[2]: *** [libgrive/CMakeFiles/grive.dir/src/protocol/Json.cc.o] Error 1
  • error 5
  • CMakeFiles/Makefile2:117: recipe for target 'libgrive/CMakeFiles/grive.dir/all' failed
  • error 6
  • make[1]: *** [libgrive/CMakeFiles/grive.dir/all] Error 2
  • error 7
  • Makefile:120: recipe for target 'all' failed
  • error 8
  • error: Bad exit status from /tmp/B.c9cbc6ee-2c18-40ce-9011-e6869c1e1265/BUILD/tmp/rpm-tmp.19644 (%build)
  • error 9
  • RPM build errors:
  • error 10
  • error: No files produced.

Content:

-- Found the following Boost libraries:
--   program_options
-- Looking for Q_WS_X11
-- Looking for Q_WS_X11 - found
-- Looking for Q_WS_WIN
-- Looking for Q_WS_WIN - not found
-- Looking for Q_WS_QWS
-- Looking for Q_WS_QWS - not found
-- Looking for Q_WS_MAC
-- Looking for Q_WS_MAC - not found
-- Found Qt4: /usr/bin/qmake-qt4 (found version "4.8.6") 
-- Boost version: 1.57.0
-- Configuring done
-- Generating done
CMake Warning:
  Manually-specified variables were not used by the project:

    CMAKE_C_FLAGS_PLD
    CMAKE_Fortran_FLAGS_PLD
    CMAKE_INSTALL_BINDIR
    CMAKE_INSTALL_DATADIR
    CMAKE_INSTALL_DATAROOTDIR
    CMAKE_INSTALL_DOCDIR
    CMAKE_INSTALL_INCLUDEDIR
    CMAKE_INSTALL_INFODIR
    CMAKE_INSTALL_LIBDIR
    CMAKE_INSTALL_LIBEXECDIR
    CMAKE_INSTALL_LOCALEDIR
    CMAKE_INSTALL_LOCALSTATEDIRPATH
    CMAKE_INSTALL_MANDIR
    CMAKE_INSTALL_OLDINCLUDEDIR
    CMAKE_INSTALL_SBINDIR
    CMAKE_INSTALL_SHAREDSTATEDIRPATH
    CMAKE_INSTALL_SYSCONFDIR
    CMAKE_MODULE_LINKER_FLAGS_PLD
    CMAKE_SHARED_LINKER_FLAGS_PLD
    SYSCONF_INSTALL_DIR


-- Build files have been written to: /tmp/B.c9cbc6ee-2c18-40ce-9011-e6869c1e1265/BUILD/grive-27817e835fe115ebbda5410ec904aa49a2ad01f1/build
+ /usr/bin/make -Otarget -j9
/usr/bin/cmake -H/tmp/B.c9cbc6ee-2c18-40ce-9011-e6869c1e1265/BUILD/grive-27817e835fe115ebbda5410ec904aa49a2ad01f1 -B/tmp/B.c9cbc6ee-2c18-40ce-9011-e6869c1e1265/BUILD/grive-27817e835fe115ebbda5410ec904aa49a2ad01f1/build --check-build-system CMakeFiles/Makefile.cmake 0
/usr/bin/cmake -E cmake_progress_start /tmp/B.c9cbc6ee-2c18-40ce-9011-e6869c1e1265/BUILD/grive-27817e835fe115ebbda5410ec904aa49a2ad01f1/build/CMakeFiles /tmp/B.c9cbc6ee-2c18-40ce-9011-e6869c1e1265/BUILD/grive-27817e835fe115ebbda5410ec904aa49a2ad01f1/build/CMakeFiles/progress.marks
/usr/bin/make -f CMakeFiles/Makefile2 all
/usr/bin/make -f libgrive/CMakeFiles/grive.dir/build.make libgrive/CMakeFiles/grive.dir/depend
make[2]: Entering directory '/tmp/B.c9cbc6ee-2c18-40ce-9011-e6869c1e1265/BUILD/grive-27817e835fe115ebbda5410ec904aa49a2ad01f1/build'
cd /tmp/B.c9cbc6ee-2c18-40ce-9011-e6869c1e1265/BUILD/grive-27817e835fe115ebbda5410ec904aa49a2ad01f1/build && /usr/bin/cmake -E cmake_depends "Unix Makefiles" /tmp/B.c9cbc6ee-2c18-40ce-9011-e6869c1e1265/BUILD/grive-27817e835fe115ebbda5410ec904aa49a2ad01f1 /tmp/B.c9cbc6ee-2c18-40ce-9011-e6869c1e1265/BUILD/grive-27817e835fe115ebbda5410ec904aa49a2ad01f1/libgrive /tmp/B.c9cbc6ee-2c18-40ce-9011-e6869c1e1265/BUILD/grive-27817e835fe115ebbda5410ec904aa49a2ad01f1/build /tmp/B.c9cbc6ee-2c18-40ce-9011-e6869c1e1265/BUILD/grive-27817e835fe115ebbda5410ec904aa49a2ad01f1/build/libgrive /tmp/B.c9cbc6ee-2c18-40ce-9011-e6869c1e1265/BUILD/grive-27817e835fe115ebbda5410ec904aa49a2ad01f1/build/libgrive/CMakeFiles/grive.dir/DependInfo.cmake --color=
Scanning dependencies of target grive
make[2]: Leaving directory '/tmp/B.c9cbc6ee-2c18-40ce-9011-e6869c1e1265/BUILD/grive-27817e835fe115ebbda5410ec904aa49a2ad01f1/build'
/usr/bin/make -f libgrive/CMakeFiles/grive.dir/build.make libgrive/CMakeFiles/grive.dir/build
make[2]: Entering directory '/tmp/B.c9cbc6ee-2c18-40ce-9011-e6869c1e1265/BUILD/grive-27817e835fe115ebbda5410ec904aa49a2ad01f1/build'
/usr/bin/cmake -E cmake_progress_report /tmp/B.c9cbc6ee-2c18-40ce-9011-e6869c1e1265/BUILD/grive-27817e835fe115ebbda5410ec904aa49a2ad01f1/build/CMakeFiles 18
[ 12%] Building CXX object libgrive/CMakeFiles/grive.dir/src/drive2/Feed.cc.o
cd /tmp/B.c9cbc6ee-2c18-40ce-9011-e6869c1e1265/BUILD/grive-27817e835fe115ebbda5410ec904aa49a2ad01f1/build/libgrive && /usr/bin/i486-pld-linux-g++   -DHAVE_BFD -DSRC_DIR=\"/tmp/B.c9cbc6ee-2c18-40ce-9011-e6869c1e1265/BUILD/grive-27817e835fe115ebbda5410ec904aa49a2ad01f1/libgrive/src\" -DTEST_DATA=\"/tmp/B.c9cbc6ee-2c18-40ce-9011-e6869c1e1265/BUILD/grive-27817e835fe115ebbda5410ec904aa49a2ad01f1/libgrive/test/data/\" -DVERSION=\"0.3.0-pre\" -D_FILE_OFFSET_BITS=64 -O2 -fwrapv -pipe -Wformat -Werror=format-security -gdwarf-4 -fno-debug-types-section -fvar-tracking-assignments -g2 -Wp,-D_FORTIFY_SOURCE=2 -fstack-protector --param=ssp-buffer-size=4 -fomit-frame-pointer -march=i486 -fasynchronous-unwind-tables -gdwarf-4 -fno-debug-types-section -fvar-tracking-assignments -g2  -DNDEBUG -DQT_NO_DEBUG -I/tmp/B.c9cbc6ee-2c18-40ce-9011-e6869c1e1265/BUILD/grive-27817e835fe115ebbda5410ec904aa49a2ad01f1/libgrive/src -I/tmp/B.c9cbc6ee-2c18-40ce-9011-e6869c1e1265/BUILD/grive-27817e835fe115ebbda5410ec904aa49a2ad01f1/libgrive/test    -o CMakeFiles/grive.dir/src/drive2/Feed.cc.o -c /tmp/B.c9cbc6ee-2c18-40ce-9011-e6869c1e1265/BUILD/grive-27817e835fe115ebbda5410ec904aa49a2ad01f1/libgrive/src/drive2/Feed.cc
make[2]: Leaving directory '/tmp/B.c9cbc6ee-2c18-40ce-9011-e6869c1e1265/BUILD/grive-27817e835fe115ebbda5410ec904aa49a2ad01f1/build'
make[2]: Entering directory '/tmp/B.c9cbc6ee-2c18-40ce-9011-e6869c1e1265/BUILD/grive-27817e835fe115ebbda5410ec904aa49a2ad01f1/build'
/usr/bin/cmake -E cmake_progress_report /tmp/B.c9cbc6ee-2c18-40ce-9011-e6869c1e1265/BUILD/grive-27817e835fe115ebbda5410ec904aa49a2ad01f1/build/CMakeFiles 19
[ 15%] Building CXX object libgrive/CMakeFiles/grive.dir/src/drive2/Resource.cc.o
cd /tmp/B.c9cbc6ee-2c18-40ce-9011-e6869c1e1265/BUILD/grive-27817e835fe115ebbda5410ec904aa49a2ad01f1/build/libgrive && /usr/bin/i486-pld-linux-g++   -DHAVE_BFD -DSRC_DIR=\"/tmp/B.c9cbc6ee-2c18-40ce-9011-e6869c1e1265/BUILD/grive-27817e835fe115ebbda5410ec904aa49a2ad01f1/libgrive/src\" -DTEST_DATA=\"/tmp/B.c9cbc6ee-2c18-40ce-9011-e6869c1e1265/BUILD/grive-27817e835fe115ebbda5410ec904aa49a2ad01f1/libgrive/test/data/\" -DVERSION=\"0.3.0-pre\" -D_FILE_OFFSET_BITS=64 -O2 -fwrapv -pipe -Wformat -Werror=format-security -gdwarf-4 -fno-debug-types-section -fvar-tracking-assignments -g2 -Wp,-D_FORTIFY_SOURCE=2 -fstack-protector --param=ssp-buffer-size=4 -fomit-frame-pointer -march=i486 -fasynchronous-unwind-tables -gdwarf-4 -fno-debug-types-section -fvar-tracking-assignments -g2  -DNDEBUG -DQT_NO_DEBUG -I/tmp/B.c9cbc6ee-2c18-40ce-9011-e6869c1e1265/BUILD/grive-27817e835fe115ebbda5410ec904aa49a2ad01f1/libgrive/src -I/tmp/B.c9cbc6ee-2c18-40ce-9011-e6869c1e1265/BUILD/grive-27817e835fe115ebbda5410ec904aa49a2ad01f1/libgrive/test    -o CMakeFiles/grive.dir/src/drive2/Resource.cc.o -c /tmp/B.c9cbc6ee-2c18-40ce-9011-e6869c1e1265/BUILD/grive-27817e835fe115ebbda5410ec904aa49a2ad01f1/libgrive/src/drive2/Resource.cc
make[2]: Leaving directory '/tmp/B.c9cbc6ee-2c18-40ce-9011-e6869c1e1265/BUILD/grive-27817e835fe115ebbda5410ec904aa49a2ad01f1/build'
make[2]: Entering directory '/tmp/B.c9cbc6ee-2c18-40ce-9011-e6869c1e1265/BUILD/grive-27817e835fe115ebbda5410ec904aa49a2ad01f1/build'
/usr/bin/cmake -E cmake_progress_report /tmp/B.c9cbc6ee-2c18-40ce-9011-e6869c1e1265/BUILD/grive-27817e835fe115ebbda5410ec904aa49a2ad01f1/build/CMakeFiles 10
[  1%] Building CXX object libgrive/CMakeFiles/grive.dir/src/drive/CommonUri.cc.o
cd /tmp/B.c9cbc6ee-2c18-40ce-9011-e6869c1e1265/BUILD/grive-27817e835fe115ebbda5410ec904aa49a2ad01f1/build/libgrive && /usr/bin/i486-pld-linux-g++   -DHAVE_BFD -DSRC_DIR=\"/tmp/B.c9cbc6ee-2c18-40ce-9011-e6869c1e1265/BUILD/grive-27817e835fe115ebbda5410ec904aa49a2ad01f1/libgrive/src\" -DTEST_DATA=\"/tmp/B.c9cbc6ee-2c18-40ce-9011-e6869c1e1265/BUILD/grive-27817e835fe115ebbda5410ec904aa49a2ad01f1/libgrive/test/data/\" -DVERSION=\"0.3.0-pre\" -D_FILE_OFFSET_BITS=64 -O2 -fwrapv -pipe -Wformat -Werror=format-security -gdwarf-4 -fno-debug-types-section -fvar-tracking-assignments -g2 -Wp,-D_FORTIFY_SOURCE=2 -fstack-protector --param=ssp-buffer-size=4 -fomit-frame-pointer -march=i486 -fasynchronous-unwind-tables -gdwarf-4 -fno-debug-types-section -fvar-tracking-assignments -g2  -DNDEBUG -DQT_NO_DEBUG -I/tmp/B.c9cbc6ee-2c18-40ce-9011-e6869c1e1265/BUILD/grive-27817e835fe115ebbda5410ec904aa49a2ad01f1/libgrive/src -I/tmp/B.c9cbc6ee-2c18-40ce-9011-e6869c1e1265/BUILD/grive-27817e835fe115ebbda5410ec904aa49a2ad01f1/libgrive/test    -o CMakeFiles/grive.dir/src/drive/CommonUri.cc.o -c /tmp/B.c9cbc6ee-2c18-40ce-9011-e6869c1e1265/BUILD/grive-27817e835fe115ebbda5410ec904aa49a2ad01f1/libgrive/src/drive/CommonUri.cc
make[2]: Leaving directory '/tmp/B.c9cbc6ee-2c18-40ce-9011-e6869c1e1265/BUILD/grive-27817e835fe115ebbda5410ec904aa49a2ad01f1/build'
make[2]: Entering directory '/tmp/B.c9cbc6ee-2c18-40ce-9011-e6869c1e1265/BUILD/grive-27817e835fe115ebbda5410ec904aa49a2ad01f1/build'
/usr/bin/cmake -E cmake_progress_report /tmp/B.c9cbc6ee-2c18-40ce-9011-e6869c1e1265/BUILD/grive-27817e835fe115ebbda5410ec904aa49a2ad01f1/build/CMakeFiles 12
[  7%] Building CXX object libgrive/CMakeFiles/grive.dir/src/drive/Entry.cc.o
cd /tmp/B.c9cbc6ee-2c18-40ce-9011-e6869c1e1265/BUILD/grive-27817e835fe115ebbda5410ec904aa49a2ad01f1/build/libgrive && /usr/bin/i486-pld-linux-g++   -DHAVE_BFD -DSRC_DIR=\"/tmp/B.c9cbc6ee-2c18-40ce-9011-e6869c1e1265/BUILD/grive-27817e835fe115ebbda5410ec904aa49a2ad01f1/libgrive/src\" -DTEST_DATA=\"/tmp/B.c9cbc6ee-2c18-40ce-9011-e6869c1e1265/BUILD/grive-27817e835fe115ebbda5410ec904aa49a2ad01f1/libgrive/test/data/\" -DVERSION=\"0.3.0-pre\" -D_FILE_OFFSET_BITS=64 -O2 -fwrapv -pipe -Wformat -Werror=format-security -gdwarf-4 -fno-debug-types-section -fvar-tracking-assignments -g2 -Wp,-D_FORTIFY_SOURCE=2 -fstack-protector --param=ssp-buffer-size=4 -fomit-frame-pointer -march=i486 -fasynchronous-unwind-tables -gdwarf-4 -fno-debug-types-section -fvar-tracking-assignments -g2  -DNDEBUG -DQT_NO_DEBUG -I/tmp/B.c9cbc6ee-2c18-40ce-9011-e6869c1e1265/BUILD/grive-27817e835fe115ebbda5410ec904aa49a2ad01f1/libgrive/src -I/tmp/B.c9cbc6ee-2c18-40ce-9011-e6869c1e1265/BUILD/grive-27817e835fe115ebbda5410ec904aa49a2ad01f1/libgrive/test    -o CMakeFiles/grive.dir/src/drive/Entry.cc.o -c /tmp/B.c9cbc6ee-2c18-40ce-9011-e6869c1e1265/BUILD/grive-27817e835fe115ebbda5410ec904aa49a2ad01f1/libgrive/src/drive/Entry.cc
make[2]: Leaving directory '/tmp/B.c9cbc6ee-2c18-40ce-9011-e6869c1e1265/BUILD/grive-27817e835fe115ebbda5410ec904aa49a2ad01f1/build'
make[2]: Entering directory '/tmp/B.c9cbc6ee-2c18-40ce-9011-e6869c1e1265/BUILD/grive-27817e835fe115ebbda5410ec904aa49a2ad01f1/build'
/usr/bin/cmake -E cmake_progress_report /tmp/B.c9cbc6ee-2c18-40ce-9011-e6869c1e1265/BUILD/grive-27817e835fe115ebbda5410ec904aa49a2ad01f1/build/CMakeFiles 22
[ 19%] Building CXX object libgrive/CMakeFiles/grive.dir/src/http/Header.cc.o
cd /tmp/B.c9cbc6ee-2c18-40ce-9011-e6869c1e1265/BUILD/grive-27817e835fe115ebbda5410ec904aa49a2ad01f1/build/libgrive && /usr/bin/i486-pld-linux-g++   -DHAVE_BFD -DSRC_DIR=\"/tmp/B.c9cbc6ee-2c18-40ce-9011-e6869c1e1265/BUILD/grive-27817e835fe115ebbda5410ec904aa49a2ad01f1/libgrive/src\" -DTEST_DATA=\"/tmp/B.c9cbc6ee-2c18-40ce-9011-e6869c1e1265/BUILD/grive-27817e835fe115ebbda5410ec904aa49a2ad01f1/libgrive/test/data/\" -DVERSION=\"0.3.0-pre\" -D_FILE_OFFSET_BITS=64 -O2 -fwrapv -pipe -Wformat -Werror=format-security -gdwarf-4 -fno-debug-types-section -fvar-tracking-assignments -g2 -Wp,-D_FORTIFY_SOURCE=2 -fstack-protector --param=ssp-buffer-size=4 -fomit-frame-pointer -march=i486 -fasynchronous-unwind-tables -gdwarf-4 -fno-debug-types-section -fvar-tracking-assignments -g2  -DNDEBUG -DQT_NO_DEBUG -I/tmp/B.c9cbc6ee-2c18-40ce-9011-e6869c1e1265/BUILD/grive-27817e835fe115ebbda5410ec904aa49a2ad01f1/libgrive/src -I/tmp/B.c9cbc6ee-2c18-40ce-9011-e6869c1e1265/BUILD/grive-27817e835fe115ebbda5410ec904aa49a2ad01f1/libgrive/test    -o CMakeFiles/grive.dir/src/http/Header.cc.o -c /tmp/B.c9cbc6ee-2c18-40ce-9011-e6869c1e1265/BUILD/grive-27817e835fe115ebbda5410ec904aa49a2ad01f1/libgrive/src/http/Header.cc
make[2]: Leaving directory '/tmp/B.c9cbc6ee-2c18-40ce-9011-e6869c1e1265/BUILD/grive-27817e835fe115ebbda5410ec904aa49a2ad01f1/build'
make[2]: Entering directory '/tmp/B.c9cbc6ee-2c18-40ce-9011-e6869c1e1265/BUILD/grive-27817e835fe115ebbda5410ec904aa49a2ad01f1/build'
/usr/bin/cmake -E cmake_progress_report /tmp/B.c9cbc6ee-2c18-40ce-9011-e6869c1e1265/BUILD/grive-27817e835fe115ebbda5410ec904aa49a2ad01f1/build/CMakeFiles 21
[ 18%] Building CXX object libgrive/CMakeFiles/grive.dir/src/http/Download.cc.o
cd /tmp/B.c9cbc6ee-2c18-40ce-9011-e6869c1e1265/BUILD/grive-27817e835fe115ebbda5410ec904aa49a2ad01f1/build/libgrive && /usr/bin/i486-pld-linux-g++   -DHAVE_BFD -DSRC_DIR=\"/tmp/B.c9cbc6ee-2c18-40ce-9011-e6869c1e1265/BUILD/grive-27817e835fe115ebbda5410ec904aa49a2ad01f1/libgrive/src\" -DTEST_DATA=\"/tmp/B.c9cbc6ee-2c18-40ce-9011-e6869c1e1265/BUILD/grive-27817e835fe115ebbda5410ec904aa49a2ad01f1/libgrive/test/data/\" -DVERSION=\"0.3.0-pre\" -D_FILE_OFFSET_BITS=64 -O2 -fwrapv -pipe -Wformat -Werror=format-security -gdwarf-4 -fno-debug-types-section -fvar-tracking-assignments -g2 -Wp,-D_FORTIFY_SOURCE=2 -fstack-protector --param=ssp-buffer-size=4 -fomit-frame-pointer -march=i486 -fasynchronous-unwind-tables -gdwarf-4 -fno-debug-types-section -fvar-tracking-assignments -g2  -DNDEBUG -DQT_NO_DEBUG -I/tmp/B.c9cbc6ee-2c18-40ce-9011-e6869c1e1265/BUILD/grive-27817e835fe115ebbda5410ec904aa49a2ad01f1/libgrive/src -I/tmp/B.c9cbc6ee-2c18-40ce-9011-e6869c1e1265/BUILD/grive-27817e835fe115ebbda5410ec904aa49a2ad01f1/libgrive/test    -o CMakeFiles/grive.dir/src/http/Download.cc.o -c /tmp/B.c9cbc6ee-2c18-40ce-9011-e6869c1e1265/BUILD/grive-27817e835fe115ebbda5410ec904aa49a2ad01f1/libgrive/src/http/Download.cc
make[2]: Leaving directory '/tmp/B.c9cbc6ee-2c18-40ce-9011-e6869c1e1265/BUILD/grive-27817e835fe115ebbda5410ec904aa49a2ad01f1/build'
make[2]: Entering directory '/tmp/B.c9cbc6ee-2c18-40ce-9011-e6869c1e1265/BUILD/grive-27817e835fe115ebbda5410ec904aa49a2ad01f1/build'
/usr/bin/cmake -E cmake_progress_report /tmp/B.c9cbc6ee-2c18-40ce-9011-e6869c1e1265/BUILD/grive-27817e835fe115ebbda5410ec904aa49a2ad01f1/build/CMakeFiles 24
[ 22%] Building CXX object libgrive/CMakeFiles/grive.dir/src/http/StringResponse.cc.o
cd /tmp/B.c9cbc6ee-2c18-40ce-9011-e6869c1e1265/BUILD/grive-27817e835fe115ebbda5410ec904aa49a2ad01f1/build/libgrive && /usr/bin/i486-pld-linux-g++   -DHAVE_BFD -DSRC_DIR=\"/tmp/B.c9cbc6ee-2c18-40ce-9011-e6869c1e1265/BUILD/grive-27817e835fe115ebbda5410ec904aa49a2ad01f1/libgrive/src\" -DTEST_DATA=\"/tmp/B.c9cbc6ee-2c18-40ce-9011-e6869c1e1265/BUILD/grive-27817e835fe115ebbda5410ec904aa49a2ad01f1/libgrive/test/data/\" -DVERSION=\"0.3.0-pre\" -D_FILE_OFFSET_BITS=64 -O2 -fwrapv -pipe -Wformat -Werror=format-security -gdwarf-4 -fno-debug-types-section -fvar-tracking-assignments -g2 -Wp,-D_FORTIFY_SOURCE=2 -fstack-protector --param=ssp-buffer-size=4 -fomit-frame-pointer -march=i486 -fasynchronous-unwind-tables -gdwarf-4 -fno-debug-types-section -fvar-tracking-assignments -g2  -DNDEBUG -DQT_NO_DEBUG -I/tmp/B.c9cbc6ee-2c18-40ce-9011-e6869c1e1265/BUILD/grive-27817e835fe115ebbda5410ec904aa49a2ad01f1/libgrive/src -I/tmp/B.c9cbc6ee-2c18-40ce-9011-e6869c1e1265/BUILD/grive-27817e835fe115ebbda5410ec904aa49a2ad01f1/libgrive/test    -o CMakeFiles/grive.dir/src/http/StringResponse.cc.o -c /tmp/B.c9cbc6ee-2c18-40ce-9011-e6869c1e1265/BUILD/grive-27817e835fe115ebbda5410ec904aa49a2ad01f1/libgrive/src/http/StringResponse.cc
make[2]: Leaving directory '/tmp/B.c9cbc6ee-2c18-40ce-9011-e6869c1e1265/BUILD/grive-27817e835fe115ebbda5410ec904aa49a2ad01f1/build'
make[2]: Entering directory '/tmp/B.c9cbc6ee-2c18-40ce-9011-e6869c1e1265/BUILD/grive-27817e835fe115ebbda5410ec904aa49a2ad01f1/build'
/usr/bin/cmake -E cmake_progress_report /tmp/B.c9cbc6ee-2c18-40ce-9011-e6869c1e1265/BUILD/grive-27817e835fe115ebbda5410ec904aa49a2ad01f1/build/CMakeFiles 17
[ 10%] Building CXX object libgrive/CMakeFiles/grive.dir/src/drive2/Drive.cc.o
cd /tmp/B.c9cbc6ee-2c18-40ce-9011-e6869c1e1265/BUILD/grive-27817e835fe115ebbda5410ec904aa49a2ad01f1/build/libgrive && /usr/bin/i486-pld-linux-g++   -DHAVE_BFD -DSRC_DIR=\"/tmp/B.c9cbc6ee-2c18-40ce-9011-e6869c1e1265/BUILD/grive-27817e835fe115ebbda5410ec904aa49a2ad01f1/libgrive/src\" -DTEST_DATA=\"/tmp/B.c9cbc6ee-2c18-40ce-9011-e6869c1e1265/BUILD/grive-27817e835fe115ebbda5410ec904aa49a2ad01f1/libgrive/test/data/\" -DVERSION=\"0.3.0-pre\" -D_FILE_OFFSET_BITS=64 -O2 -fwrapv -pipe -Wformat -Werror=format-security -gdwarf-4 -fno-debug-types-section -fvar-tracking-assignments -g2 -Wp,-D_FORTIFY_SOURCE=2 -fstack-protector --param=ssp-buffer-size=4 -fomit-frame-pointer -march=i486 -fasynchronous-unwind-tables -gdwarf-4 -fno-debug-types-section -fvar-tracking-assignments -g2  -DNDEBUG -DQT_NO_DEBUG -I/tmp/B.c9cbc6ee-2c18-40ce-9011-e6869c1e1265/BUILD/grive-27817e835fe115ebbda5410ec904aa49a2ad01f1/libgrive/src -I/tmp/B.c9cbc6ee-2c18-40ce-9011-e6869c1e1265/BUILD/grive-27817e835fe115ebbda5410ec904aa49a2ad01f1/libgrive/test    -o CMakeFiles/grive.dir/src/drive2/Drive.cc.o -c /tmp/B.c9cbc6ee-2c18-40ce-9011-e6869c1e1265/BUILD/grive-27817e835fe115ebbda5410ec904aa49a2ad01f1/libgrive/src/drive2/Drive.cc
make[2]: Leaving directory '/tmp/B.c9cbc6ee-2c18-40ce-9011-e6869c1e1265/BUILD/grive-27817e835fe115ebbda5410ec904aa49a2ad01f1/build'
make[2]: Entering directory '/tmp/B.c9cbc6ee-2c18-40ce-9011-e6869c1e1265/BUILD/grive-27817e835fe115ebbda5410ec904aa49a2ad01f1/build'
/usr/bin/cmake -E cmake_progress_report /tmp/B.c9cbc6ee-2c18-40ce-9011-e6869c1e1265/BUILD/grive-27817e835fe115ebbda5410ec904aa49a2ad01f1/build/CMakeFiles 13
[ 13%] Building CXX object libgrive/CMakeFiles/grive.dir/src/drive/Feed.cc.o
cd /tmp/B.c9cbc6ee-2c18-40ce-9011-e6869c1e1265/BUILD/grive-27817e835fe115ebbda5410ec904aa49a2ad01f1/build/libgrive && /usr/bin/i486-pld-linux-g++   -DHAVE_BFD -DSRC_DIR=\"/tmp/B.c9cbc6ee-2c18-40ce-9011-e6869c1e1265/BUILD/grive-27817e835fe115ebbda5410ec904aa49a2ad01f1/libgrive/src\" -DTEST_DATA=\"/tmp/B.c9cbc6ee-2c18-40ce-9011-e6869c1e1265/BUILD/grive-27817e835fe115ebbda5410ec904aa49a2ad01f1/libgrive/test/data/\" -DVERSION=\"0.3.0-pre\" -D_FILE_OFFSET_BITS=64 -O2 -fwrapv -pipe -Wformat -Werror=format-security -gdwarf-4 -fno-debug-types-section -fvar-tracking-assignments -g2 -Wp,-D_FORTIFY_SOURCE=2 -fstack-protector --param=ssp-buffer-size=4 -fomit-frame-pointer -march=i486 -fasynchronous-unwind-tables -gdwarf-4 -fno-debug-types-section -fvar-tracking-assignments -g2  -DNDEBUG -DQT_NO_DEBUG -I/tmp/B.c9cbc6ee-2c18-40ce-9011-e6869c1e1265/BUILD/grive-27817e835fe115ebbda5410ec904aa49a2ad01f1/libgrive/src -I/tmp/B.c9cbc6ee-2c18-40ce-9011-e6869c1e1265/BUILD/grive-27817e835fe115ebbda5410ec904aa49a2ad01f1/libgrive/test    -o CMakeFiles/grive.dir/src/drive/Feed.cc.o -c /tmp/B.c9cbc6ee-2c18-40ce-9011-e6869c1e1265/BUILD/grive-27817e835fe115ebbda5410ec904aa49a2ad01f1/libgrive/src/drive/Feed.cc
make[2]: Leaving directory '/tmp/B.c9cbc6ee-2c18-40ce-9011-e6869c1e1265/BUILD/grive-27817e835fe115ebbda5410ec904aa49a2ad01f1/build'
make[2]: Entering directory '/tmp/B.c9cbc6ee-2c18-40ce-9011-e6869c1e1265/BUILD/grive-27817e835fe115ebbda5410ec904aa49a2ad01f1/build'
/usr/bin/cmake -E cmake_progress_report /tmp/B.c9cbc6ee-2c18-40ce-9011-e6869c1e1265/BUILD/grive-27817e835fe115ebbda5410ec904aa49a2ad01f1/build/CMakeFiles 27
[ 27%] Building CXX object libgrive/CMakeFiles/grive.dir/src/protocol/Json.cc.o
cd /tmp/B.c9cbc6ee-2c18-40ce-9011-e6869c1e1265/BUILD/grive-27817e835fe115ebbda5410ec904aa49a2ad01f1/build/libgrive && /usr/bin/i486-pld-linux-g++   -DHAVE_BFD -DSRC_DIR=\"/tmp/B.c9cbc6ee-2c18-40ce-9011-e6869c1e1265/BUILD/grive-27817e835fe115ebbda5410ec904aa49a2ad01f1/libgrive/src\" -DTEST_DATA=\"/tmp/B.c9cbc6ee-2c18-40ce-9011-e6869c1e1265/BUILD/grive-27817e835fe115ebbda5410ec904aa49a2ad01f1/libgrive/test/data/\" -DVERSION=\"0.3.0-pre\" -D_FILE_OFFSET_BITS=64 -O2 -fwrapv -pipe -Wformat -Werror=format-security -gdwarf-4 -fno-debug-types-section -fvar-tracking-assignments -g2 -Wp,-D_FORTIFY_SOURCE=2 -fstack-protector --param=ssp-buffer-size=4 -fomit-frame-pointer -march=i486 -fasynchronous-unwind-tables -gdwarf-4 -fno-debug-types-section -fvar-tracking-assignments -g2  -DNDEBUG -DQT_NO_DEBUG -I/tmp/B.c9cbc6ee-2c18-40ce-9011-e6869c1e1265/BUILD/grive-27817e835fe115ebbda5410ec904aa49a2ad01f1/libgrive/src -I/tmp/B.c9cbc6ee-2c18-40ce-9011-e6869c1e1265/BUILD/grive-27817e835fe115ebbda5410ec904aa49a2ad01f1/libgrive/test    -o CMakeFiles/grive.dir/src/protocol/Json.cc.o -c /tmp/B.c9cbc6ee-2c18-40ce-9011-e6869c1e1265/BUILD/grive-27817e835fe115ebbda5410ec904aa49a2ad01f1/libgrive/src/protocol/Json.cc
/tmp/B.c9cbc6ee-2c18-40ce-9011-e6869c1e1265/BUILD/grive-27817e835fe115ebbda5410ec904aa49a2ad01f1/libgrive/src/protocol/Json.cc:32:31: fatal error: json/json_tokener.h: No such file or directory
 #include <json/json_tokener.h>
                               ^
compilation terminated.
libgrive/CMakeFiles/grive.dir/build.make:448: recipe for target 'libgrive/CMakeFiles/grive.dir/src/protocol/Json.cc.o' failed
make[2]: *** [libgrive/CMakeFiles/grive.dir/src/protocol/Json.cc.o] Error 1
make[2]: Leaving directory '/tmp/B.c9cbc6ee-2c18-40ce-9011-e6869c1e1265/BUILD/grive-27817e835fe115ebbda5410ec904aa49a2ad01f1/build'
make[2]: *** Waiting for unfinished jobs....
make[2]: Entering directory '/tmp/B.c9cbc6ee-2c18-40ce-9011-e6869c1e1265/BUILD/grive-27817e835fe115ebbda5410ec904aa49a2ad01f1/build'
/usr/bin/cmake -E cmake_progress_report /tmp/B.c9cbc6ee-2c18-40ce-9011-e6869c1e1265/BUILD/grive-27817e835fe115ebbda5410ec904aa49a2ad01f1/build/CMakeFiles 25
[ 24%] Building CXX object libgrive/CMakeFiles/grive.dir/src/http/XmlResponse.cc.o
cd /tmp/B.c9cbc6ee-2c18-40ce-9011-e6869c1e1265/BUILD/grive-27817e835fe115ebbda5410ec904aa49a2ad01f1/build/libgrive && /usr/bin/i486-pld-linux-g++   -DHAVE_BFD -DSRC_DIR=\"/tmp/B.c9cbc6ee-2c18-40ce-9011-e6869c1e1265/BUILD/grive-27817e835fe115ebbda5410ec904aa49a2ad01f1/libgrive/src\" -DTEST_DATA=\"/tmp/B.c9cbc6ee-2c18-40ce-9011-e6869c1e1265/BUILD/grive-27817e835fe115ebbda5410ec904aa49a2ad01f1/libgrive/test/data/\" -DVERSION=\"0.3.0-pre\" -D_FILE_OFFSET_BITS=64 -O2 -fwrapv -pipe -Wformat -Werror=format-security -gdwarf-4 -fno-debug-types-section -fvar-tracking-assignments -g2 -Wp,-D_FORTIFY_SOURCE=2 -fstack-protector --param=ssp-buffer-size=4 -fomit-frame-pointer -march=i486 -fasynchronous-unwind-tables -gdwarf-4 -fno-debug-types-section -fvar-tracking-assignments -g2  -DNDEBUG -DQT_NO_DEBUG -I/tmp/B.c9cbc6ee-2c18-40ce-9011-e6869c1e1265/BUILD/grive-27817e835fe115ebbda5410ec904aa49a2ad01f1/libgrive/src -I/tmp/B.c9cbc6ee-2c18-40ce-9011-e6869c1e1265/BUILD/grive-27817e835fe115ebbda5410ec904aa49a2ad01f1/libgrive/test    -o CMakeFiles/grive.dir/src/http/XmlResponse.cc.o -c /tmp/B.c9cbc6ee-2c18-40ce-9011-e6869c1e1265/BUILD/grive-27817e835fe115ebbda5410ec904aa49a2ad01f1/libgrive/src/http/XmlResponse.cc
make[2]: Leaving directory '/tmp/B.c9cbc6ee-2c18-40ce-9011-e6869c1e1265/BUILD/grive-27817e835fe115ebbda5410ec904aa49a2ad01f1/build'
make[2]: Entering directory '/tmp/B.c9cbc6ee-2c18-40ce-9011-e6869c1e1265/BUILD/grive-27817e835fe115ebbda5410ec904aa49a2ad01f1/build'
/usr/bin/cmake -E cmake_progress_report /tmp/B.c9cbc6ee-2c18-40ce-9011-e6869c1e1265/BUILD/grive-27817e835fe115ebbda5410ec904aa49a2ad01f1/build/CMakeFiles 15
[  4%] Building CXX object libgrive/CMakeFiles/grive.dir/src/drive/ResourceTree.cc.o
cd /tmp/B.c9cbc6ee-2c18-40ce-9011-e6869c1e1265/BUILD/grive-27817e835fe115ebbda5410ec904aa49a2ad01f1/build/libgrive && /usr/bin/i486-pld-linux-g++   -DHAVE_BFD -DSRC_DIR=\"/tmp/B.c9cbc6ee-2c18-40ce-9011-e6869c1e1265/BUILD/grive-27817e835fe115ebbda5410ec904aa49a2ad01f1/libgrive/src\" -DTEST_DATA=\"/tmp/B.c9cbc6ee-2c18-40ce-9011-e6869c1e1265/BUILD/grive-27817e835fe115ebbda5410ec904aa49a2ad01f1/libgrive/test/data/\" -DVERSION=\"0.3.0-pre\" -D_FILE_OFFSET_BITS=64 -O2 -fwrapv -pipe -Wformat -Werror=format-security -gdwarf-4 -fno-debug-types-section -fvar-tracking-assignments -g2 -Wp,-D_FORTIFY_SOURCE=2 -fstack-protector --param=ssp-buffer-size=4 -fomit-frame-pointer -march=i486 -fasynchronous-unwind-tables -gdwarf-4 -fno-debug-types-section -fvar-tracking-assignments -g2  -DNDEBUG -DQT_NO_DEBUG -I/tmp/B.c9cbc6ee-2c18-40ce-9011-e6869c1e1265/BUILD/grive-27817e835fe115ebbda5410ec904aa49a2ad01f1/libgrive/src -I/tmp/B.c9cbc6ee-2c18-40ce-9011-e6869c1e1265/BUILD/grive-27817e835fe115ebbda5410ec904aa49a2ad01f1/libgrive/test    -o CMakeFiles/grive.dir/src/drive/ResourceTree.cc.o -c /tmp/B.c9cbc6ee-2c18-40ce-9011-e6869c1e1265/BUILD/grive-27817e835fe115ebbda5410ec904aa49a2ad01f1/libgrive/src/drive/ResourceTree.cc
make[2]: Leaving directory '/tmp/B.c9cbc6ee-2c18-40ce-9011-e6869c1e1265/BUILD/grive-27817e835fe115ebbda5410ec904aa49a2ad01f1/build'
make[2]: Entering directory '/tmp/B.c9cbc6ee-2c18-40ce-9011-e6869c1e1265/BUILD/grive-27817e835fe115ebbda5410ec904aa49a2ad01f1/build'
/usr/bin/cmake -E cmake_progress_report /tmp/B.c9cbc6ee-2c18-40ce-9011-e6869c1e1265/BUILD/grive-27817e835fe115ebbda5410ec904aa49a2ad01f1/build/CMakeFiles 14
[  7%] Building CXX object libgrive/CMakeFiles/grive.dir/src/drive/Resource.cc.o
cd /tmp/B.c9cbc6ee-2c18-40ce-9011-e6869c1e1265/BUILD/grive-27817e835fe115ebbda5410ec904aa49a2ad01f1/build/libgrive && /usr/bin/i486-pld-linux-g++   -DHAVE_BFD -DSRC_DIR=\"/tmp/B.c9cbc6ee-2c18-40ce-9011-e6869c1e1265/BUILD/grive-27817e835fe115ebbda5410ec904aa49a2ad01f1/libgrive/src\" -DTEST_DATA=\"/tmp/B.c9cbc6ee-2c18-40ce-9011-e6869c1e1265/BUILD/grive-27817e835fe115ebbda5410ec904aa49a2ad01f1/libgrive/test/data/\" -DVERSION=\"0.3.0-pre\" -D_FILE_OFFSET_BITS=64 -O2 -fwrapv -pipe -Wformat -Werror=format-security -gdwarf-4 -fno-debug-types-section -fvar-tracking-assignments -g2 -Wp,-D_FORTIFY_SOURCE=2 -fstack-protector --param=ssp-buffer-size=4 -fomit-frame-pointer -march=i486 -fasynchronous-unwind-tables -gdwarf-4 -fno-debug-types-section -fvar-tracking-assignments -g2  -DNDEBUG -DQT_NO_DEBUG -I/tmp/B.c9cbc6ee-2c18-40ce-9011-e6869c1e1265/BUILD/grive-27817e835fe115ebbda5410ec904aa49a2ad01f1/libgrive/src -I/tmp/B.c9cbc6ee-2c18-40ce-9011-e6869c1e1265/BUILD/grive-27817e835fe115ebbda5410ec904aa49a2ad01f1/libgrive/test    -o CMakeFiles/grive.dir/src/drive/Resource.cc.o -c /tmp/B.c9cbc6ee-2c18-40ce-9011-e6869c1e1265/BUILD/grive-27817e835fe115ebbda5410ec904aa49a2ad01f1/libgrive/src/drive/Resource.cc
make[2]: Leaving directory '/tmp/B.c9cbc6ee-2c18-40ce-9011-e6869c1e1265/BUILD/grive-27817e835fe115ebbda5410ec904aa49a2ad01f1/build'
make[2]: Entering directory '/tmp/B.c9cbc6ee-2c18-40ce-9011-e6869c1e1265/BUILD/grive-27817e835fe115ebbda5410ec904aa49a2ad01f1/build'
/usr/bin/cmake -E cmake_progress_report /tmp/B.c9cbc6ee-2c18-40ce-9011-e6869c1e1265/BUILD/grive-27817e835fe115ebbda5410ec904aa49a2ad01f1/build/CMakeFiles 23
[ 21%] Building CXX object libgrive/CMakeFiles/grive.dir/src/http/ResponseLog.cc.o
cd /tmp/B.c9cbc6ee-2c18-40ce-9011-e6869c1e1265/BUILD/grive-27817e835fe115ebbda5410ec904aa49a2ad01f1/build/libgrive && /usr/bin/i486-pld-linux-g++   -DHAVE_BFD -DSRC_DIR=\"/tmp/B.c9cbc6ee-2c18-40ce-9011-e6869c1e1265/BUILD/grive-27817e835fe115ebbda5410ec904aa49a2ad01f1/libgrive/src\" -DTEST_DATA=\"/tmp/B.c9cbc6ee-2c18-40ce-9011-e6869c1e1265/BUILD/grive-27817e835fe115ebbda5410ec904aa49a2ad01f1/libgrive/test/data/\" -DVERSION=\"0.3.0-pre\" -D_FILE_OFFSET_BITS=64 -O2 -fwrapv -pipe -Wformat -Werror=format-security -gdwarf-4 -fno-debug-types-section -fvar-tracking-assignments -g2 -Wp,-D_FORTIFY_SOURCE=2 -fstack-protector --param=ssp-buffer-size=4 -fomit-frame-pointer -march=i486 -fasynchronous-unwind-tables -gdwarf-4 -fno-debug-types-section -fvar-tracking-assignments -g2  -DNDEBUG -DQT_NO_DEBUG -I/tmp/B.c9cbc6ee-2c18-40ce-9011-e6869c1e1265/BUILD/grive-27817e835fe115ebbda5410ec904aa49a2ad01f1/libgrive/src -I/tmp/B.c9cbc6ee-2c18-40ce-9011-e6869c1e1265/BUILD/grive-27817e835fe115ebbda5410ec904aa49a2ad01f1/libgrive/test    -o CMakeFiles/grive.dir/src/http/ResponseLog.cc.o -c /tmp/B.c9cbc6ee-2c18-40ce-9011-e6869c1e1265/BUILD/grive-27817e835fe115ebbda5410ec904aa49a2ad01f1/libgrive/src/http/ResponseLog.cc
make[2]: Leaving directory '/tmp/B.c9cbc6ee-2c18-40ce-9011-e6869c1e1265/BUILD/grive-27817e835fe115ebbda5410ec904aa49a2ad01f1/build'
make[2]: Entering directory '/tmp/B.c9cbc6ee-2c18-40ce-9011-e6869c1e1265/BUILD/grive-27817e835fe115ebbda5410ec904aa49a2ad01f1/build'
/usr/bin/cmake -E cmake_progress_report /tmp/B.c9cbc6ee-2c18-40ce-9011-e6869c1e1265/BUILD/grive-27817e835fe115ebbda5410ec904aa49a2ad01f1/build/CMakeFiles 11
[  3%] Building CXX object libgrive/CMakeFiles/grive.dir/src/drive/Drive.cc.o
cd /tmp/B.c9cbc6ee-2c18-40ce-9011-e6869c1e1265/BUILD/grive-27817e835fe115ebbda5410ec904aa49a2ad01f1/build/libgrive && /usr/bin/i486-pld-linux-g++   -DHAVE_BFD -DSRC_DIR=\"/tmp/B.c9cbc6ee-2c18-40ce-9011-e6869c1e1265/BUILD/grive-27817e835fe115ebbda5410ec904aa49a2ad01f1/libgrive/src\" -DTEST_DATA=\"/tmp/B.c9cbc6ee-2c18-40ce-9011-e6869c1e1265/BUILD/grive-27817e835fe115ebbda5410ec904aa49a2ad01f1/libgrive/test/data/\" -DVERSION=\"0.3.0-pre\" -D_FILE_OFFSET_BITS=64 -O2 -fwrapv -pipe -Wformat -Werror=format-security -gdwarf-4 -fno-debug-types-section -fvar-tracking-assignments -g2 -Wp,-D_FORTIFY_SOURCE=2 -fstack-protector --param=ssp-buffer-size=4 -fomit-frame-pointer -march=i486 -fasynchronous-unwind-tables -gdwarf-4 -fno-debug-types-section -fvar-tracking-assignments -g2  -DNDEBUG -DQT_NO_DEBUG -I/tmp/B.c9cbc6ee-2c18-40ce-9011-e6869c1e1265/BUILD/grive-27817e835fe115ebbda5410ec904aa49a2ad01f1/libgrive/src -I/tmp/B.c9cbc6ee-2c18-40ce-9011-e6869c1e1265/BUILD/grive-27817e835fe115ebbda5410ec904aa49a2ad01f1/libgrive/test    -o CMakeFiles/grive.dir/src/drive/Drive.cc.o -c /tmp/B.c9cbc6ee-2c18-40ce-9011-e6869c1e1265/BUILD/grive-27817e835fe115ebbda5410ec904aa49a2ad01f1/libgrive/src/drive/Drive.cc
make[2]: Leaving directory '/tmp/B.c9cbc6ee-2c18-40ce-9011-e6869c1e1265/BUILD/grive-27817e835fe115ebbda5410ec904aa49a2ad01f1/build'
make[2]: Entering directory '/tmp/B.c9cbc6ee-2c18-40ce-9011-e6869c1e1265/BUILD/grive-27817e835fe115ebbda5410ec904aa49a2ad01f1/build'
/usr/bin/cmake -E cmake_progress_report /tmp/B.c9cbc6ee-2c18-40ce-9011-e6869c1e1265/BUILD/grive-27817e835fe115ebbda5410ec904aa49a2ad01f1/build/CMakeFiles 16
[  9%] Building CXX object libgrive/CMakeFiles/grive.dir/src/drive/State.cc.o
cd /tmp/B.c9cbc6ee-2c18-40ce-9011-e6869c1e1265/BUILD/grive-27817e835fe115ebbda5410ec904aa49a2ad01f1/build/libgrive && /usr/bin/i486-pld-linux-g++   -DHAVE_BFD -DSRC_DIR=\"/tmp/B.c9cbc6ee-2c18-40ce-9011-e6869c1e1265/BUILD/grive-27817e835fe115ebbda5410ec904aa49a2ad01f1/libgrive/src\" -DTEST_DATA=\"/tmp/B.c9cbc6ee-2c18-40ce-9011-e6869c1e1265/BUILD/grive-27817e835fe115ebbda5410ec904aa49a2ad01f1/libgrive/test/data/\" -DVERSION=\"0.3.0-pre\" -D_FILE_OFFSET_BITS=64 -O2 -fwrapv -pipe -Wformat -Werror=format-security -gdwarf-4 -fno-debug-types-section -fvar-tracking-assignments -g2 -Wp,-D_FORTIFY_SOURCE=2 -fstack-protector --param=ssp-buffer-size=4 -fomit-frame-pointer -march=i486 -fasynchronous-unwind-tables -gdwarf-4 -fno-debug-types-section -fvar-tracking-assignments -g2  -DNDEBUG -DQT_NO_DEBUG -I/tmp/B.c9cbc6ee-2c18-40ce-9011-e6869c1e1265/BUILD/grive-27817e835fe115ebbda5410ec904aa49a2ad01f1/libgrive/src -I/tmp/B.c9cbc6ee-2c18-40ce-9011-e6869c1e1265/BUILD/grive-27817e835fe115ebbda5410ec904aa49a2ad01f1/libgrive/test    -o CMakeFiles/grive.dir/src/drive/State.cc.o -c /tmp/B.c9cbc6ee-2c18-40ce-9011-e6869c1e1265/BUILD/grive-27817e835fe115ebbda5410ec904aa49a2ad01f1/libgrive/src/drive/State.cc
make[2]: Leaving directory '/tmp/B.c9cbc6ee-2c18-40ce-9011-e6869c1e1265/BUILD/grive-27817e835fe115ebbda5410ec904aa49a2ad01f1/build'
make[2]: Entering directory '/tmp/B.c9cbc6ee-2c18-40ce-9011-e6869c1e1265/BUILD/grive-27817e835fe115ebbda5410ec904aa49a2ad01f1/build'
/usr/bin/cmake -E cmake_progress_report /tmp/B.c9cbc6ee-2c18-40ce-9011-e6869c1e1265/BUILD/grive-27817e835fe115ebbda5410ec904aa49a2ad01f1/build/CMakeFiles 20
[ 16%] Building CXX object libgrive/CMakeFiles/grive.dir/src/http/CurlAgent.cc.o
cd /tmp/B.c9cbc6ee-2c18-40ce-9011-e6869c1e1265/BUILD/grive-27817e835fe115ebbda5410ec904aa49a2ad01f1/build/libgrive && /usr/bin/i486-pld-linux-g++   -DHAVE_BFD -DSRC_DIR=\"/tmp/B.c9cbc6ee-2c18-40ce-9011-e6869c1e1265/BUILD/grive-27817e835fe115ebbda5410ec904aa49a2ad01f1/libgrive/src\" -DTEST_DATA=\"/tmp/B.c9cbc6ee-2c18-40ce-9011-e6869c1e1265/BUILD/grive-27817e835fe115ebbda5410ec904aa49a2ad01f1/libgrive/test/data/\" -DVERSION=\"0.3.0-pre\" -D_FILE_OFFSET_BITS=64 -O2 -fwrapv -pipe -Wformat -Werror=format-security -gdwarf-4 -fno-debug-types-section -fvar-tracking-assignments -g2 -Wp,-D_FORTIFY_SOURCE=2 -fstack-protector --param=ssp-buffer-size=4 -fomit-frame-pointer -march=i486 -fasynchronous-unwind-tables -gdwarf-4 -fno-debug-types-section -fvar-tracking-assignments -g2  -DNDEBUG -DQT_NO_DEBUG -I/tmp/B.c9cbc6ee-2c18-40ce-9011-e6869c1e1265/BUILD/grive-27817e835fe115ebbda5410ec904aa49a2ad01f1/libgrive/src -I/tmp/B.c9cbc6ee-2c18-40ce-9011-e6869c1e1265/BUILD/grive-27817e835fe115ebbda5410ec904aa49a2ad01f1/libgrive/test    -o CMakeFiles/grive.dir/src/http/CurlAgent.cc.o -c /tmp/B.c9cbc6ee-2c18-40ce-9011-e6869c1e1265/BUILD/grive-27817e835fe115ebbda5410ec904aa49a2ad01f1/libgrive/src/http/CurlAgent.cc
make[2]: Leaving directory '/tmp/B.c9cbc6ee-2c18-40ce-9011-e6869c1e1265/BUILD/grive-27817e835fe115ebbda5410ec904aa49a2ad01f1/build'
make[2]: Entering directory '/tmp/B.c9cbc6ee-2c18-40ce-9011-e6869c1e1265/BUILD/grive-27817e835fe115ebbda5410ec904aa49a2ad01f1/build'
/usr/bin/cmake -E cmake_progress_report /tmp/B.c9cbc6ee-2c18-40ce-9011-e6869c1e1265/BUILD/grive-27817e835fe115ebbda5410ec904aa49a2ad01f1/build/CMakeFiles 26
[ 25%] Building CXX object libgrive/CMakeFiles/grive.dir/src/protocol/AuthAgent.cc.o
cd /tmp/B.c9cbc6ee-2c18-40ce-9011-e6869c1e1265/BUILD/grive-27817e835fe115ebbda5410ec904aa49a2ad01f1/build/libgrive && /usr/bin/i486-pld-linux-g++   -DHAVE_BFD -DSRC_DIR=\"/tmp/B.c9cbc6ee-2c18-40ce-9011-e6869c1e1265/BUILD/grive-27817e835fe115ebbda5410ec904aa49a2ad01f1/libgrive/src\" -DTEST_DATA=\"/tmp/B.c9cbc6ee-2c18-40ce-9011-e6869c1e1265/BUILD/grive-27817e835fe115ebbda5410ec904aa49a2ad01f1/libgrive/test/data/\" -DVERSION=\"0.3.0-pre\" -D_FILE_OFFSET_BITS=64 -O2 -fwrapv -pipe -Wformat -Werror=format-security -gdwarf-4 -fno-debug-types-section -fvar-tracking-assignments -g2 -Wp,-D_FORTIFY_SOURCE=2 -fstack-protector --param=ssp-buffer-size=4 -fomit-frame-pointer -march=i486 -fasynchronous-unwind-tables -gdwarf-4 -fno-debug-types-section -fvar-tracking-assignments -g2  -DNDEBUG -DQT_NO_DEBUG -I/tmp/B.c9cbc6ee-2c18-40ce-9011-e6869c1e1265/BUILD/grive-27817e835fe115ebbda5410ec904aa49a2ad01f1/libgrive/src -I/tmp/B.c9cbc6ee-2c18-40ce-9011-e6869c1e1265/BUILD/grive-27817e835fe115ebbda5410ec904aa49a2ad01f1/libgrive/test    -o CMakeFiles/grive.dir/src/protocol/AuthAgent.cc.o -c /tmp/B.c9cbc6ee-2c18-40ce-9011-e6869c1e1265/BUILD/grive-27817e835fe115ebbda5410ec904aa49a2ad01f1/libgrive/src/protocol/AuthAgent.cc
make[2]: Leaving directory '/tmp/B.c9cbc6ee-2c18-40ce-9011-e6869c1e1265/BUILD/grive-27817e835fe115ebbda5410ec904aa49a2ad01f1/build'
CMakeFiles/Makefile2:117: recipe for target 'libgrive/CMakeFiles/grive.dir/all' failed
make[1]: *** [libgrive/CMakeFiles/grive.dir/all] Error 2
Makefile:120: recipe for target 'all' failed
make: *** [all] Error 2
error: Bad exit status from /tmp/B.c9cbc6ee-2c18-40ce-9011-e6869c1e1265/BUILD/tmp/rpm-tmp.19644 (%build)


RPM build errors:
    Bad exit status from /tmp/B.c9cbc6ee-2c18-40ce-9011-e6869c1e1265/BUILD/tmp/rpm-tmp.19644 (%build)
ended at: Mon Feb 16 02:26:43 2015, done in 0:00:20.869125
error: No files produced.
+ chmod -R u+rwX /tmp/B.c9cbc6ee-2c18-40ce-9011-e6869c1e1265/BUILD
+ rm -rf /tmp/B.c9cbc6ee-2c18-40ce-9011-e6869c1e1265/tmp /tmp/B.c9cbc6ee-2c18-40ce-9011-e6869c1e1265/BUILD
+ rm -rf /tmp/B.c9cbc6ee-2c18-40ce-9011-e6869c1e1265
Begin-PLD-Builder-Info
Build-Time: user:86.69s sys:12.59s real:26.60s (faults io:77 non-io:925620)

End-PLD-Builder-Info
[Back to list of logs] [View rpm -qa of builder]