FailedOk

th/SRPMS[OK]
th/x32[OK]
th/i686[OK]
th/x86_64[OK]

ac/SRPMS[OK]
ac/i386[OK]
ac/i586[OK]
ac/i686[OK]
ac/alpha[OK]
ac/amd64[OK]
ac/athlon[OK]
ac/ppc[OK]
ac/sparc[OK]
ac/sparc64[OK]

Advanced Search
main()
Powered by PLD Linux
(c) 2002-2024 PLD Team
$Revision: 1.37 $
Powered by Real Programmer.
Your IP: 44.221.66.130

grive e91ef9aa-3823-427e-97b3-fb024b64710b

Status:Failed
Source URL:https://buildlogs.pld-linux.org/pld/th/i486/FAIL/grive,e91ef9aa-3823-427e-97b3-fb024b64710b.bz2
text/plain URL:View!
rpm -qa of builder:View!
Date:2015/02/17 23:01:13
Runtime:0:00:25.282044

Toc:

  • prep
  • Executing(%prep): /bin/sh -e /tmp/B.11768d68-f687-4fb4-b2e6-4375e66ba793/BUILD/tmp/rpm-tmp.7955
  • build
  • Executing(%build): /bin/sh -e /tmp/B.11768d68-f687-4fb4-b2e6-4375e66ba793/BUILD/tmp/rpm-tmp.7955
  • error 1
  • /tmp/B.11768d68-f687-4fb4-b2e6-4375e66ba793/BUILD/grive-27817e835fe115ebbda5410ec904aa49a2ad01f1/libgrive/src/protocol/Json.cc:32:31: fatal error: json/json_tokener.h: No such file or directory
  • error 2
  • compilation terminated.
  • error 3
  • libgrive/CMakeFiles/grive.dir/build.make:448: recipe for target 'libgrive/CMakeFiles/grive.dir/src/protocol/Json.cc.o' failed
  • error 4
  • make[2]: *** [libgrive/CMakeFiles/grive.dir/src/protocol/Json.cc.o] Error 1
  • error 5
  • CMakeFiles/Makefile2:117: recipe for target 'libgrive/CMakeFiles/grive.dir/all' failed
  • error 6
  • make[1]: *** [libgrive/CMakeFiles/grive.dir/all] Error 2
  • error 7
  • Makefile:120: recipe for target 'all' failed
  • error 8
  • error: Bad exit status from /tmp/B.11768d68-f687-4fb4-b2e6-4375e66ba793/BUILD/tmp/rpm-tmp.7955 (%build)
  • error 9
  • RPM build errors:
  • error 10
  • error: No files produced.

Content:

request from: baggins
checking if we should skip the build
started at: Tue Feb 17 23:00:42 2015
fetching https://srcbuilder.pld-linux.org/th//srpms/e91ef9aa-3823-427e-97b3-fb024b64710b/grive-0.3.0-0.20130702git27817e8.7.src.rpm
fetched 176088 bytes, 630.6 K/s
installing srpm: grive-0.3.0-0.20130702git27817e8.7.src.rpm
+ install -d /tmp/B.11768d68-f687-4fb4-b2e6-4375e66ba793/BUILD /tmp/B.11768d68-f687-4fb4-b2e6-4375e66ba793/RPMS
+ LC_ALL=en_US.UTF-8
+ rpm -qp --changelog grive-0.3.0-0.20130702git27817e8.7.src.rpm
* Tue Feb 17 2015 PLD Linux Team <feedback@pld-linux.org>
- For complete changelog see: http://git.pld-linux.org/?p=packages/grive.git;a=log;h=master
* Sat Nov 15 2014 Jan Rękorajski <baggins@pld-linux.org> 38cfa9b
- release 7 (by relup.sh) * Sat Oct 25 2014 Jan Rękorajski <baggins@pld-linux.org> 363ec12
- rel 6 + rpm -Uhv --nodeps --define '_topdir /tmp/B.11768d68-f687-4fb4-b2e6-4375e66ba793' --define '_specdir %{_topdir}' --define '_sourcedir %{_specdir}' --define '_rpmdir %{_topdir}/RPMS' --define '_builddir %{_topdir}/BUILD' grive-0.3.0-0.20130702git27817e8.7.src.rpm Preparing... ################################################## grive ################################################## + rm -f grive-0.3.0-0.20130702git27817e8.7.src.rpm + install -m 700 -d /tmp/B.11768d68-f687-4fb4-b2e6-4375e66ba793/BUILD/tmp + TMPDIR=/tmp/B.11768d68-f687-4fb4-b2e6-4375e66ba793/BUILD/tmp + exec nice -n 0 rpmbuild -bp --short-circuit --nodeps --define '_topdir /tmp/B.11768d68-f687-4fb4-b2e6-4375e66ba793' --define '_specdir %{_topdir}' --define '_sourcedir %{_specdir}' --define '_rpmdir %{_topdir}/RPMS' --define '_builddir %{_topdir}/BUILD' --target i486-pld-linux --define 'prep exit 0' /tmp/B.11768d68-f687-4fb4-b2e6-4375e66ba793/grive.spec Building target platforms: i486-pld-linux checking BuildConflict-ing packages no BuildConflicts found checking BR rpm: Building target platforms: i486-pld-linux no BR needed building RPM using: set -ex; : build-id: e91ef9aa-3823-427e-97b3-fb024b64710b; TMPDIR=/tmp/B.11768d68-f687-4fb4-b2e6-4375e66ba793/BUILD/tmp exec nice -n 0 rpmbuild -bb --define '_smp_mflags -j9' --define '_make_opts -Otarget' --define '_pld_builder 1' --define '_topdir /tmp/B.11768d68-f687-4fb4-b2e6-4375e66ba793' --define '_specdir %{_topdir}' --define '_sourcedir %{_specdir}' --define '_rpmdir %{_topdir}/RPMS' --define '_builddir %{_topdir}/BUILD' --target i486-pld-linux /tmp/B.11768d68-f687-4fb4-b2e6-4375e66ba793/grive.spec + : build-id: e91ef9aa-3823-427e-97b3-fb024b64710b + TMPDIR=/tmp/B.11768d68-f687-4fb4-b2e6-4375e66ba793/BUILD/tmp + exec nice -n 0 rpmbuild -bb --define '_smp_mflags -j9' --define '_make_opts -Otarget' --define '_pld_builder 1' --define '_topdir /tmp/B.11768d68-f687-4fb4-b2e6-4375e66ba793' --define '_specdir %{_topdir}' --define '_sourcedir %{_specdir}' --define '_rpmdir %{_topdir}/RPMS' --define '_builddir %{_topdir}/BUILD' --target i486-pld-linux /tmp/B.11768d68-f687-4fb4-b2e6-4375e66ba793/grive.spec Building target platforms: i486-pld-linux Executing(%prep): /bin/sh -e /tmp/B.11768d68-f687-4fb4-b2e6-4375e66ba793/BUILD/tmp/rpm-tmp.7955 + umask 022 + cd /tmp/B.11768d68-f687-4fb4-b2e6-4375e66ba793/BUILD + cd /tmp/B.11768d68-f687-4fb4-b2e6-4375e66ba793/BUILD + rm -rf grive-27817e835fe115ebbda5410ec904aa49a2ad01f1 + /usr/bin/gzip -dc /tmp/B.11768d68-f687-4fb4-b2e6-4375e66ba793/grive-0.3.0-27817e8.tar.gz + /bin/tar -xf - + STATUS=0 + '[' 0 -ne 0 ']' + cd grive-27817e835fe115ebbda5410ec904aa49a2ad01f1 + /bin/id -u + '[' 2001 '=' 0 ']' + /bin/id -u + '[' 2001 '=' 0 ']' + /bin/chmod -Rf a+rX,u+w,g-w,o-w . + echo 'Patch #0 (json-c.patch):' Patch #0 (json-c.patch): + '[' -f /tmp/B.11768d68-f687-4fb4-b2e6-4375e66ba793/json-c.patch ']' + /bin/cat /tmp/B.11768d68-f687-4fb4-b2e6-4375e66ba793/json-c.patch + /usr/bin/patch -s -p1 + echo 'Patch #1 (grive-bgrive_cmake_fix.patch):' Patch #1 (grive-bgrive_cmake_fix.patch): + '[' -f /tmp/B.11768d68-f687-4fb4-b2e6-4375e66ba793/grive-bgrive_cmake_fix.patch ']' + /bin/cat /tmp/B.11768d68-f687-4fb4-b2e6-4375e66ba793/grive-bgrive_cmake_fix.patch + /usr/bin/patch -s -p1 + echo 'Patch #2 (build.patch):' Patch #2 (build.patch): + '[' -f /tmp/B.11768d68-f687-4fb4-b2e6-4375e66ba793/build.patch ']' + /bin/cat /tmp/B.11768d68-f687-4fb4-b2e6-4375e66ba793/build.patch + /usr/bin/patch -s -p1 + exit 0 Executing(%build): /bin/sh -e /tmp/B.11768d68-f687-4fb4-b2e6-4375e66ba793/BUILD/tmp/rpm-tmp.7955 TMP=/home/users/builder/tmp HOME=/home/users/builder PATH=/home/users/builder/GNUstep/Tools:/usr/local/bin:/usr/bin:/bin:/home/users/builder/bin TMPDIR=/tmp/B.11768d68-f687-4fb4-b2e6-4375e66ba793/BUILD/tmp + umask 022 + cd /tmp/B.11768d68-f687-4fb4-b2e6-4375e66ba793/BUILD + cd grive-27817e835fe115ebbda5410ec904aa49a2ad01f1 + install -d build + cd build + CC=i486-pld-linux-gcc CXX=i486-pld-linux-g++ CPPFLAGS= /usr/bin/cmake '-DCMAKE_VERBOSE_MAKEFILE=ON' '-DCMAKE_BUILD_TYPE=PLD' '-DCMAKE_INSTALL_BINDIR:PATH=/usr/bin' '-DCMAKE_INSTALL_SBINDIR:PATH=/usr/sbin' '-DCMAKE_INSTALL_LIBEXECDIR:PATH=/usr/lib' '-DCMAKE_INSTALL_SYSCONFDIR:PATH=/etc' '-DCMAKE_INSTALL_SHAREDSTATEDIRPATH:PATH=/var/lib' '-DCMAKE_INSTALL_LOCALSTATEDIRPATH:PATH=/var' '-DCMAKE_INSTALL_LIBDIR:PATH=/usr/lib' '-DCMAKE_INSTALL_INCLUDEDIR:PATH=/usr/include' '-DCMAKE_INSTALL_OLDINCLUDEDIR:PATH=/usr/include' '-DCMAKE_INSTALL_DATAROOTDIR:PATH=/usr/share' '-DCMAKE_INSTALL_DATADIR:PATH=/usr/share' '-DCMAKE_INSTALL_INFODIR:PATH=/usr/share/info' '-DCMAKE_INSTALL_LOCALEDIR:PATH=/usr/share/locale' '-DCMAKE_INSTALL_MANDIR:PATH=/usr/share/man' '-DCMAKE_INSTALL_DOCDIR:PATH=/usr/share/doc' '-DCMAKE_INSTALL_PREFIX:PATH=/usr' '-DSYSCONF_INSTALL_DIR:PATH=/etc' '-DCMAKE_CXX_FLAGS_PLD=-O2 -fwrapv -pipe -Wformat -Werror=format-security -gdwarf-4 -fno-debug-types-section -fvar-tracking-assignments -g2 -Wp,-D_FORTIFY_SOURCE=2 -fstack-protector --param=ssp-buffer-size=4 -fomit-frame-pointer -march=i486 -fasynchronous-unwind-tables -gdwarf-4 -fno-debug-types-section -fvar-tracking-assignments -g2 -DNDEBUG -DQT_NO_DEBUG' '-DCMAKE_C_FLAGS_PLD=-O2 -fwrapv -pipe -Wformat -Werror=format-security -gdwarf-4 -fno-debug-types-section -fvar-tracking-assignments -g2 -Wp,-D_FORTIFY_SOURCE=2 -fstack-protector --param=ssp-buffer-size=4 -fomit-frame-pointer -march=i486 -fasynchronous-unwind-tables -gdwarf-4 -fno-debug-types-section -fvar-tracking-assignments -g2 -DNDEBUG -DQT_NO_DEBUG' '-DCMAKE_Fortran_FLAGS_PLD=-O2 -fwrapv -pipe -Wformat -Werror=format-security -gdwarf-4 -fno-debug-types-section -fvar-tracking-assignments -g2 -Wp,-D_FORTIFY_SOURCE=2 -fstack-protector --param=ssp-buffer-size=4 -fomit-frame-pointer -march=i486 -fasynchronous-unwind-tables -gdwarf-4 -fno-debug-types-section -fvar-tracking-assignments -g2 -DNDEBUG -DQT_NO_DEBUG' '-DCMAKE_EXE_LINKER_FLAGS_PLD=-Wl,--as-needed -Wl,--no-copy-dt-needed-entries -Wl,-z,relro -Wl,-z,combreloc ' '-DCMAKE_SHARED_LINKER_FLAGS_PLD=-Wl,--as-needed -Wl,--no-copy-dt-needed-entries -Wl,-z,relro -Wl,-z,combreloc ' '-DCMAKE_MODULE_LINKER_FLAGS_PLD=-Wl,--as-needed -Wl,--no-copy-dt-needed-entries -Wl,-z,relro -Wl,-z,combreloc ' '-DBUILD_SHARED_LIBS:BOOL=ON' .. -- The C compiler identification is GNU 4.9.2 -- The CXX compiler identification is GNU 4.9.2 -- Check for working C compiler: /usr/bin/i486-pld-linux-gcc -- Check for working C compiler: /usr/bin/i486-pld-linux-gcc -- works -- Detecting C compiler ABI info -- Detecting C compiler ABI info - done -- Detecting C compile features -- Detecting C compile features - done -- Check for working CXX compiler: /usr/bin/i486-pld-linux-g++ -- Check for working CXX compiler: /usr/bin/i486-pld-linux-g++ -- works -- Detecting CXX compiler ABI info -- Detecting CXX compiler ABI info - done -- Detecting CXX compile features -- Detecting CXX compile features - done -- Found libgcrypt: -lgcrypt -lgpg-error -- Found JSON-C: /usr/lib/libjson-c.so -- Found CURL: /usr/lib/libcurl.so (found version "7.40.0") -- Found EXPAT: /usr/lib/libexpat.so (found version "2.1.0") -- Boost version: 1.57.0 -- Found the following Boost libraries: -- program_options -- filesystem -- unit_test_framework -- system -- Found libbfd: /usr/lib/libbfd.so -- Found CppUnit: /usr/lib/libcppunit.so -- Found libiberty: /usr/lib/libiberty.a -- Found ZLIB: /usr/lib/libz.so (found version "1.2.8") -- Building unitary tests along with the library and the binary -- Boost version: 1.57.0 -- Found the following Boost libraries: -- program_options -- Looking for Q_WS_X11 -- Looking for Q_WS_X11 - found -- Looking for Q_WS_WIN -- Looking for Q_WS_WIN - not found -- Looking for Q_WS_QWS -- Looking for Q_WS_QWS - not found -- Looking for Q_WS_MAC -- Looking for Q_WS_MAC - not found -- Found Qt4: /usr/bin/qmake-qt4 (found version "4.8.6") -- Boost version: 1.57.0 -- Configuring done -- Generating done CMake Warning: Manually-specified variables were not used by the project: CMAKE_C_FLAGS_PLD CMAKE_Fortran_FLAGS_PLD CMAKE_INSTALL_BINDIR CMAKE_INSTALL_DATADIR CMAKE_INSTALL_DATAROOTDIR CMAKE_INSTALL_DOCDIR CMAKE_INSTALL_INCLUDEDIR CMAKE_INSTALL_INFODIR CMAKE_INSTALL_LIBDIR CMAKE_INSTALL_LIBEXECDIR CMAKE_INSTALL_LOCALEDIR CMAKE_INSTALL_LOCALSTATEDIRPATH CMAKE_INSTALL_MANDIR CMAKE_INSTALL_OLDINCLUDEDIR CMAKE_INSTALL_SBINDIR CMAKE_INSTALL_SHAREDSTATEDIRPATH CMAKE_INSTALL_SYSCONFDIR CMAKE_MODULE_LINKER_FLAGS_PLD CMAKE_SHARED_LINKER_FLAGS_PLD SYSCONF_INSTALL_DIR -- Build files have been written to: /tmp/B.11768d68-f687-4fb4-b2e6-4375e66ba793/BUILD/grive-27817e835fe115ebbda5410ec904aa49a2ad01f1/build + /usr/bin/make -Otarget -j9 /usr/bin/cmake -H/tmp/B.11768d68-f687-4fb4-b2e6-4375e66ba793/BUILD/grive-27817e835fe115ebbda5410ec904aa49a2ad01f1 -B/tmp/B.11768d68-f687-4fb4-b2e6-4375e66ba793/BUILD/grive-27817e835fe115ebbda5410ec904aa49a2ad01f1/build --check-build-system CMakeFiles/Makefile.cmake 0 /usr/bin/cmake -E cmake_progress_start /tmp/B.11768d68-f687-4fb4-b2e6-4375e66ba793/BUILD/grive-27817e835fe115ebbda5410ec904aa49a2ad01f1/build/CMakeFiles /tmp/B.11768d68-f687-4fb4-b2e6-4375e66ba793/BUILD/grive-27817e835fe115ebbda5410ec904aa49a2ad01f1/build/CMakeFiles/progress.marks /usr/bin/make -f CMakeFiles/Makefile2 all /usr/bin/make -f libgrive/CMakeFiles/grive.dir/build.make libgrive/CMakeFiles/grive.dir/depend make[2]: Entering directory '/tmp/B.11768d68-f687-4fb4-b2e6-4375e66ba793/BUILD/grive-27817e835fe115ebbda5410ec904aa49a2ad01f1/build' cd /tmp/B.11768d68-f687-4fb4-b2e6-4375e66ba793/BUILD/grive-27817e835fe115ebbda5410ec904aa49a2ad01f1/build && /usr/bin/cmake -E cmake_depends "Unix Makefiles" /tmp/B.11768d68-f687-4fb4-b2e6-4375e66ba793/BUILD/grive-27817e835fe115ebbda5410ec904aa49a2ad01f1 /tmp/B.11768d68-f687-4fb4-b2e6-4375e66ba793/BUILD/grive-27817e835fe115ebbda5410ec904aa49a2ad01f1/libgrive /tmp/B.11768d68-f687-4fb4-b2e6-4375e66ba793/BUILD/grive-27817e835fe115ebbda5410ec904aa49a2ad01f1/build /tmp/B.11768d68-f687-4fb4-b2e6-4375e66ba793/BUILD/grive-27817e835fe115ebbda5410ec904aa49a2ad01f1/build/libgrive /tmp/B.11768d68-f687-4fb4-b2e6-4375e66ba793/BUILD/grive-27817e835fe115ebbda5410ec904aa49a2ad01f1/build/libgrive/CMakeFiles/grive.dir/DependInfo.cmake --color= Scanning dependencies of target grive make[2]: Leaving directory '/tmp/B.11768d68-f687-4fb4-b2e6-4375e66ba793/BUILD/grive-27817e835fe115ebbda5410ec904aa49a2ad01f1/build' /usr/bin/make -f libgrive/CMakeFiles/grive.dir/build.make libgrive/CMakeFiles/grive.dir/build make[2]: Entering directory '/tmp/B.11768d68-f687-4fb4-b2e6-4375e66ba793/BUILD/grive-27817e835fe115ebbda5410ec904aa49a2ad01f1/build' /usr/bin/cmake -E cmake_progress_report /tmp/B.11768d68-f687-4fb4-b2e6-4375e66ba793/BUILD/grive-27817e835fe115ebbda5410ec904aa49a2ad01f1/build/CMakeFiles 18 [ 13%] Building CXX object libgrive/CMakeFiles/grive.dir/src/drive2/Feed.cc.o cd /tmp/B.11768d68-f687-4fb4-b2e6-4375e66ba793/BUILD/grive-27817e835fe115ebbda5410ec904aa49a2ad01f1/build/libgrive && /usr/bin/i486-pld-linux-g++ -DHAVE_BFD -DSRC_DIR=\"/tmp/B.11768d68-f687-4fb4-b2e6-4375e66ba793/BUILD/grive-27817e835fe115ebbda5410ec904aa49a2ad01f1/libgrive/src\" -DTEST_DATA=\"/tmp/B.11768d68-f687-4fb4-b2e6-4375e66ba793/BUILD/grive-27817e835fe115ebbda5410ec904aa49a2ad01f1/libgrive/test/data/\" -DVERSION=\"0.3.0-pre\" -D_FILE_OFFSET_BITS=64 -O2 -fwrapv -pipe -Wformat -Werror=format-security -gdwarf-4 -fno-debug-types-section -fvar-tracking-assignments -g2 -Wp,-D_FORTIFY_SOURCE=2 -fstack-protector --param=ssp-buffer-size=4 -fomit-frame-pointer -march=i486 -fasynchronous-unwind-tables -gdwarf-4 -fno-debug-types-section -fvar-tracking-assignments -g2 -DNDEBUG -DQT_NO_DEBUG -I/tmp/B.11768d68-f687-4fb4-b2e6-4375e66ba793/BUILD/grive-27817e835fe115ebbda5410ec904aa49a2ad01f1/libgrive/src -I/tmp/B.11768d68-f687-4fb4-b2e6-4375e66ba793/BUILD/grive-27817e835fe115ebbda5410ec904aa49a2ad01f1/libgrive/test -o CMakeFiles/grive.dir/src/drive2/Feed.cc.o -c /tmp/B.11768d68-f687-4fb4-b2e6-4375e66ba793/BUILD/grive-27817e835fe115ebbda5410ec904aa49a2ad01f1/libgrive/src/drive2/Feed.cc make[2]: Leaving directory '/tmp/B.11768d68-f687-4fb4-b2e6-4375e66ba793/BUILD/grive-27817e835fe115ebbda5410ec904aa49a2ad01f1/build' make[2]: Entering directory '/tmp/B.11768d68-f687-4fb4-b2e6-4375e66ba793/BUILD/grive-27817e835fe115ebbda5410ec904aa49a2ad01f1/build' /usr/bin/cmake -E cmake_progress_report /tmp/B.11768d68-f687-4fb4-b2e6-4375e66ba793/BUILD/grive-27817e835fe115ebbda5410ec904aa49a2ad01f1/build/CMakeFiles 19 [ 15%] Building CXX object libgrive/CMakeFiles/grive.dir/src/drive2/Resource.cc.o cd /tmp/B.11768d68-f687-4fb4-b2e6-4375e66ba793/BUILD/grive-27817e835fe115ebbda5410ec904aa49a2ad01f1/build/libgrive && /usr/bin/i486-pld-linux-g++ -DHAVE_BFD -DSRC_DIR=\"/tmp/B.11768d68-f687-4fb4-b2e6-4375e66ba793/BUILD/grive-27817e835fe115ebbda5410ec904aa49a2ad01f1/libgrive/src\" -DTEST_DATA=\"/tmp/B.11768d68-f687-4fb4-b2e6-4375e66ba793/BUILD/grive-27817e835fe115ebbda5410ec904aa49a2ad01f1/libgrive/test/data/\" -DVERSION=\"0.3.0-pre\" -D_FILE_OFFSET_BITS=64 -O2 -fwrapv -pipe -Wformat -Werror=format-security -gdwarf-4 -fno-debug-types-section -fvar-tracking-assignments -g2 -Wp,-D_FORTIFY_SOURCE=2 -fstack-protector --param=ssp-buffer-size=4 -fomit-frame-pointer -march=i486 -fasynchronous-unwind-tables -gdwarf-4 -fno-debug-types-section -fvar-tracking-assignments -g2 -DNDEBUG -DQT_NO_DEBUG -I/tmp/B.11768d68-f687-4fb4-b2e6-4375e66ba793/BUILD/grive-27817e835fe115ebbda5410ec904aa49a2ad01f1/libgrive/src -I/tmp/B.11768d68-f687-4fb4-b2e6-4375e66ba793/BUILD/grive-27817e835fe115ebbda5410ec904aa49a2ad01f1/libgrive/test -o CMakeFiles/grive.dir/src/drive2/Resource.cc.o -c /tmp/B.11768d68-f687-4fb4-b2e6-4375e66ba793/BUILD/grive-27817e835fe115ebbda5410ec904aa49a2ad01f1/libgrive/src/drive2/Resource.cc make[2]: Leaving directory '/tmp/B.11768d68-f687-4fb4-b2e6-4375e66ba793/BUILD/grive-27817e835fe115ebbda5410ec904aa49a2ad01f1/build' make[2]: Entering directory '/tmp/B.11768d68-f687-4fb4-b2e6-4375e66ba793/BUILD/grive-27817e835fe115ebbda5410ec904aa49a2ad01f1/build' /usr/bin/cmake -E cmake_progress_report /tmp/B.11768d68-f687-4fb4-b2e6-4375e66ba793/BUILD/grive-27817e835fe115ebbda5410ec904aa49a2ad01f1/build/CMakeFiles 10 [ 1%] Building CXX object libgrive/CMakeFiles/grive.dir/src/drive/CommonUri.cc.o cd /tmp/B.11768d68-f687-4fb4-b2e6-4375e66ba793/BUILD/grive-27817e835fe115ebbda5410ec904aa49a2ad01f1/build/libgrive && /usr/bin/i486-pld-linux-g++ -DHAVE_BFD -DSRC_DIR=\"/tmp/B.11768d68-f687-4fb4-b2e6-4375e66ba793/BUILD/grive-27817e835fe115ebbda5410ec904aa49a2ad01f1/libgrive/src\" -DTEST_DATA=\"/tmp/B.11768d68-f687-4fb4-b2e6-4375e66ba793/BUILD/grive-27817e835fe115ebbda5410ec904aa49a2ad01f1/libgrive/test/data/\" -DVERSION=\"0.3.0-pre\" -D_FILE_OFFSET_BITS=64 -O2 -fwrapv -pipe -Wformat -Werror=format-security -gdwarf-4 -fno-debug-types-section -fvar-tracking-assignments -g2 -Wp,-D_FORTIFY_SOURCE=2 -fstack-protector --param=ssp-buffer-size=4 -fomit-frame-pointer -march=i486 -fasynchronous-unwind-tables -gdwarf-4 -fno-debug-types-section -fvar-tracking-assignments -g2 -DNDEBUG -DQT_NO_DEBUG -I/tmp/B.11768d68-f687-4fb4-b2e6-4375e66ba793/BUILD/grive-27817e835fe115ebbda5410ec904aa49a2ad01f1/libgrive/src -I/tmp/B.11768d68-f687-4fb4-b2e6-4375e66ba793/BUILD/grive-27817e835fe115ebbda5410ec904aa49a2ad01f1/libgrive/test -o CMakeFiles/grive.dir/src/drive/CommonUri.cc.o -c /tmp/B.11768d68-f687-4fb4-b2e6-4375e66ba793/BUILD/grive-27817e835fe115ebbda5410ec904aa49a2ad01f1/libgrive/src/drive/CommonUri.cc make[2]: Leaving directory '/tmp/B.11768d68-f687-4fb4-b2e6-4375e66ba793/BUILD/grive-27817e835fe115ebbda5410ec904aa49a2ad01f1/build' make[2]: Entering directory '/tmp/B.11768d68-f687-4fb4-b2e6-4375e66ba793/BUILD/grive-27817e835fe115ebbda5410ec904aa49a2ad01f1/build' /usr/bin/cmake -E cmake_progress_report /tmp/B.11768d68-f687-4fb4-b2e6-4375e66ba793/BUILD/grive-27817e835fe115ebbda5410ec904aa49a2ad01f1/build/CMakeFiles 12 [ 4%] Building CXX object libgrive/CMakeFiles/grive.dir/src/drive/Entry.cc.o cd /tmp/B.11768d68-f687-4fb4-b2e6-4375e66ba793/BUILD/grive-27817e835fe115ebbda5410ec904aa49a2ad01f1/build/libgrive && /usr/bin/i486-pld-linux-g++ -DHAVE_BFD -DSRC_DIR=\"/tmp/B.11768d68-f687-4fb4-b2e6-4375e66ba793/BUILD/grive-27817e835fe115ebbda5410ec904aa49a2ad01f1/libgrive/src\" -DTEST_DATA=\"/tmp/B.11768d68-f687-4fb4-b2e6-4375e66ba793/BUILD/grive-27817e835fe115ebbda5410ec904aa49a2ad01f1/libgrive/test/data/\" -DVERSION=\"0.3.0-pre\" -D_FILE_OFFSET_BITS=64 -O2 -fwrapv -pipe -Wformat -Werror=format-security -gdwarf-4 -fno-debug-types-section -fvar-tracking-assignments -g2 -Wp,-D_FORTIFY_SOURCE=2 -fstack-protector --param=ssp-buffer-size=4 -fomit-frame-pointer -march=i486 -fasynchronous-unwind-tables -gdwarf-4 -fno-debug-types-section -fvar-tracking-assignments -g2 -DNDEBUG -DQT_NO_DEBUG -I/tmp/B.11768d68-f687-4fb4-b2e6-4375e66ba793/BUILD/grive-27817e835fe115ebbda5410ec904aa49a2ad01f1/libgrive/src -I/tmp/B.11768d68-f687-4fb4-b2e6-4375e66ba793/BUILD/grive-27817e835fe115ebbda5410ec904aa49a2ad01f1/libgrive/test -o CMakeFiles/grive.dir/src/drive/Entry.cc.o -c /tmp/B.11768d68-f687-4fb4-b2e6-4375e66ba793/BUILD/grive-27817e835fe115ebbda5410ec904aa49a2ad01f1/libgrive/src/drive/Entry.cc make[2]: Leaving directory '/tmp/B.11768d68-f687-4fb4-b2e6-4375e66ba793/BUILD/grive-27817e835fe115ebbda5410ec904aa49a2ad01f1/build' make[2]: Entering directory '/tmp/B.11768d68-f687-4fb4-b2e6-4375e66ba793/BUILD/grive-27817e835fe115ebbda5410ec904aa49a2ad01f1/build' /usr/bin/cmake -E cmake_progress_report /tmp/B.11768d68-f687-4fb4-b2e6-4375e66ba793/BUILD/grive-27817e835fe115ebbda5410ec904aa49a2ad01f1/build/CMakeFiles 21 [ 18%] Building CXX object libgrive/CMakeFiles/grive.dir/src/http/Download.cc.o cd /tmp/B.11768d68-f687-4fb4-b2e6-4375e66ba793/BUILD/grive-27817e835fe115ebbda5410ec904aa49a2ad01f1/build/libgrive && /usr/bin/i486-pld-linux-g++ -DHAVE_BFD -DSRC_DIR=\"/tmp/B.11768d68-f687-4fb4-b2e6-4375e66ba793/BUILD/grive-27817e835fe115ebbda5410ec904aa49a2ad01f1/libgrive/src\" -DTEST_DATA=\"/tmp/B.11768d68-f687-4fb4-b2e6-4375e66ba793/BUILD/grive-27817e835fe115ebbda5410ec904aa49a2ad01f1/libgrive/test/data/\" -DVERSION=\"0.3.0-pre\" -D_FILE_OFFSET_BITS=64 -O2 -fwrapv -pipe -Wformat -Werror=format-security -gdwarf-4 -fno-debug-types-section -fvar-tracking-assignments -g2 -Wp,-D_FORTIFY_SOURCE=2 -fstack-protector --param=ssp-buffer-size=4 -fomit-frame-pointer -march=i486 -fasynchronous-unwind-tables -gdwarf-4 -fno-debug-types-section -fvar-tracking-assignments -g2 -DNDEBUG -DQT_NO_DEBUG -I/tmp/B.11768d68-f687-4fb4-b2e6-4375e66ba793/BUILD/grive-27817e835fe115ebbda5410ec904aa49a2ad01f1/libgrive/src -I/tmp/B.11768d68-f687-4fb4-b2e6-4375e66ba793/BUILD/grive-27817e835fe115ebbda5410ec904aa49a2ad01f1/libgrive/test -o CMakeFiles/grive.dir/src/http/Download.cc.o -c /tmp/B.11768d68-f687-4fb4-b2e6-4375e66ba793/BUILD/grive-27817e835fe115ebbda5410ec904aa49a2ad01f1/libgrive/src/http/Download.cc make[2]: Leaving directory '/tmp/B.11768d68-f687-4fb4-b2e6-4375e66ba793/BUILD/grive-27817e835fe115ebbda5410ec904aa49a2ad01f1/build' make[2]: Entering directory '/tmp/B.11768d68-f687-4fb4-b2e6-4375e66ba793/BUILD/grive-27817e835fe115ebbda5410ec904aa49a2ad01f1/build' /usr/bin/cmake -E cmake_progress_report /tmp/B.11768d68-f687-4fb4-b2e6-4375e66ba793/BUILD/grive-27817e835fe115ebbda5410ec904aa49a2ad01f1/build/CMakeFiles 22 [ 19%] Building CXX object libgrive/CMakeFiles/grive.dir/src/http/Header.cc.o cd /tmp/B.11768d68-f687-4fb4-b2e6-4375e66ba793/BUILD/grive-27817e835fe115ebbda5410ec904aa49a2ad01f1/build/libgrive && /usr/bin/i486-pld-linux-g++ -DHAVE_BFD -DSRC_DIR=\"/tmp/B.11768d68-f687-4fb4-b2e6-4375e66ba793/BUILD/grive-27817e835fe115ebbda5410ec904aa49a2ad01f1/libgrive/src\" -DTEST_DATA=\"/tmp/B.11768d68-f687-4fb4-b2e6-4375e66ba793/BUILD/grive-27817e835fe115ebbda5410ec904aa49a2ad01f1/libgrive/test/data/\" -DVERSION=\"0.3.0-pre\" -D_FILE_OFFSET_BITS=64 -O2 -fwrapv -pipe -Wformat -Werror=format-security -gdwarf-4 -fno-debug-types-section -fvar-tracking-assignments -g2 -Wp,-D_FORTIFY_SOURCE=2 -fstack-protector --param=ssp-buffer-size=4 -fomit-frame-pointer -march=i486 -fasynchronous-unwind-tables -gdwarf-4 -fno-debug-types-section -fvar-tracking-assignments -g2 -DNDEBUG -DQT_NO_DEBUG -I/tmp/B.11768d68-f687-4fb4-b2e6-4375e66ba793/BUILD/grive-27817e835fe115ebbda5410ec904aa49a2ad01f1/libgrive/src -I/tmp/B.11768d68-f687-4fb4-b2e6-4375e66ba793/BUILD/grive-27817e835fe115ebbda5410ec904aa49a2ad01f1/libgrive/test -o CMakeFiles/grive.dir/src/http/Header.cc.o -c /tmp/B.11768d68-f687-4fb4-b2e6-4375e66ba793/BUILD/grive-27817e835fe115ebbda5410ec904aa49a2ad01f1/libgrive/src/http/Header.cc make[2]: Leaving directory '/tmp/B.11768d68-f687-4fb4-b2e6-4375e66ba793/BUILD/grive-27817e835fe115ebbda5410ec904aa49a2ad01f1/build' make[2]: Entering directory '/tmp/B.11768d68-f687-4fb4-b2e6-4375e66ba793/BUILD/grive-27817e835fe115ebbda5410ec904aa49a2ad01f1/build' /usr/bin/cmake -E cmake_progress_report /tmp/B.11768d68-f687-4fb4-b2e6-4375e66ba793/BUILD/grive-27817e835fe115ebbda5410ec904aa49a2ad01f1/build/CMakeFiles 24 [ 22%] Building CXX object libgrive/CMakeFiles/grive.dir/src/http/StringResponse.cc.o cd /tmp/B.11768d68-f687-4fb4-b2e6-4375e66ba793/BUILD/grive-27817e835fe115ebbda5410ec904aa49a2ad01f1/build/libgrive && /usr/bin/i486-pld-linux-g++ -DHAVE_BFD -DSRC_DIR=\"/tmp/B.11768d68-f687-4fb4-b2e6-4375e66ba793/BUILD/grive-27817e835fe115ebbda5410ec904aa49a2ad01f1/libgrive/src\" -DTEST_DATA=\"/tmp/B.11768d68-f687-4fb4-b2e6-4375e66ba793/BUILD/grive-27817e835fe115ebbda5410ec904aa49a2ad01f1/libgrive/test/data/\" -DVERSION=\"0.3.0-pre\" -D_FILE_OFFSET_BITS=64 -O2 -fwrapv -pipe -Wformat -Werror=format-security -gdwarf-4 -fno-debug-types-section -fvar-tracking-assignments -g2 -Wp,-D_FORTIFY_SOURCE=2 -fstack-protector --param=ssp-buffer-size=4 -fomit-frame-pointer -march=i486 -fasynchronous-unwind-tables -gdwarf-4 -fno-debug-types-section -fvar-tracking-assignments -g2 -DNDEBUG -DQT_NO_DEBUG -I/tmp/B.11768d68-f687-4fb4-b2e6-4375e66ba793/BUILD/grive-27817e835fe115ebbda5410ec904aa49a2ad01f1/libgrive/src -I/tmp/B.11768d68-f687-4fb4-b2e6-4375e66ba793/BUILD/grive-27817e835fe115ebbda5410ec904aa49a2ad01f1/libgrive/test -o CMakeFiles/grive.dir/src/http/StringResponse.cc.o -c /tmp/B.11768d68-f687-4fb4-b2e6-4375e66ba793/BUILD/grive-27817e835fe115ebbda5410ec904aa49a2ad01f1/libgrive/src/http/StringResponse.cc make[2]: Leaving directory '/tmp/B.11768d68-f687-4fb4-b2e6-4375e66ba793/BUILD/grive-27817e835fe115ebbda5410ec904aa49a2ad01f1/build' make[2]: Entering directory '/tmp/B.11768d68-f687-4fb4-b2e6-4375e66ba793/BUILD/grive-27817e835fe115ebbda5410ec904aa49a2ad01f1/build' /usr/bin/cmake -E cmake_progress_report /tmp/B.11768d68-f687-4fb4-b2e6-4375e66ba793/BUILD/grive-27817e835fe115ebbda5410ec904aa49a2ad01f1/build/CMakeFiles 17 [ 12%] Building CXX object libgrive/CMakeFiles/grive.dir/src/drive2/Drive.cc.o cd /tmp/B.11768d68-f687-4fb4-b2e6-4375e66ba793/BUILD/grive-27817e835fe115ebbda5410ec904aa49a2ad01f1/build/libgrive && /usr/bin/i486-pld-linux-g++ -DHAVE_BFD -DSRC_DIR=\"/tmp/B.11768d68-f687-4fb4-b2e6-4375e66ba793/BUILD/grive-27817e835fe115ebbda5410ec904aa49a2ad01f1/libgrive/src\" -DTEST_DATA=\"/tmp/B.11768d68-f687-4fb4-b2e6-4375e66ba793/BUILD/grive-27817e835fe115ebbda5410ec904aa49a2ad01f1/libgrive/test/data/\" -DVERSION=\"0.3.0-pre\" -D_FILE_OFFSET_BITS=64 -O2 -fwrapv -pipe -Wformat -Werror=format-security -gdwarf-4 -fno-debug-types-section -fvar-tracking-assignments -g2 -Wp,-D_FORTIFY_SOURCE=2 -fstack-protector --param=ssp-buffer-size=4 -fomit-frame-pointer -march=i486 -fasynchronous-unwind-tables -gdwarf-4 -fno-debug-types-section -fvar-tracking-assignments -g2 -DNDEBUG -DQT_NO_DEBUG -I/tmp/B.11768d68-f687-4fb4-b2e6-4375e66ba793/BUILD/grive-27817e835fe115ebbda5410ec904aa49a2ad01f1/libgrive/src -I/tmp/B.11768d68-f687-4fb4-b2e6-4375e66ba793/BUILD/grive-27817e835fe115ebbda5410ec904aa49a2ad01f1/libgrive/test -o CMakeFiles/grive.dir/src/drive2/Drive.cc.o -c /tmp/B.11768d68-f687-4fb4-b2e6-4375e66ba793/BUILD/grive-27817e835fe115ebbda5410ec904aa49a2ad01f1/libgrive/src/drive2/Drive.cc make[2]: Leaving directory '/tmp/B.11768d68-f687-4fb4-b2e6-4375e66ba793/BUILD/grive-27817e835fe115ebbda5410ec904aa49a2ad01f1/build' make[2]: Entering directory '/tmp/B.11768d68-f687-4fb4-b2e6-4375e66ba793/BUILD/grive-27817e835fe115ebbda5410ec904aa49a2ad01f1/build' /usr/bin/cmake -E cmake_progress_report /tmp/B.11768d68-f687-4fb4-b2e6-4375e66ba793/BUILD/grive-27817e835fe115ebbda5410ec904aa49a2ad01f1/build/CMakeFiles 13 [ 10%] Building CXX object libgrive/CMakeFiles/grive.dir/src/drive/Feed.cc.o cd /tmp/B.11768d68-f687-4fb4-b2e6-4375e66ba793/BUILD/grive-27817e835fe115ebbda5410ec904aa49a2ad01f1/build/libgrive && /usr/bin/i486-pld-linux-g++ -DHAVE_BFD -DSRC_DIR=\"/tmp/B.11768d68-f687-4fb4-b2e6-4375e66ba793/BUILD/grive-27817e835fe115ebbda5410ec904aa49a2ad01f1/libgrive/src\" -DTEST_DATA=\"/tmp/B.11768d68-f687-4fb4-b2e6-4375e66ba793/BUILD/grive-27817e835fe115ebbda5410ec904aa49a2ad01f1/libgrive/test/data/\" -DVERSION=\"0.3.0-pre\" -D_FILE_OFFSET_BITS=64 -O2 -fwrapv -pipe -Wformat -Werror=format-security -gdwarf-4 -fno-debug-types-section -fvar-tracking-assignments -g2 -Wp,-D_FORTIFY_SOURCE=2 -fstack-protector --param=ssp-buffer-size=4 -fomit-frame-pointer -march=i486 -fasynchronous-unwind-tables -gdwarf-4 -fno-debug-types-section -fvar-tracking-assignments -g2 -DNDEBUG -DQT_NO_DEBUG -I/tmp/B.11768d68-f687-4fb4-b2e6-4375e66ba793/BUILD/grive-27817e835fe115ebbda5410ec904aa49a2ad01f1/libgrive/src -I/tmp/B.11768d68-f687-4fb4-b2e6-4375e66ba793/BUILD/grive-27817e835fe115ebbda5410ec904aa49a2ad01f1/libgrive/test -o CMakeFiles/grive.dir/src/drive/Feed.cc.o -c /tmp/B.11768d68-f687-4fb4-b2e6-4375e66ba793/BUILD/grive-27817e835fe115ebbda5410ec904aa49a2ad01f1/libgrive/src/drive/Feed.cc make[2]: Leaving directory '/tmp/B.11768d68-f687-4fb4-b2e6-4375e66ba793/BUILD/grive-27817e835fe115ebbda5410ec904aa49a2ad01f1/build' make[2]: Entering directory '/tmp/B.11768d68-f687-4fb4-b2e6-4375e66ba793/BUILD/grive-27817e835fe115ebbda5410ec904aa49a2ad01f1/build' /usr/bin/cmake -E cmake_progress_report /tmp/B.11768d68-f687-4fb4-b2e6-4375e66ba793/BUILD/grive-27817e835fe115ebbda5410ec904aa49a2ad01f1/build/CMakeFiles 25 [ 24%] Building CXX object libgrive/CMakeFiles/grive.dir/src/http/XmlResponse.cc.o cd /tmp/B.11768d68-f687-4fb4-b2e6-4375e66ba793/BUILD/grive-27817e835fe115ebbda5410ec904aa49a2ad01f1/build/libgrive && /usr/bin/i486-pld-linux-g++ -DHAVE_BFD -DSRC_DIR=\"/tmp/B.11768d68-f687-4fb4-b2e6-4375e66ba793/BUILD/grive-27817e835fe115ebbda5410ec904aa49a2ad01f1/libgrive/src\" -DTEST_DATA=\"/tmp/B.11768d68-f687-4fb4-b2e6-4375e66ba793/BUILD/grive-27817e835fe115ebbda5410ec904aa49a2ad01f1/libgrive/test/data/\" -DVERSION=\"0.3.0-pre\" -D_FILE_OFFSET_BITS=64 -O2 -fwrapv -pipe -Wformat -Werror=format-security -gdwarf-4 -fno-debug-types-section -fvar-tracking-assignments -g2 -Wp,-D_FORTIFY_SOURCE=2 -fstack-protector --param=ssp-buffer-size=4 -fomit-frame-pointer -march=i486 -fasynchronous-unwind-tables -gdwarf-4 -fno-debug-types-section -fvar-tracking-assignments -g2 -DNDEBUG -DQT_NO_DEBUG -I/tmp/B.11768d68-f687-4fb4-b2e6-4375e66ba793/BUILD/grive-27817e835fe115ebbda5410ec904aa49a2ad01f1/libgrive/src -I/tmp/B.11768d68-f687-4fb4-b2e6-4375e66ba793/BUILD/grive-27817e835fe115ebbda5410ec904aa49a2ad01f1/libgrive/test -o CMakeFiles/grive.dir/src/http/XmlResponse.cc.o -c /tmp/B.11768d68-f687-4fb4-b2e6-4375e66ba793/BUILD/grive-27817e835fe115ebbda5410ec904aa49a2ad01f1/libgrive/src/http/XmlResponse.cc make[2]: Leaving directory '/tmp/B.11768d68-f687-4fb4-b2e6-4375e66ba793/BUILD/grive-27817e835fe115ebbda5410ec904aa49a2ad01f1/build' make[2]: Entering directory '/tmp/B.11768d68-f687-4fb4-b2e6-4375e66ba793/BUILD/grive-27817e835fe115ebbda5410ec904aa49a2ad01f1/build' /usr/bin/cmake -E cmake_progress_report /tmp/B.11768d68-f687-4fb4-b2e6-4375e66ba793/BUILD/grive-27817e835fe115ebbda5410ec904aa49a2ad01f1/build/CMakeFiles 27 [ 27%] Building CXX object libgrive/CMakeFiles/grive.dir/src/protocol/Json.cc.o cd /tmp/B.11768d68-f687-4fb4-b2e6-4375e66ba793/BUILD/grive-27817e835fe115ebbda5410ec904aa49a2ad01f1/build/libgrive && /usr/bin/i486-pld-linux-g++ -DHAVE_BFD -DSRC_DIR=\"/tmp/B.11768d68-f687-4fb4-b2e6-4375e66ba793/BUILD/grive-27817e835fe115ebbda5410ec904aa49a2ad01f1/libgrive/src\" -DTEST_DATA=\"/tmp/B.11768d68-f687-4fb4-b2e6-4375e66ba793/BUILD/grive-27817e835fe115ebbda5410ec904aa49a2ad01f1/libgrive/test/data/\" -DVERSION=\"0.3.0-pre\" -D_FILE_OFFSET_BITS=64 -O2 -fwrapv -pipe -Wformat -Werror=format-security -gdwarf-4 -fno-debug-types-section -fvar-tracking-assignments -g2 -Wp,-D_FORTIFY_SOURCE=2 -fstack-protector --param=ssp-buffer-size=4 -fomit-frame-pointer -march=i486 -fasynchronous-unwind-tables -gdwarf-4 -fno-debug-types-section -fvar-tracking-assignments -g2 -DNDEBUG -DQT_NO_DEBUG -I/tmp/B.11768d68-f687-4fb4-b2e6-4375e66ba793/BUILD/grive-27817e835fe115ebbda5410ec904aa49a2ad01f1/libgrive/src -I/tmp/B.11768d68-f687-4fb4-b2e6-4375e66ba793/BUILD/grive-27817e835fe115ebbda5410ec904aa49a2ad01f1/libgrive/test -o CMakeFiles/grive.dir/src/protocol/Json.cc.o -c /tmp/B.11768d68-f687-4fb4-b2e6-4375e66ba793/BUILD/grive-27817e835fe115ebbda5410ec904aa49a2ad01f1/libgrive/src/protocol/Json.cc /tmp/B.11768d68-f687-4fb4-b2e6-4375e66ba793/BUILD/grive-27817e835fe115ebbda5410ec904aa49a2ad01f1/libgrive/src/protocol/Json.cc:32:31: fatal error: json/json_tokener.h: No such file or directory #include <json/json_tokener.h> ^ compilation terminated. libgrive/CMakeFiles/grive.dir/build.make:448: recipe for target 'libgrive/CMakeFiles/grive.dir/src/protocol/Json.cc.o' failed make[2]: *** [libgrive/CMakeFiles/grive.dir/src/protocol/Json.cc.o] Error 1 make[2]: Leaving directory '/tmp/B.11768d68-f687-4fb4-b2e6-4375e66ba793/BUILD/grive-27817e835fe115ebbda5410ec904aa49a2ad01f1/build' make[2]: *** Waiting for unfinished jobs.... make[2]: Entering directory '/tmp/B.11768d68-f687-4fb4-b2e6-4375e66ba793/BUILD/grive-27817e835fe115ebbda5410ec904aa49a2ad01f1/build' /usr/bin/cmake -E cmake_progress_report /tmp/B.11768d68-f687-4fb4-b2e6-4375e66ba793/BUILD/grive-27817e835fe115ebbda5410ec904aa49a2ad01f1/build/CMakeFiles 15 [ 3%] Building CXX object libgrive/CMakeFiles/grive.dir/src/drive/ResourceTree.cc.o cd /tmp/B.11768d68-f687-4fb4-b2e6-4375e66ba793/BUILD/grive-27817e835fe115ebbda5410ec904aa49a2ad01f1/build/libgrive && /usr/bin/i486-pld-linux-g++ -DHAVE_BFD -DSRC_DIR=\"/tmp/B.11768d68-f687-4fb4-b2e6-4375e66ba793/BUILD/grive-27817e835fe115ebbda5410ec904aa49a2ad01f1/libgrive/src\" -DTEST_DATA=\"/tmp/B.11768d68-f687-4fb4-b2e6-4375e66ba793/BUILD/grive-27817e835fe115ebbda5410ec904aa49a2ad01f1/libgrive/test/data/\" -DVERSION=\"0.3.0-pre\" -D_FILE_OFFSET_BITS=64 -O2 -fwrapv -pipe -Wformat -Werror=format-security -gdwarf-4 -fno-debug-types-section -fvar-tracking-assignments -g2 -Wp,-D_FORTIFY_SOURCE=2 -fstack-protector --param=ssp-buffer-size=4 -fomit-frame-pointer -march=i486 -fasynchronous-unwind-tables -gdwarf-4 -fno-debug-types-section -fvar-tracking-assignments -g2 -DNDEBUG -DQT_NO_DEBUG -I/tmp/B.11768d68-f687-4fb4-b2e6-4375e66ba793/BUILD/grive-27817e835fe115ebbda5410ec904aa49a2ad01f1/libgrive/src -I/tmp/B.11768d68-f687-4fb4-b2e6-4375e66ba793/BUILD/grive-27817e835fe115ebbda5410ec904aa49a2ad01f1/libgrive/test -o CMakeFiles/grive.dir/src/drive/ResourceTree.cc.o -c /tmp/B.11768d68-f687-4fb4-b2e6-4375e66ba793/BUILD/grive-27817e835fe115ebbda5410ec904aa49a2ad01f1/libgrive/src/drive/ResourceTree.cc make[2]: Leaving directory '/tmp/B.11768d68-f687-4fb4-b2e6-4375e66ba793/BUILD/grive-27817e835fe115ebbda5410ec904aa49a2ad01f1/build' make[2]: Entering directory '/tmp/B.11768d68-f687-4fb4-b2e6-4375e66ba793/BUILD/grive-27817e835fe115ebbda5410ec904aa49a2ad01f1/build' /usr/bin/cmake -E cmake_progress_report /tmp/B.11768d68-f687-4fb4-b2e6-4375e66ba793/BUILD/grive-27817e835fe115ebbda5410ec904aa49a2ad01f1/build/CMakeFiles 28 [ 28%] Building CXX object libgrive/CMakeFiles/grive.dir/src/protocol/JsonResponse.cc.o cd /tmp/B.11768d68-f687-4fb4-b2e6-4375e66ba793/BUILD/grive-27817e835fe115ebbda5410ec904aa49a2ad01f1/build/libgrive && /usr/bin/i486-pld-linux-g++ -DHAVE_BFD -DSRC_DIR=\"/tmp/B.11768d68-f687-4fb4-b2e6-4375e66ba793/BUILD/grive-27817e835fe115ebbda5410ec904aa49a2ad01f1/libgrive/src\" -DTEST_DATA=\"/tmp/B.11768d68-f687-4fb4-b2e6-4375e66ba793/BUILD/grive-27817e835fe115ebbda5410ec904aa49a2ad01f1/libgrive/test/data/\" -DVERSION=\"0.3.0-pre\" -D_FILE_OFFSET_BITS=64 -O2 -fwrapv -pipe -Wformat -Werror=format-security -gdwarf-4 -fno-debug-types-section -fvar-tracking-assignments -g2 -Wp,-D_FORTIFY_SOURCE=2 -fstack-protector --param=ssp-buffer-size=4 -fomit-frame-pointer -march=i486 -fasynchronous-unwind-tables -gdwarf-4 -fno-debug-types-section -fvar-tracking-assignments -g2 -DNDEBUG -DQT_NO_DEBUG -I/tmp/B.11768d68-f687-4fb4-b2e6-4375e66ba793/BUILD/grive-27817e835fe115ebbda5410ec904aa49a2ad01f1/libgrive/src -I/tmp/B.11768d68-f687-4fb4-b2e6-4375e66ba793/BUILD/grive-27817e835fe115ebbda5410ec904aa49a2ad01f1/libgrive/test -o CMakeFiles/grive.dir/src/protocol/JsonResponse.cc.o -c /tmp/B.11768d68-f687-4fb4-b2e6-4375e66ba793/BUILD/grive-27817e835fe115ebbda5410ec904aa49a2ad01f1/libgrive/src/protocol/JsonResponse.cc make[2]: Leaving directory '/tmp/B.11768d68-f687-4fb4-b2e6-4375e66ba793/BUILD/grive-27817e835fe115ebbda5410ec904aa49a2ad01f1/build' make[2]: Entering directory '/tmp/B.11768d68-f687-4fb4-b2e6-4375e66ba793/BUILD/grive-27817e835fe115ebbda5410ec904aa49a2ad01f1/build' /usr/bin/cmake -E cmake_progress_report /tmp/B.11768d68-f687-4fb4-b2e6-4375e66ba793/BUILD/grive-27817e835fe115ebbda5410ec904aa49a2ad01f1/build/CMakeFiles 14 [ 6%] Building CXX object libgrive/CMakeFiles/grive.dir/src/drive/Resource.cc.o cd /tmp/B.11768d68-f687-4fb4-b2e6-4375e66ba793/BUILD/grive-27817e835fe115ebbda5410ec904aa49a2ad01f1/build/libgrive && /usr/bin/i486-pld-linux-g++ -DHAVE_BFD -DSRC_DIR=\"/tmp/B.11768d68-f687-4fb4-b2e6-4375e66ba793/BUILD/grive-27817e835fe115ebbda5410ec904aa49a2ad01f1/libgrive/src\" -DTEST_DATA=\"/tmp/B.11768d68-f687-4fb4-b2e6-4375e66ba793/BUILD/grive-27817e835fe115ebbda5410ec904aa49a2ad01f1/libgrive/test/data/\" -DVERSION=\"0.3.0-pre\" -D_FILE_OFFSET_BITS=64 -O2 -fwrapv -pipe -Wformat -Werror=format-security -gdwarf-4 -fno-debug-types-section -fvar-tracking-assignments -g2 -Wp,-D_FORTIFY_SOURCE=2 -fstack-protector --param=ssp-buffer-size=4 -fomit-frame-pointer -march=i486 -fasynchronous-unwind-tables -gdwarf-4 -fno-debug-types-section -fvar-tracking-assignments -g2 -DNDEBUG -DQT_NO_DEBUG -I/tmp/B.11768d68-f687-4fb4-b2e6-4375e66ba793/BUILD/grive-27817e835fe115ebbda5410ec904aa49a2ad01f1/libgrive/src -I/tmp/B.11768d68-f687-4fb4-b2e6-4375e66ba793/BUILD/grive-27817e835fe115ebbda5410ec904aa49a2ad01f1/libgrive/test -o CMakeFiles/grive.dir/src/drive/Resource.cc.o -c /tmp/B.11768d68-f687-4fb4-b2e6-4375e66ba793/BUILD/grive-27817e835fe115ebbda5410ec904aa49a2ad01f1/libgrive/src/drive/Resource.cc make[2]: Leaving directory '/tmp/B.11768d68-f687-4fb4-b2e6-4375e66ba793/BUILD/grive-27817e835fe115ebbda5410ec904aa49a2ad01f1/build' make[2]: Entering directory '/tmp/B.11768d68-f687-4fb4-b2e6-4375e66ba793/BUILD/grive-27817e835fe115ebbda5410ec904aa49a2ad01f1/build' /usr/bin/cmake -E cmake_progress_report /tmp/B.11768d68-f687-4fb4-b2e6-4375e66ba793/BUILD/grive-27817e835fe115ebbda5410ec904aa49a2ad01f1/build/CMakeFiles 16 [ 10%] Building CXX object libgrive/CMakeFiles/grive.dir/src/drive/State.cc.o cd /tmp/B.11768d68-f687-4fb4-b2e6-4375e66ba793/BUILD/grive-27817e835fe115ebbda5410ec904aa49a2ad01f1/build/libgrive && /usr/bin/i486-pld-linux-g++ -DHAVE_BFD -DSRC_DIR=\"/tmp/B.11768d68-f687-4fb4-b2e6-4375e66ba793/BUILD/grive-27817e835fe115ebbda5410ec904aa49a2ad01f1/libgrive/src\" -DTEST_DATA=\"/tmp/B.11768d68-f687-4fb4-b2e6-4375e66ba793/BUILD/grive-27817e835fe115ebbda5410ec904aa49a2ad01f1/libgrive/test/data/\" -DVERSION=\"0.3.0-pre\" -D_FILE_OFFSET_BITS=64 -O2 -fwrapv -pipe -Wformat -Werror=format-security -gdwarf-4 -fno-debug-types-section -fvar-tracking-assignments -g2 -Wp,-D_FORTIFY_SOURCE=2 -fstack-protector --param=ssp-buffer-size=4 -fomit-frame-pointer -march=i486 -fasynchronous-unwind-tables -gdwarf-4 -fno-debug-types-section -fvar-tracking-assignments -g2 -DNDEBUG -DQT_NO_DEBUG -I/tmp/B.11768d68-f687-4fb4-b2e6-4375e66ba793/BUILD/grive-27817e835fe115ebbda5410ec904aa49a2ad01f1/libgrive/src -I/tmp/B.11768d68-f687-4fb4-b2e6-4375e66ba793/BUILD/grive-27817e835fe115ebbda5410ec904aa49a2ad01f1/libgrive/test -o CMakeFiles/grive.dir/src/drive/State.cc.o -c /tmp/B.11768d68-f687-4fb4-b2e6-4375e66ba793/BUILD/grive-27817e835fe115ebbda5410ec904aa49a2ad01f1/libgrive/src/drive/State.cc make[2]: Leaving directory '/tmp/B.11768d68-f687-4fb4-b2e6-4375e66ba793/BUILD/grive-27817e835fe115ebbda5410ec904aa49a2ad01f1/build' make[2]: Entering directory '/tmp/B.11768d68-f687-4fb4-b2e6-4375e66ba793/BUILD/grive-27817e835fe115ebbda5410ec904aa49a2ad01f1/build' /usr/bin/cmake -E cmake_progress_report /tmp/B.11768d68-f687-4fb4-b2e6-4375e66ba793/BUILD/grive-27817e835fe115ebbda5410ec904aa49a2ad01f1/build/CMakeFiles 11 [ 7%] Building CXX object libgrive/CMakeFiles/grive.dir/src/drive/Drive.cc.o cd /tmp/B.11768d68-f687-4fb4-b2e6-4375e66ba793/BUILD/grive-27817e835fe115ebbda5410ec904aa49a2ad01f1/build/libgrive && /usr/bin/i486-pld-linux-g++ -DHAVE_BFD -DSRC_DIR=\"/tmp/B.11768d68-f687-4fb4-b2e6-4375e66ba793/BUILD/grive-27817e835fe115ebbda5410ec904aa49a2ad01f1/libgrive/src\" -DTEST_DATA=\"/tmp/B.11768d68-f687-4fb4-b2e6-4375e66ba793/BUILD/grive-27817e835fe115ebbda5410ec904aa49a2ad01f1/libgrive/test/data/\" -DVERSION=\"0.3.0-pre\" -D_FILE_OFFSET_BITS=64 -O2 -fwrapv -pipe -Wformat -Werror=format-security -gdwarf-4 -fno-debug-types-section -fvar-tracking-assignments -g2 -Wp,-D_FORTIFY_SOURCE=2 -fstack-protector --param=ssp-buffer-size=4 -fomit-frame-pointer -march=i486 -fasynchronous-unwind-tables -gdwarf-4 -fno-debug-types-section -fvar-tracking-assignments -g2 -DNDEBUG -DQT_NO_DEBUG -I/tmp/B.11768d68-f687-4fb4-b2e6-4375e66ba793/BUILD/grive-27817e835fe115ebbda5410ec904aa49a2ad01f1/libgrive/src -I/tmp/B.11768d68-f687-4fb4-b2e6-4375e66ba793/BUILD/grive-27817e835fe115ebbda5410ec904aa49a2ad01f1/libgrive/test -o CMakeFiles/grive.dir/src/drive/Drive.cc.o -c /tmp/B.11768d68-f687-4fb4-b2e6-4375e66ba793/BUILD/grive-27817e835fe115ebbda5410ec904aa49a2ad01f1/libgrive/src/drive/Drive.cc make[2]: Leaving directory '/tmp/B.11768d68-f687-4fb4-b2e6-4375e66ba793/BUILD/grive-27817e835fe115ebbda5410ec904aa49a2ad01f1/build' make[2]: Entering directory '/tmp/B.11768d68-f687-4fb4-b2e6-4375e66ba793/BUILD/grive-27817e835fe115ebbda5410ec904aa49a2ad01f1/build' /usr/bin/cmake -E cmake_progress_report /tmp/B.11768d68-f687-4fb4-b2e6-4375e66ba793/BUILD/grive-27817e835fe115ebbda5410ec904aa49a2ad01f1/build/CMakeFiles 23 [ 21%] Building CXX object libgrive/CMakeFiles/grive.dir/src/http/ResponseLog.cc.o cd /tmp/B.11768d68-f687-4fb4-b2e6-4375e66ba793/BUILD/grive-27817e835fe115ebbda5410ec904aa49a2ad01f1/build/libgrive && /usr/bin/i486-pld-linux-g++ -DHAVE_BFD -DSRC_DIR=\"/tmp/B.11768d68-f687-4fb4-b2e6-4375e66ba793/BUILD/grive-27817e835fe115ebbda5410ec904aa49a2ad01f1/libgrive/src\" -DTEST_DATA=\"/tmp/B.11768d68-f687-4fb4-b2e6-4375e66ba793/BUILD/grive-27817e835fe115ebbda5410ec904aa49a2ad01f1/libgrive/test/data/\" -DVERSION=\"0.3.0-pre\" -D_FILE_OFFSET_BITS=64 -O2 -fwrapv -pipe -Wformat -Werror=format-security -gdwarf-4 -fno-debug-types-section -fvar-tracking-assignments -g2 -Wp,-D_FORTIFY_SOURCE=2 -fstack-protector --param=ssp-buffer-size=4 -fomit-frame-pointer -march=i486 -fasynchronous-unwind-tables -gdwarf-4 -fno-debug-types-section -fvar-tracking-assignments -g2 -DNDEBUG -DQT_NO_DEBUG -I/tmp/B.11768d68-f687-4fb4-b2e6-4375e66ba793/BUILD/grive-27817e835fe115ebbda5410ec904aa49a2ad01f1/libgrive/src -I/tmp/B.11768d68-f687-4fb4-b2e6-4375e66ba793/BUILD/grive-27817e835fe115ebbda5410ec904aa49a2ad01f1/libgrive/test -o CMakeFiles/grive.dir/src/http/ResponseLog.cc.o -c /tmp/B.11768d68-f687-4fb4-b2e6-4375e66ba793/BUILD/grive-27817e835fe115ebbda5410ec904aa49a2ad01f1/libgrive/src/http/ResponseLog.cc make[2]: Leaving directory '/tmp/B.11768d68-f687-4fb4-b2e6-4375e66ba793/BUILD/grive-27817e835fe115ebbda5410ec904aa49a2ad01f1/build' make[2]: Entering directory '/tmp/B.11768d68-f687-4fb4-b2e6-4375e66ba793/BUILD/grive-27817e835fe115ebbda5410ec904aa49a2ad01f1/build' /usr/bin/cmake -E cmake_progress_report /tmp/B.11768d68-f687-4fb4-b2e6-4375e66ba793/BUILD/grive-27817e835fe115ebbda5410ec904aa49a2ad01f1/build/CMakeFiles 20 [ 16%] Building CXX object libgrive/CMakeFiles/grive.dir/src/http/CurlAgent.cc.o cd /tmp/B.11768d68-f687-4fb4-b2e6-4375e66ba793/BUILD/grive-27817e835fe115ebbda5410ec904aa49a2ad01f1/build/libgrive && /usr/bin/i486-pld-linux-g++ -DHAVE_BFD -DSRC_DIR=\"/tmp/B.11768d68-f687-4fb4-b2e6-4375e66ba793/BUILD/grive-27817e835fe115ebbda5410ec904aa49a2ad01f1/libgrive/src\" -DTEST_DATA=\"/tmp/B.11768d68-f687-4fb4-b2e6-4375e66ba793/BUILD/grive-27817e835fe115ebbda5410ec904aa49a2ad01f1/libgrive/test/data/\" -DVERSION=\"0.3.0-pre\" -D_FILE_OFFSET_BITS=64 -O2 -fwrapv -pipe -Wformat -Werror=format-security -gdwarf-4 -fno-debug-types-section -fvar-tracking-assignments -g2 -Wp,-D_FORTIFY_SOURCE=2 -fstack-protector --param=ssp-buffer-size=4 -fomit-frame-pointer -march=i486 -fasynchronous-unwind-tables -gdwarf-4 -fno-debug-types-section -fvar-tracking-assignments -g2 -DNDEBUG -DQT_NO_DEBUG -I/tmp/B.11768d68-f687-4fb4-b2e6-4375e66ba793/BUILD/grive-27817e835fe115ebbda5410ec904aa49a2ad01f1/libgrive/src -I/tmp/B.11768d68-f687-4fb4-b2e6-4375e66ba793/BUILD/grive-27817e835fe115ebbda5410ec904aa49a2ad01f1/libgrive/test -o CMakeFiles/grive.dir/src/http/CurlAgent.cc.o -c /tmp/B.11768d68-f687-4fb4-b2e6-4375e66ba793/BUILD/grive-27817e835fe115ebbda5410ec904aa49a2ad01f1/libgrive/src/http/CurlAgent.cc make[2]: Leaving directory '/tmp/B.11768d68-f687-4fb4-b2e6-4375e66ba793/BUILD/grive-27817e835fe115ebbda5410ec904aa49a2ad01f1/build' make[2]: Entering directory '/tmp/B.11768d68-f687-4fb4-b2e6-4375e66ba793/BUILD/grive-27817e835fe115ebbda5410ec904aa49a2ad01f1/build' /usr/bin/cmake -E cmake_progress_report /tmp/B.11768d68-f687-4fb4-b2e6-4375e66ba793/BUILD/grive-27817e835fe115ebbda5410ec904aa49a2ad01f1/build/CMakeFiles 26 [ 25%] Building CXX object libgrive/CMakeFiles/grive.dir/src/protocol/AuthAgent.cc.o cd /tmp/B.11768d68-f687-4fb4-b2e6-4375e66ba793/BUILD/grive-27817e835fe115ebbda5410ec904aa49a2ad01f1/build/libgrive && /usr/bin/i486-pld-linux-g++ -DHAVE_BFD -DSRC_DIR=\"/tmp/B.11768d68-f687-4fb4-b2e6-4375e66ba793/BUILD/grive-27817e835fe115ebbda5410ec904aa49a2ad01f1/libgrive/src\" -DTEST_DATA=\"/tmp/B.11768d68-f687-4fb4-b2e6-4375e66ba793/BUILD/grive-27817e835fe115ebbda5410ec904aa49a2ad01f1/libgrive/test/data/\" -DVERSION=\"0.3.0-pre\" -D_FILE_OFFSET_BITS=64 -O2 -fwrapv -pipe -Wformat -Werror=format-security -gdwarf-4 -fno-debug-types-section -fvar-tracking-assignments -g2 -Wp,-D_FORTIFY_SOURCE=2 -fstack-protector --param=ssp-buffer-size=4 -fomit-frame-pointer -march=i486 -fasynchronous-unwind-tables -gdwarf-4 -fno-debug-types-section -fvar-tracking-assignments -g2 -DNDEBUG -DQT_NO_DEBUG -I/tmp/B.11768d68-f687-4fb4-b2e6-4375e66ba793/BUILD/grive-27817e835fe115ebbda5410ec904aa49a2ad01f1/libgrive/src -I/tmp/B.11768d68-f687-4fb4-b2e6-4375e66ba793/BUILD/grive-27817e835fe115ebbda5410ec904aa49a2ad01f1/libgrive/test -o CMakeFiles/grive.dir/src/protocol/AuthAgent.cc.o -c /tmp/B.11768d68-f687-4fb4-b2e6-4375e66ba793/BUILD/grive-27817e835fe115ebbda5410ec904aa49a2ad01f1/libgrive/src/protocol/AuthAgent.cc make[2]: Leaving directory '/tmp/B.11768d68-f687-4fb4-b2e6-4375e66ba793/BUILD/grive-27817e835fe115ebbda5410ec904aa49a2ad01f1/build' CMakeFiles/Makefile2:117: recipe for target 'libgrive/CMakeFiles/grive.dir/all' failed make[1]: *** [libgrive/CMakeFiles/grive.dir/all] Error 2 Makefile:120: recipe for target 'all' failed make: *** [all] Error 2 error: Bad exit status from /tmp/B.11768d68-f687-4fb4-b2e6-4375e66ba793/BUILD/tmp/rpm-tmp.7955 (%build) RPM build errors: Bad exit status from /tmp/B.11768d68-f687-4fb4-b2e6-4375e66ba793/BUILD/tmp/rpm-tmp.7955 (%build) ended at: Tue Feb 17 23:01:13 2015, done in 0:00:25.282044 error: No files produced. + chmod -R u+rwX /tmp/B.11768d68-f687-4fb4-b2e6-4375e66ba793/BUILD + rm -rf /tmp/B.11768d68-f687-4fb4-b2e6-4375e66ba793/tmp /tmp/B.11768d68-f687-4fb4-b2e6-4375e66ba793/BUILD + rm -rf /tmp/B.11768d68-f687-4fb4-b2e6-4375e66ba793 Begin-PLD-Builder-Info Build-Time: user:93.09s sys:15.08s real:30.85s (faults io:24 non-io:946150) End-PLD-Builder-Info
[Back to list of logs] [View rpm -qa of builder]