FailedOk

th/SRPMS[OK]
th/x32[OK]
th/i686[OK]
th/x86_64[OK]

ac/SRPMS[OK]
ac/i386[OK]
ac/i586[OK]
ac/i686[OK]
ac/alpha[OK]
ac/amd64[OK]
ac/athlon[OK]
ac/ppc[OK]
ac/sparc[OK]
ac/sparc64[OK]

Advanced Search
main()
Powered by PLD Linux
(c) 2002-2021 PLD Team
$Revision: 1.37 $
Powered by Neo.
Your IP: 54.227.97.219

php-gtk2 a370d466-09aa-42f8-9483-2b4804246e9b

Status:Failed
Source URL:https://buildlogs.pld-linux.org/pld/th/i486/FAIL/php-gtk2,a370d466-09aa-42f8-9483-2b4804246e9b.bz2
text/plain URL:View!
full text:View!
rpm -qa of builder:View!
Date:2014/04/28 13:50:58
Runtime:0:00:08.962403

Toc:

  • error 1
  • /tmp/B.a2c7f57c-8c5f-4572-9e28-ff8281d6df1b/BUILD/php-gtk-2.0.2/main/php_gtk.h:323:75: error: unknown type name 'function_entry'
  • error 2
  • /tmp/B.a2c7f57c-8c5f-4572-9e28-ff8281d6df1b/BUILD/php-gtk-2.0.2/main/php_gtk.h:324:79: error: unknown type name 'function_entry'
  • error 3
  • /tmp/B.a2c7f57c-8c5f-4572-9e28-ff8281d6df1b/BUILD/php-gtk-2.0.2/main/php_gtk.h:506:75: error: unknown type name 'function_entry'
  • error 4
  • /tmp/B.a2c7f57c-8c5f-4572-9e28-ff8281d6df1b/BUILD/php-gtk-2.0.2/main/php_gtk.h:522:77: error: unknown type name 'function_entry'
  • error 5
  • Makefile:275: recipe for target 'ext/gtk+/php_gtk+.lo' failed
  • error 6
  • error: Bad exit status from /tmp/B.a2c7f57c-8c5f-4572-9e28-ff8281d6df1b/BUILD/tmp/rpm-tmp.51694 (%build)
  • error 7
  • RPM build errors:
  • error 8
  • error: No files produced.

Content:

checking for pkg-config... (cached) /usr/bin/pkg-config
checking for GTK+ - version >= 2.6.0... yes (version 2.24.23)
checking for atk >= 1.9.0... yes
checking ATK_CFLAGS... -I/usr/include/atk-1.0 -I/usr/include/glib-2.0 -I/usr/lib/glib-2.0/include 
checking ATK_LIBS... -latk-1.0 -lgobject-2.0 -lglib-2.0 
checking for pango >= 1.8.0... yes
checking PANGO_CFLAGS... -pthread -I/usr/include/pango-1.0 -I/usr/include/glib-2.0 -I/usr/lib/glib-2.0/include 
checking PANGO_LIBS... -lpango-1.0 -lm -lgobject-2.0 -lglib-2.0 
checking for cairo >= 1.4.0... yes
checking CAIRO_CFLAGS... -I/usr/include/cairo -I/usr/include/pixman-1 -I/usr/include/freetype2 -I/usr/include/libpng16 -I/usr/include/harfbuzz -I/usr/include/glib-2.0 -I/usr/lib/glib-2.0/include -I/usr/include/freetype2 -I/usr/include/harfbuzz -I/usr/include/glib-2.0 -I/usr/lib/glib-2.0/include -I/usr/include/libdrm -I/usr/include/libpng16 
checking CAIRO_LIBS... -lcairo 
checking for cairo php extension... yes
checking for gtkextra support... no
checking for html support... no
checking for libglade support... yes
checking for libglade-2.0 >= 2.4.0... yes
checking LIBGLADE_CFLAGS... -pthread -I/usr/include/libglade-2.0 -I/usr/include/gtk-2.0 -I/usr/lib/gtk-2.0/include -I/usr/include/pango-1.0 -I/usr/include/gio-unix-2.0/ -I/usr/include/cairo -I/usr/include/atk-1.0 -I/usr/include/cairo -I/usr/include/pixman-1 -I/usr/include/libdrm -I/usr/include/gdk-pixbuf-2.0 -I/usr/include/pango-1.0 -I/usr/include/freetype2 -I/usr/include/libpng16 -I/usr/include/harfbuzz -I/usr/include/glib-2.0 -I/usr/lib/glib-2.0/include -I/usr/include/freetype2 -I/usr/include/libpng16 -I/usr/include/harfbuzz -I/usr/include/glib-2.0 -I/usr/lib/glib-2.0/include -I/usr/include/libxml2 
checking LIBGLADE_LIBS... -lglade-2.0 -lgtk-x11-2.0 -lgdk-x11-2.0 -lpangocairo-1.0 -lgio-2.0 -lXrender -lXinerama -lXi -lXrandr -lXcursor -lXcomposite -lXdamage -lXfixes -lX11 -lXext -latk-1.0 -lcairo -lgdk_pixbuf-2.0 -lgio-2.0 -lpangoft2-1.0 -lpango-1.0 -lm -lgobject-2.0 -lglib-2.0 -lfontconfig -lfreetype -lxml2 
checking for libsexy support... no
checking for GtkMozEmbed support... no
checking for scintilla support... no
checking for sourceview support... no
checking for spell support... no
creating main/php_gtk_ext.c
checking how to print strings... print -r
checking for a sed that does not truncate output... (cached) /bin/sed
checking for fgrep... /bin/grep -F
checking for ld used by i486-pld-linux-gcc... /usr/bin/ld
checking if the linker (/usr/bin/ld) is GNU ld... yes
checking for BSD- or MS-compatible name lister (nm)... /usr/bin/nm -B
checking the name lister (/usr/bin/nm -B) interface... BSD nm
checking whether ln -s works... yes
checking the maximum length of command line arguments... 1572864
checking whether the shell understands some XSI constructs... yes
checking whether the shell understands "+="... yes
checking how to convert i486-pld-linux-gnu file names to i486-pld-linux-gnu format... func_convert_file_noop
checking how to convert i486-pld-linux-gnu file names to toolchain format... func_convert_file_noop
checking for /usr/bin/ld option to reload object files... -r
checking for i486-pld-linux-objdump... no
checking for objdump... objdump
checking how to recognize dependent libraries... pass_all
checking for i486-pld-linux-dlltool... no
checking for dlltool... no
checking how to associate runtime and link libraries... print -r --
checking for i486-pld-linux-ar... no
checking for ar... ar
checking for archiver @FILE support... @
checking for i486-pld-linux-strip... no
checking for strip... strip
checking for i486-pld-linux-ranlib... no
checking for ranlib... ranlib
checking command to parse /usr/bin/nm -B output from i486-pld-linux-gcc object... ok
checking for sysroot... no
checking for i486-pld-linux-mt... no
checking for mt... no
checking if : is a manifest tool... no
checking for ANSI C header files... yes
checking for sys/types.h... yes
checking for sys/stat.h... yes
checking for stdlib.h... yes
checking for string.h... yes
checking for memory.h... yes
checking for strings.h... yes
checking for inttypes.h... yes
checking for stdint.h... yes
checking for unistd.h... yes
checking for dlfcn.h... yes
checking for objdir... .libs
checking if i486-pld-linux-gcc supports -fno-rtti -fno-exceptions... no
checking for i486-pld-linux-gcc option to produce PIC... -fPIC -DPIC
checking if i486-pld-linux-gcc PIC flag -fPIC -DPIC works... yes
checking if i486-pld-linux-gcc static flag -static works... yes
checking if i486-pld-linux-gcc supports -c -o file.o... yes
checking if i486-pld-linux-gcc supports -c -o file.o... (cached) yes
checking whether the i486-pld-linux-gcc linker (/usr/bin/ld) supports shared libraries... yes
checking whether -lc should be explicitly linked in... no
checking dynamic linker characteristics... GNU/Linux ld.so
checking how to hardcode library paths into programs... immediate
checking whether stripping libraries is possible... yes
checking if libtool supports shared libraries... yes
checking whether to build shared libraries... yes
checking whether to build static libraries... no
checking how to run the C++ preprocessor... i486-pld-linux-g++ -E
checking whether the i486-pld-linux-g++ linker (/usr/bin/ld) supports shared libraries... yes
checking for i486-pld-linux-g++ option to produce PIC...  -DPIC
checking if i486-pld-linux-g++ PIC flag  -DPIC works... yes
checking if i486-pld-linux-g++ static flag  works... yes
checking if i486-pld-linux-g++ supports -c -o file.o... yes
checking if i486-pld-linux-g++ supports -c -o file.o... (cached) yes
checking whether the i486-pld-linux-g++ linker (/usr/bin/ld) supports shared libraries... yes
checking dynamic linker characteristics... (cached) GNU/Linux ld.so
checking how to hardcode library paths into programs... unsupported
configure: creating ./config.status
config.status: creating config.h
config.status: executing libtool commands
+ /usr/bin/make -j9 -j1
/bin/sh /tmp/B.a2c7f57c-8c5f-4572-9e28-ff8281d6df1b/BUILD/php-gtk-2.0.2/libtool --mode=compile i486-pld-linux-gcc  -I./ext/gtk+/ -I/tmp/B.a2c7f57c-8c5f-4572-9e28-ff8281d6df1b/BUILD/php-gtk-2.0.2/./ext/gtk+/ -DPHP_ATOM_INC -I/tmp/B.a2c7f57c-8c5f-4572-9e28-ff8281d6df1b/BUILD/php-gtk-2.0.2/include -I/tmp/B.a2c7f57c-8c5f-4572-9e28-ff8281d6df1b/BUILD/php-gtk-2.0.2/main -I/tmp/B.a2c7f57c-8c5f-4572-9e28-ff8281d6df1b/BUILD/php-gtk-2.0.2 -I/usr/include/php -I/usr/include/php/main -I/usr/include/php/TSRM -I/usr/include/php/Zend -I/usr/include/php/ext -I/usr/include/php/ext/date/lib -I/usr/include/glib-2.0 -I/usr/lib/glib-2.0/include -I/usr/include/gtk-2.0 -I/usr/lib/gtk-2.0/include -I/usr/include/pango-1.0 -I/usr/include/gio-unix-2.0/ -I/usr/include/cairo -I/usr/include/atk-1.0 -I/usr/include/pixman-1 -I/usr/include/libdrm -I/usr/include/gdk-pixbuf-2.0 -I/usr/include/freetype2 -I/usr/include/libpng16 -I/usr/include/harfbuzz -I/usr/include/php/ext/cairo -I/usr/include/libglade-2.0 -I/usr/include/libxml2  -DHAVE_CONFIG_H  -O2 -fwrapv -pipe -Wformat -Werror=format-security -gdwarf-4 -fno-debug-types-section -fvar-tracking-assignments -g2 -Wp,-D_FORTIFY_SOURCE=2 -fstack-protector --param=ssp-buffer-size=4 -fomit-frame-pointer -march=i486 -fasynchronous-unwind-tables -gdwarf-4 -fno-debug-types-section -fvar-tracking-assignments -g2   -c /tmp/B.a2c7f57c-8c5f-4572-9e28-ff8281d6df1b/BUILD/php-gtk-2.0.2/./ext/gtk+/php_gtk+.c -o ./ext/gtk+/php_gtk+.lo 
libtool: compile:  i486-pld-linux-gcc -I./ext/gtk+/ -I/tmp/B.a2c7f57c-8c5f-4572-9e28-ff8281d6df1b/BUILD/php-gtk-2.0.2/./ext/gtk+/ -DPHP_ATOM_INC -I/tmp/B.a2c7f57c-8c5f-4572-9e28-ff8281d6df1b/BUILD/php-gtk-2.0.2/include -I/tmp/B.a2c7f57c-8c5f-4572-9e28-ff8281d6df1b/BUILD/php-gtk-2.0.2/main -I/tmp/B.a2c7f57c-8c5f-4572-9e28-ff8281d6df1b/BUILD/php-gtk-2.0.2 -I/usr/include/php -I/usr/include/php/main -I/usr/include/php/TSRM -I/usr/include/php/Zend -I/usr/include/php/ext -I/usr/include/php/ext/date/lib -I/usr/include/glib-2.0 -I/usr/lib/glib-2.0/include -I/usr/include/gtk-2.0 -I/usr/lib/gtk-2.0/include -I/usr/include/pango-1.0 -I/usr/include/gio-unix-2.0/ -I/usr/include/cairo -I/usr/include/atk-1.0 -I/usr/include/pixman-1 -I/usr/include/libdrm -I/usr/include/gdk-pixbuf-2.0 -I/usr/include/freetype2 -I/usr/include/libpng16 -I/usr/include/harfbuzz -I/usr/include/php/ext/cairo -I/usr/include/libglade-2.0 -I/usr/include/libxml2 -DHAVE_CONFIG_H -O2 -fwrapv -pipe -Wformat -Werror=format-security -gdwarf-4 -fno-debug-types-section -fvar-tracking-assignments -g2 -Wp,-D_FORTIFY_SOURCE=2 -fstack-protector --param=ssp-buffer-size=4 -fomit-frame-pointer -march=i486 -fasynchronous-unwind-tables -gdwarf-4 -fno-debug-types-section -fvar-tracking-assignments -g2 -c /tmp/B.a2c7f57c-8c5f-4572-9e28-ff8281d6df1b/BUILD/php-gtk-2.0.2/./ext/gtk+/php_gtk+.c  -fPIC -DPIC -o ./ext/gtk+/.libs/php_gtk+.o
In file included from /tmp/B.a2c7f57c-8c5f-4572-9e28-ff8281d6df1b/BUILD/php-gtk-2.0.2/./ext/gtk+/php_gtk+.c:23:0:
/tmp/B.a2c7f57c-8c5f-4572-9e28-ff8281d6df1b/BUILD/php-gtk-2.0.2/main/php_gtk.h:323:75: error: unknown type name 'function_entry'
 PHP_GTK_API zend_class_entry* phpg_register_class(const char *class_name, function_entry *class_functions, zend_class_entry *parent, zend_uint ce_flags, prop_info_t *prop_info, create_object_func_t create_obj_func, GType gtype TSRMLS_DC);
                                                                           ^
In file included from /tmp/B.a2c7f57c-8c5f-4572-9e28-ff8281d6df1b/BUILD/php-gtk-2.0.2/./ext/gtk+/php_gtk+.c:23:0:
/tmp/B.a2c7f57c-8c5f-4572-9e28-ff8281d6df1b/BUILD/php-gtk-2.0.2/main/php_gtk.h:324:79: error: unknown type name 'function_entry'
 PHP_GTK_API zend_class_entry* phpg_register_interface(const char *iface_name, function_entry *iface_methods, GType gtype TSRMLS_DC);
                                                                               ^
/tmp/B.a2c7f57c-8c5f-4572-9e28-ff8281d6df1b/BUILD/php-gtk-2.0.2/main/php_gtk.h:506:75: error: unknown type name 'function_entry'
 PHP_GTK_API zend_class_entry* phpg_register_boxed(const char *class_name, function_entry *class_methods, prop_info_t *prop_info, create_object_func_t create_obj_func, GType gtype TSRMLS_DC);
                                                                           ^
/tmp/B.a2c7f57c-8c5f-4572-9e28-ff8281d6df1b/BUILD/php-gtk-2.0.2/main/php_gtk.h:522:77: error: unknown type name 'function_entry'
 PHP_GTK_API zend_class_entry* phpg_register_pointer(const char *class_name, function_entry *class_methods, create_object_func_t create_obj_func, GType gtype TSRMLS_DC);
                                                                             ^
Makefile:275: recipe for target 'ext/gtk+/php_gtk+.lo' failed
make: *** [ext/gtk+/php_gtk+.lo] Error 1
error: Bad exit status from /tmp/B.a2c7f57c-8c5f-4572-9e28-ff8281d6df1b/BUILD/tmp/rpm-tmp.51694 (%build)


RPM build errors:
    Bad exit status from /tmp/B.a2c7f57c-8c5f-4572-9e28-ff8281d6df1b/BUILD/tmp/rpm-tmp.51694 (%build)
ended at: Mon Apr 28 13:50:58 2014, done in 0:00:08.962403
error: No files produced.
+ chmod -R u+rwX /tmp/B.a2c7f57c-8c5f-4572-9e28-ff8281d6df1b/BUILD
+ rm -rf /tmp/B.a2c7f57c-8c5f-4572-9e28-ff8281d6df1b/tmp /tmp/B.a2c7f57c-8c5f-4572-9e28-ff8281d6df1b/BUILD
+ rm -rf /tmp/B.a2c7f57c-8c5f-4572-9e28-ff8281d6df1b
Begin-PLD-Builder-Info
Build-Time: user:12.97s sys:1.15s real:21.54s (faults io:22 non-io:992664)

End-PLD-Builder-Info
[Back to list of logs] [View rpm -qa of builder]