FailedOk

th/SRPMS[OK]
th/x32[OK]
th/i686[OK]
th/x86_64[OK]

ac/SRPMS[OK]
ac/i386[OK]
ac/i586[OK]
ac/i686[OK]
ac/alpha[OK]
ac/amd64[OK]
ac/athlon[OK]
ac/ppc[OK]
ac/sparc[OK]
ac/sparc64[OK]

Advanced Search
main()
Powered by PLD Linux
(c) 2002-2021 PLD Team
$Revision: 1.37 $
Powered by Real Operating System.
Your IP: 54.227.97.219

php-pecl-archive a370d466-09aa-42f8-9483-2b4804246e9b

Status:Failed
Source URL:https://buildlogs.pld-linux.org/pld/th/i486/FAIL/php-pecl-archive,a370d466-09aa-42f8-9483-2b4804246e9b.bz2
text/plain URL:View!
full text:View!
rpm -qa of builder:View!
Date:2014/04/28 14:13:29
Runtime:0:00:07.510204

Toc:

  • error 1
  • /tmp/B.cdf76908-70c1-463d-b0aa-aa86eb3926ab/BUILD/php-pecl-archive-0.2/archive_entry.c:33:1: error: unknown type name 'function_entry'
  • error 2
  • /tmp/B.cdf76908-70c1-463d-b0aa-aa86eb3926ab/BUILD/php-pecl-archive-0.2/archive.c:40:1: error: unknown type name 'function_entry'
  • error 3
  • /tmp/B.cdf76908-70c1-463d-b0aa-aa86eb3926ab/BUILD/php-pecl-archive-0.2/archive_writer.c:39:1: error: unknown type name 'function_entry'
  • error 4
  • /tmp/B.cdf76908-70c1-463d-b0aa-aa86eb3926ab/BUILD/php-pecl-archive-0.2/archive_reader.c:36:1: error: unknown type name 'function_entry'
  • error 5
  • /tmp/B.cdf76908-70c1-463d-b0aa-aa86eb3926ab/BUILD/php-pecl-archive-0.2/archive_writer.c:48:1: error: unknown type name 'function_entry'
  • error 6
  • /tmp/B.cdf76908-70c1-463d-b0aa-aa86eb3926ab/BUILD/php-pecl-archive-0.2/archive_reader.c:47:1: error: unknown type name 'function_entry'
  • error 7
  • /usr/include/php/main/php_globals.h:32:29: error: 'struct _php_core_globals' has no member named 'safe_mode'
  • error 8
  • /tmp/B.cdf76908-70c1-463d-b0aa-aa86eb3926ab/BUILD/php-pecl-archive-0.2/archive_writer.c:94:54: error: 'CHECKUID_CHECK_FILE_AND_DIR' undeclared (first use in this function)
  • error 9
  • /usr/include/php/main/php_globals.h:32:29: error: 'struct _php_core_globals' has no member named 'safe_mode'
  • error 10
  • /tmp/B.cdf76908-70c1-463d-b0aa-aa86eb3926ab/BUILD/php-pecl-archive-0.2/archive_entry.c:160:54: error: 'CHECKUID_CHECK_FILE_AND_DIR' undeclared (first use in this function)
  • error 11
  • Makefile:202: recipe for target 'archive.lo' failed
  • error 12
  • /usr/include/php/main/php_globals.h:32:29: error: 'struct _php_core_globals' has no member named 'safe_mode'
  • error 13
  • /tmp/B.cdf76908-70c1-463d-b0aa-aa86eb3926ab/BUILD/php-pecl-archive-0.2/archive_reader.c:95:54: error: 'CHECKUID_CHECK_FILE_AND_DIR' undeclared (first use in this function)
  • error 14
  • Makefile:206: recipe for target 'archive_writer.lo' failed
  • error 15
  • Makefile:210: recipe for target 'archive_entry.lo' failed
  • error 16
  • Makefile:204: recipe for target 'archive_reader.lo' failed
  • error 17
  • error: Bad exit status from /tmp/B.cdf76908-70c1-463d-b0aa-aa86eb3926ab/BUILD/tmp/rpm-tmp.65931 (%build)
  • error 18
  • RPM build errors:
  • error 19
  • error: No files produced.

Content:

checking for suncc... no
checking whether i486-pld-linux-gcc and cc understand -c and -o together... yes
checking for system library directory... lib
checking if compiler supports -R... no
checking if compiler supports -Wl,-rpath,... yes
checking build system type... i486-pld-linux-gnu
checking host system type... i486-pld-linux-gnu
checking target system type... i486-pld-linux-gnu
checking for PHP prefix... /usr
checking for PHP includes... -I/usr/include/php -I/usr/include/php/main -I/usr/include/php/TSRM -I/usr/include/php/Zend -I/usr/include/php/ext -I/usr/include/php/ext/date/lib
checking for PHP extension directory... /usr/lib/php
checking for PHP installed headers prefix... /usr/include/php
checking if debug is enabled... no
checking if zts is enabled... no
checking for re2c... re2c
checking for re2c version... 0.13.5 (ok)
checking for gawk... gawk
checking for tar/cpio support... yes, shared
checking for libarchive files in default path... found in /usr
checking for archive_read_new in -larchive... yes
checking how to print strings... print -r
checking for a sed that does not truncate output... (cached) /bin/sed
checking for fgrep... /bin/grep -F
checking for ld used by i486-pld-linux-gcc... /usr/bin/ld
checking if the linker (/usr/bin/ld) is GNU ld... yes
checking for BSD- or MS-compatible name lister (nm)... /usr/bin/nm -B
checking the name lister (/usr/bin/nm -B) interface... BSD nm
checking whether ln -s works... yes
checking the maximum length of command line arguments... 1572864
checking whether the shell understands some XSI constructs... yes
checking whether the shell understands "+="... yes
checking how to convert i486-pld-linux-gnu file names to i486-pld-linux-gnu format... func_convert_file_noop
checking how to convert i486-pld-linux-gnu file names to toolchain format... func_convert_file_noop
checking for /usr/bin/ld option to reload object files... -r
checking for i486-pld-linux-objdump... no
checking for objdump... objdump
checking how to recognize dependent libraries... pass_all
checking for i486-pld-linux-dlltool... no
checking for dlltool... no
checking how to associate runtime and link libraries... print -r --
checking for i486-pld-linux-ar... no
checking for ar... ar
checking for archiver @FILE support... @
checking for i486-pld-linux-strip... no
checking for strip... strip
checking for i486-pld-linux-ranlib... no
checking for ranlib... ranlib
checking for mawk... (cached) gawk
checking command to parse /usr/bin/nm -B output from i486-pld-linux-gcc object... ok
checking for sysroot... no
checking for i486-pld-linux-mt... no
checking for mt... no
checking if : is a manifest tool... no
checking for ANSI C header files... yes
checking for sys/types.h... yes
checking for sys/stat.h... yes
checking for stdlib.h... yes
checking for string.h... yes
checking for memory.h... yes
checking for strings.h... yes
checking for inttypes.h... yes
checking for stdint.h... yes
checking for unistd.h... yes
checking for dlfcn.h... yes
checking for objdir... .libs
checking if i486-pld-linux-gcc supports -fno-rtti -fno-exceptions... no
checking for i486-pld-linux-gcc option to produce PIC... -fPIC -DPIC
checking if i486-pld-linux-gcc PIC flag -fPIC -DPIC works... yes
checking if i486-pld-linux-gcc static flag -static works... yes
checking if i486-pld-linux-gcc supports -c -o file.o... yes
checking if i486-pld-linux-gcc supports -c -o file.o... (cached) yes
checking whether the i486-pld-linux-gcc linker (/usr/bin/ld) supports shared libraries... yes
checking whether -lc should be explicitly linked in... no
checking dynamic linker characteristics... GNU/Linux ld.so
checking how to hardcode library paths into programs... immediate
checking whether stripping libraries is possible... yes
checking if libtool supports shared libraries... yes
checking whether to build shared libraries... yes
checking whether to build static libraries... no
configure: creating ./config.status
config.status: creating config.h
config.status: executing libtool commands
+ /usr/bin/make -j9
/bin/sh /tmp/B.cdf76908-70c1-463d-b0aa-aa86eb3926ab/BUILD/php-pecl-archive-0.2/libtool --mode=compile i486-pld-linux-gcc  -I. -I/tmp/B.cdf76908-70c1-463d-b0aa-aa86eb3926ab/BUILD/php-pecl-archive-0.2 -DPHP_ATOM_INC -I/tmp/B.cdf76908-70c1-463d-b0aa-aa86eb3926ab/BUILD/php-pecl-archive-0.2/include -I/tmp/B.cdf76908-70c1-463d-b0aa-aa86eb3926ab/BUILD/php-pecl-archive-0.2/main -I/tmp/B.cdf76908-70c1-463d-b0aa-aa86eb3926ab/BUILD/php-pecl-archive-0.2 -I/usr/include/php -I/usr/include/php/main -I/usr/include/php/TSRM -I/usr/include/php/Zend -I/usr/include/php/ext -I/usr/include/php/ext/date/lib  -DHAVE_CONFIG_H  -O2 -fwrapv -pipe -Wformat -Werror=format-security -gdwarf-4 -fno-debug-types-section -fvar-tracking-assignments -g2 -Wp,-D_FORTIFY_SOURCE=2 -fstack-protector --param=ssp-buffer-size=4 -fomit-frame-pointer -march=i486 -fasynchronous-unwind-tables -gdwarf-4 -fno-debug-types-section -fvar-tracking-assignments -g2   -c /tmp/B.cdf76908-70c1-463d-b0aa-aa86eb3926ab/BUILD/php-pecl-archive-0.2/archive.c -o archive.lo 
/bin/sh /tmp/B.cdf76908-70c1-463d-b0aa-aa86eb3926ab/BUILD/php-pecl-archive-0.2/libtool --mode=compile i486-pld-linux-gcc  -I. -I/tmp/B.cdf76908-70c1-463d-b0aa-aa86eb3926ab/BUILD/php-pecl-archive-0.2 -DPHP_ATOM_INC -I/tmp/B.cdf76908-70c1-463d-b0aa-aa86eb3926ab/BUILD/php-pecl-archive-0.2/include -I/tmp/B.cdf76908-70c1-463d-b0aa-aa86eb3926ab/BUILD/php-pecl-archive-0.2/main -I/tmp/B.cdf76908-70c1-463d-b0aa-aa86eb3926ab/BUILD/php-pecl-archive-0.2 -I/usr/include/php -I/usr/include/php/main -I/usr/include/php/TSRM -I/usr/include/php/Zend -I/usr/include/php/ext -I/usr/include/php/ext/date/lib  -DHAVE_CONFIG_H  -O2 -fwrapv -pipe -Wformat -Werror=format-security -gdwarf-4 -fno-debug-types-section -fvar-tracking-assignments -g2 -Wp,-D_FORTIFY_SOURCE=2 -fstack-protector --param=ssp-buffer-size=4 -fomit-frame-pointer -march=i486 -fasynchronous-unwind-tables -gdwarf-4 -fno-debug-types-section -fvar-tracking-assignments -g2   -c /tmp/B.cdf76908-70c1-463d-b0aa-aa86eb3926ab/BUILD/php-pecl-archive-0.2/archive_reader.c -o archive_reader.lo 
/bin/sh /tmp/B.cdf76908-70c1-463d-b0aa-aa86eb3926ab/BUILD/php-pecl-archive-0.2/libtool --mode=compile i486-pld-linux-gcc  -I. -I/tmp/B.cdf76908-70c1-463d-b0aa-aa86eb3926ab/BUILD/php-pecl-archive-0.2 -DPHP_ATOM_INC -I/tmp/B.cdf76908-70c1-463d-b0aa-aa86eb3926ab/BUILD/php-pecl-archive-0.2/include -I/tmp/B.cdf76908-70c1-463d-b0aa-aa86eb3926ab/BUILD/php-pecl-archive-0.2/main -I/tmp/B.cdf76908-70c1-463d-b0aa-aa86eb3926ab/BUILD/php-pecl-archive-0.2 -I/usr/include/php -I/usr/include/php/main -I/usr/include/php/TSRM -I/usr/include/php/Zend -I/usr/include/php/ext -I/usr/include/php/ext/date/lib  -DHAVE_CONFIG_H  -O2 -fwrapv -pipe -Wformat -Werror=format-security -gdwarf-4 -fno-debug-types-section -fvar-tracking-assignments -g2 -Wp,-D_FORTIFY_SOURCE=2 -fstack-protector --param=ssp-buffer-size=4 -fomit-frame-pointer -march=i486 -fasynchronous-unwind-tables -gdwarf-4 -fno-debug-types-section -fvar-tracking-assignments -g2   -c /tmp/B.cdf76908-70c1-463d-b0aa-aa86eb3926ab/BUILD/php-pecl-archive-0.2/archive_writer.c -o archive_writer.lo 
/bin/sh /tmp/B.cdf76908-70c1-463d-b0aa-aa86eb3926ab/BUILD/php-pecl-archive-0.2/libtool --mode=compile i486-pld-linux-gcc  -I. -I/tmp/B.cdf76908-70c1-463d-b0aa-aa86eb3926ab/BUILD/php-pecl-archive-0.2 -DPHP_ATOM_INC -I/tmp/B.cdf76908-70c1-463d-b0aa-aa86eb3926ab/BUILD/php-pecl-archive-0.2/include -I/tmp/B.cdf76908-70c1-463d-b0aa-aa86eb3926ab/BUILD/php-pecl-archive-0.2/main -I/tmp/B.cdf76908-70c1-463d-b0aa-aa86eb3926ab/BUILD/php-pecl-archive-0.2 -I/usr/include/php -I/usr/include/php/main -I/usr/include/php/TSRM -I/usr/include/php/Zend -I/usr/include/php/ext -I/usr/include/php/ext/date/lib  -DHAVE_CONFIG_H  -O2 -fwrapv -pipe -Wformat -Werror=format-security -gdwarf-4 -fno-debug-types-section -fvar-tracking-assignments -g2 -Wp,-D_FORTIFY_SOURCE=2 -fstack-protector --param=ssp-buffer-size=4 -fomit-frame-pointer -march=i486 -fasynchronous-unwind-tables -gdwarf-4 -fno-debug-types-section -fvar-tracking-assignments -g2   -c /tmp/B.cdf76908-70c1-463d-b0aa-aa86eb3926ab/BUILD/php-pecl-archive-0.2/archive_clbk.c -o archive_clbk.lo 
/bin/sh /tmp/B.cdf76908-70c1-463d-b0aa-aa86eb3926ab/BUILD/php-pecl-archive-0.2/libtool --mode=compile i486-pld-linux-gcc  -I. -I/tmp/B.cdf76908-70c1-463d-b0aa-aa86eb3926ab/BUILD/php-pecl-archive-0.2 -DPHP_ATOM_INC -I/tmp/B.cdf76908-70c1-463d-b0aa-aa86eb3926ab/BUILD/php-pecl-archive-0.2/include -I/tmp/B.cdf76908-70c1-463d-b0aa-aa86eb3926ab/BUILD/php-pecl-archive-0.2/main -I/tmp/B.cdf76908-70c1-463d-b0aa-aa86eb3926ab/BUILD/php-pecl-archive-0.2 -I/usr/include/php -I/usr/include/php/main -I/usr/include/php/TSRM -I/usr/include/php/Zend -I/usr/include/php/ext -I/usr/include/php/ext/date/lib  -DHAVE_CONFIG_H  -O2 -fwrapv -pipe -Wformat -Werror=format-security -gdwarf-4 -fno-debug-types-section -fvar-tracking-assignments -g2 -Wp,-D_FORTIFY_SOURCE=2 -fstack-protector --param=ssp-buffer-size=4 -fomit-frame-pointer -march=i486 -fasynchronous-unwind-tables -gdwarf-4 -fno-debug-types-section -fvar-tracking-assignments -g2   -c /tmp/B.cdf76908-70c1-463d-b0aa-aa86eb3926ab/BUILD/php-pecl-archive-0.2/archive_entry.c -o archive_entry.lo 
/bin/sh /tmp/B.cdf76908-70c1-463d-b0aa-aa86eb3926ab/BUILD/php-pecl-archive-0.2/libtool --mode=compile i486-pld-linux-gcc  -I. -I/tmp/B.cdf76908-70c1-463d-b0aa-aa86eb3926ab/BUILD/php-pecl-archive-0.2 -DPHP_ATOM_INC -I/tmp/B.cdf76908-70c1-463d-b0aa-aa86eb3926ab/BUILD/php-pecl-archive-0.2/include -I/tmp/B.cdf76908-70c1-463d-b0aa-aa86eb3926ab/BUILD/php-pecl-archive-0.2/main -I/tmp/B.cdf76908-70c1-463d-b0aa-aa86eb3926ab/BUILD/php-pecl-archive-0.2 -I/usr/include/php -I/usr/include/php/main -I/usr/include/php/TSRM -I/usr/include/php/Zend -I/usr/include/php/ext -I/usr/include/php/ext/date/lib  -DHAVE_CONFIG_H  -O2 -fwrapv -pipe -Wformat -Werror=format-security -gdwarf-4 -fno-debug-types-section -fvar-tracking-assignments -g2 -Wp,-D_FORTIFY_SOURCE=2 -fstack-protector --param=ssp-buffer-size=4 -fomit-frame-pointer -march=i486 -fasynchronous-unwind-tables -gdwarf-4 -fno-debug-types-section -fvar-tracking-assignments -g2   -c /tmp/B.cdf76908-70c1-463d-b0aa-aa86eb3926ab/BUILD/php-pecl-archive-0.2/archive_util.c -o archive_util.lo 
libtool: compile:  i486-pld-linux-gcc -I. -I/tmp/B.cdf76908-70c1-463d-b0aa-aa86eb3926ab/BUILD/php-pecl-archive-0.2 -DPHP_ATOM_INC -I/tmp/B.cdf76908-70c1-463d-b0aa-aa86eb3926ab/BUILD/php-pecl-archive-0.2/include -I/tmp/B.cdf76908-70c1-463d-b0aa-aa86eb3926ab/BUILD/php-pecl-archive-0.2/main -I/tmp/B.cdf76908-70c1-463d-b0aa-aa86eb3926ab/BUILD/php-pecl-archive-0.2 -I/usr/include/php -I/usr/include/php/main -I/usr/include/php/TSRM -I/usr/include/php/Zend -I/usr/include/php/ext -I/usr/include/php/ext/date/lib -DHAVE_CONFIG_H -O2 -fwrapv -pipe -Wformat -Werror=format-security -gdwarf-4 -fno-debug-types-section -fvar-tracking-assignments -g2 -Wp,-D_FORTIFY_SOURCE=2 -fstack-protector --param=ssp-buffer-size=4 -fomit-frame-pointer -march=i486 -fasynchronous-unwind-tables -gdwarf-4 -fno-debug-types-section -fvar-tracking-assignments -g2 -c /tmp/B.cdf76908-70c1-463d-b0aa-aa86eb3926ab/BUILD/php-pecl-archive-0.2/archive_reader.c  -fPIC -DPIC -o .libs/archive_reader.o
libtool: compile:  i486-pld-linux-gcc -I. -I/tmp/B.cdf76908-70c1-463d-b0aa-aa86eb3926ab/BUILD/php-pecl-archive-0.2 -DPHP_ATOM_INC -I/tmp/B.cdf76908-70c1-463d-b0aa-aa86eb3926ab/BUILD/php-pecl-archive-0.2/include -I/tmp/B.cdf76908-70c1-463d-b0aa-aa86eb3926ab/BUILD/php-pecl-archive-0.2/main -I/tmp/B.cdf76908-70c1-463d-b0aa-aa86eb3926ab/BUILD/php-pecl-archive-0.2 -I/usr/include/php -I/usr/include/php/main -I/usr/include/php/TSRM -I/usr/include/php/Zend -I/usr/include/php/ext -I/usr/include/php/ext/date/lib -DHAVE_CONFIG_H -O2 -fwrapv -pipe -Wformat -Werror=format-security -gdwarf-4 -fno-debug-types-section -fvar-tracking-assignments -g2 -Wp,-D_FORTIFY_SOURCE=2 -fstack-protector --param=ssp-buffer-size=4 -fomit-frame-pointer -march=i486 -fasynchronous-unwind-tables -gdwarf-4 -fno-debug-types-section -fvar-tracking-assignments -g2 -c /tmp/B.cdf76908-70c1-463d-b0aa-aa86eb3926ab/BUILD/php-pecl-archive-0.2/archive_writer.c  -fPIC -DPIC -o .libs/archive_writer.o
libtool: compile:  i486-pld-linux-gcc -I. -I/tmp/B.cdf76908-70c1-463d-b0aa-aa86eb3926ab/BUILD/php-pecl-archive-0.2 -DPHP_ATOM_INC -I/tmp/B.cdf76908-70c1-463d-b0aa-aa86eb3926ab/BUILD/php-pecl-archive-0.2/include -I/tmp/B.cdf76908-70c1-463d-b0aa-aa86eb3926ab/BUILD/php-pecl-archive-0.2/main -I/tmp/B.cdf76908-70c1-463d-b0aa-aa86eb3926ab/BUILD/php-pecl-archive-0.2 -I/usr/include/php -I/usr/include/php/main -I/usr/include/php/TSRM -I/usr/include/php/Zend -I/usr/include/php/ext -I/usr/include/php/ext/date/lib -DHAVE_CONFIG_H -O2 -fwrapv -pipe -Wformat -Werror=format-security -gdwarf-4 -fno-debug-types-section -fvar-tracking-assignments -g2 -Wp,-D_FORTIFY_SOURCE=2 -fstack-protector --param=ssp-buffer-size=4 -fomit-frame-pointer -march=i486 -fasynchronous-unwind-tables -gdwarf-4 -fno-debug-types-section -fvar-tracking-assignments -g2 -c /tmp/B.cdf76908-70c1-463d-b0aa-aa86eb3926ab/BUILD/php-pecl-archive-0.2/archive_util.c  -fPIC -DPIC -o .libs/archive_util.o
libtool: compile:  i486-pld-linux-gcc -I. -I/tmp/B.cdf76908-70c1-463d-b0aa-aa86eb3926ab/BUILD/php-pecl-archive-0.2 -DPHP_ATOM_INC -I/tmp/B.cdf76908-70c1-463d-b0aa-aa86eb3926ab/BUILD/php-pecl-archive-0.2/include -I/tmp/B.cdf76908-70c1-463d-b0aa-aa86eb3926ab/BUILD/php-pecl-archive-0.2/main -I/tmp/B.cdf76908-70c1-463d-b0aa-aa86eb3926ab/BUILD/php-pecl-archive-0.2 -I/usr/include/php -I/usr/include/php/main -I/usr/include/php/TSRM -I/usr/include/php/Zend -I/usr/include/php/ext -I/usr/include/php/ext/date/lib -DHAVE_CONFIG_H -O2 -fwrapv -pipe -Wformat -Werror=format-security -gdwarf-4 -fno-debug-types-section -fvar-tracking-assignments -g2 -Wp,-D_FORTIFY_SOURCE=2 -fstack-protector --param=ssp-buffer-size=4 -fomit-frame-pointer -march=i486 -fasynchronous-unwind-tables -gdwarf-4 -fno-debug-types-section -fvar-tracking-assignments -g2 -c /tmp/B.cdf76908-70c1-463d-b0aa-aa86eb3926ab/BUILD/php-pecl-archive-0.2/archive.c  -fPIC -DPIC -o .libs/archive.o
libtool: compile:  i486-pld-linux-gcc -I. -I/tmp/B.cdf76908-70c1-463d-b0aa-aa86eb3926ab/BUILD/php-pecl-archive-0.2 -DPHP_ATOM_INC -I/tmp/B.cdf76908-70c1-463d-b0aa-aa86eb3926ab/BUILD/php-pecl-archive-0.2/include -I/tmp/B.cdf76908-70c1-463d-b0aa-aa86eb3926ab/BUILD/php-pecl-archive-0.2/main -I/tmp/B.cdf76908-70c1-463d-b0aa-aa86eb3926ab/BUILD/php-pecl-archive-0.2 -I/usr/include/php -I/usr/include/php/main -I/usr/include/php/TSRM -I/usr/include/php/Zend -I/usr/include/php/ext -I/usr/include/php/ext/date/lib -DHAVE_CONFIG_H -O2 -fwrapv -pipe -Wformat -Werror=format-security -gdwarf-4 -fno-debug-types-section -fvar-tracking-assignments -g2 -Wp,-D_FORTIFY_SOURCE=2 -fstack-protector --param=ssp-buffer-size=4 -fomit-frame-pointer -march=i486 -fasynchronous-unwind-tables -gdwarf-4 -fno-debug-types-section -fvar-tracking-assignments -g2 -c /tmp/B.cdf76908-70c1-463d-b0aa-aa86eb3926ab/BUILD/php-pecl-archive-0.2/archive_entry.c  -fPIC -DPIC -o .libs/archive_entry.o
libtool: compile:  i486-pld-linux-gcc -I. -I/tmp/B.cdf76908-70c1-463d-b0aa-aa86eb3926ab/BUILD/php-pecl-archive-0.2 -DPHP_ATOM_INC -I/tmp/B.cdf76908-70c1-463d-b0aa-aa86eb3926ab/BUILD/php-pecl-archive-0.2/include -I/tmp/B.cdf76908-70c1-463d-b0aa-aa86eb3926ab/BUILD/php-pecl-archive-0.2/main -I/tmp/B.cdf76908-70c1-463d-b0aa-aa86eb3926ab/BUILD/php-pecl-archive-0.2 -I/usr/include/php -I/usr/include/php/main -I/usr/include/php/TSRM -I/usr/include/php/Zend -I/usr/include/php/ext -I/usr/include/php/ext/date/lib -DHAVE_CONFIG_H -O2 -fwrapv -pipe -Wformat -Werror=format-security -gdwarf-4 -fno-debug-types-section -fvar-tracking-assignments -g2 -Wp,-D_FORTIFY_SOURCE=2 -fstack-protector --param=ssp-buffer-size=4 -fomit-frame-pointer -march=i486 -fasynchronous-unwind-tables -gdwarf-4 -fno-debug-types-section -fvar-tracking-assignments -g2 -c /tmp/B.cdf76908-70c1-463d-b0aa-aa86eb3926ab/BUILD/php-pecl-archive-0.2/archive_clbk.c  -fPIC -DPIC -o .libs/archive_clbk.o
/tmp/B.cdf76908-70c1-463d-b0aa-aa86eb3926ab/BUILD/php-pecl-archive-0.2/archive_util.c: In function '_archive_pathname_compare':
/tmp/B.cdf76908-70c1-463d-b0aa-aa86eb3926ab/BUILD/php-pecl-archive-0.2/archive_util.c:51:18: warning: assignment discards 'const' qualifier from pointer target type [enabled by default]
  Z_STRVAL(first) = f->arKey;
                  ^
/tmp/B.cdf76908-70c1-463d-b0aa-aa86eb3926ab/BUILD/php-pecl-archive-0.2/archive_entry.c:33:1: error: unknown type name 'function_entry'
 function_entry funcs_ArchiveEntry[] = {
 ^
/tmp/B.cdf76908-70c1-463d-b0aa-aa86eb3926ab/BUILD/php-pecl-archive-0.2/archive_util.c:55:19: warning: assignment discards 'const' qualifier from pointer target type [enabled by default]
  Z_STRVAL(second) = s->arKey;
                   ^
/tmp/B.cdf76908-70c1-463d-b0aa-aa86eb3926ab/BUILD/php-pecl-archive-0.2/archive_entry.c:34:2: warning: braces around scalar initializer [enabled by default]
  ZEND_ME(ArchiveEntry, __construct,  NULL, 0)
  ^
/tmp/B.cdf76908-70c1-463d-b0aa-aa86eb3926ab/BUILD/php-pecl-archive-0.2/archive_entry.c:34:2: warning: (near initialization for 'funcs_ArchiveEntry[0]') [enabled by default]
/tmp/B.cdf76908-70c1-463d-b0aa-aa86eb3926ab/BUILD/php-pecl-archive-0.2/archive_entry.c:34:2: warning: initialization makes integer from pointer without a cast [enabled by default]
/tmp/B.cdf76908-70c1-463d-b0aa-aa86eb3926ab/BUILD/php-pecl-archive-0.2/archive_entry.c:34:2: warning: (near initialization for 'funcs_ArchiveEntry[0]') [enabled by default]
/tmp/B.cdf76908-70c1-463d-b0aa-aa86eb3926ab/BUILD/php-pecl-archive-0.2/archive_entry.c:34:2: warning: excess elements in scalar initializer [enabled by default]
/tmp/B.cdf76908-70c1-463d-b0aa-aa86eb3926ab/BUILD/php-pecl-archive-0.2/archive_entry.c:34:2: warning: (near initialization for 'funcs_ArchiveEntry[0]') [enabled by default]
/tmp/B.cdf76908-70c1-463d-b0aa-aa86eb3926ab/BUILD/php-pecl-archive-0.2/archive_entry.c:34:2: warning: excess elements in scalar initializer [enabled by default]
/tmp/B.cdf76908-70c1-463d-b0aa-aa86eb3926ab/BUILD/php-pecl-archive-0.2/archive_entry.c:34:2: warning: (near initialization for 'funcs_ArchiveEntry[0]') [enabled by default]
In file included from /usr/include/php/main/php.h:38:0,
                 from /tmp/B.cdf76908-70c1-463d-b0aa-aa86eb3926ab/BUILD/php-pecl-archive-0.2/archive_entry.c:27:
/usr/include/php/Zend/zend_API.h:71:129: warning: excess elements in scalar initializer [enabled by default]
 #define ZEND_FENTRY(zend_name, name, arg_info, flags) { #zend_name, name, arg_info, (zend_uint) (sizeof(arg_info)/sizeof(struct _zend_arg_info)-1), flags },
                                                                                                                                 ^
/usr/include/php/Zend/zend_API.h:82:51: note: in expansion of macro 'ZEND_FENTRY'
 #define ZEND_ME(classname, name, arg_info, flags) ZEND_FENTRY(name, ZEND_MN(classname##_##name), arg_info, flags)
                                                   ^
/tmp/B.cdf76908-70c1-463d-b0aa-aa86eb3926ab/BUILD/php-pecl-archive-0.2/archive_entry.c:34:2: note: in expansion of macro 'ZEND_ME'
  ZEND_ME(ArchiveEntry, __construct,  NULL, 0)
  ^
/tmp/B.cdf76908-70c1-463d-b0aa-aa86eb3926ab/BUILD/php-pecl-archive-0.2/archive.c:40:1: error: unknown type name 'function_entry'
 function_entry archive_functions[] = {
 ^
/usr/include/php/Zend/zend_API.h:71:129: warning: (near initialization for 'funcs_ArchiveEntry[0]') [enabled by default]
 #define ZEND_FENTRY(zend_name, name, arg_info, flags) { #zend_name, name, arg_info, (zend_uint) (sizeof(arg_info)/sizeof(struct _zend_arg_info)-1), flags },
                                                                                                                                 ^
/usr/include/php/Zend/zend_API.h:82:51: note: in expansion of macro 'ZEND_FENTRY'
 #define ZEND_ME(classname, name, arg_info, flags) ZEND_FENTRY(name, ZEND_MN(classname##_##name), arg_info, flags)
                                                   ^
/tmp/B.cdf76908-70c1-463d-b0aa-aa86eb3926ab/BUILD/php-pecl-archive-0.2/archive_entry.c:34:2: note: in expansion of macro 'ZEND_ME'
  ZEND_ME(ArchiveEntry, __construct,  NULL, 0)
  ^
/tmp/B.cdf76908-70c1-463d-b0aa-aa86eb3926ab/BUILD/php-pecl-archive-0.2/archive_writer.c:39:1: error: unknown type name 'function_entry'
 function_entry funcs_ArchiveWriterInterface[] = {
 ^
/tmp/B.cdf76908-70c1-463d-b0aa-aa86eb3926ab/BUILD/php-pecl-archive-0.2/archive.c:41:2: warning: braces around scalar initializer [enabled by default]
  {NULL, NULL, NULL}
  ^
/usr/include/php/Zend/zend_API.h:71:129: warning: excess elements in scalar initializer [enabled by default]
 #define ZEND_FENTRY(zend_name, name, arg_info, flags) { #zend_name, name, arg_info, (zend_uint) (sizeof(arg_info)/sizeof(struct _zend_arg_info)-1), flags },
                                                                                                                                 ^
/usr/include/php/Zend/zend_API.h:82:51: note: in expansion of macro 'ZEND_FENTRY'
 #define ZEND_ME(classname, name, arg_info, flags) ZEND_FENTRY(name, ZEND_MN(classname##_##name), arg_info, flags)
                                                   ^
/tmp/B.cdf76908-70c1-463d-b0aa-aa86eb3926ab/BUILD/php-pecl-archive-0.2/archive_entry.c:34:2: note: in expansion of macro 'ZEND_ME'
  ZEND_ME(ArchiveEntry, __construct,  NULL, 0)
  ^
/tmp/B.cdf76908-70c1-463d-b0aa-aa86eb3926ab/BUILD/php-pecl-archive-0.2/archive.c:41:2: warning: (near initialization for 'archive_functions[0]') [enabled by default]
/tmp/B.cdf76908-70c1-463d-b0aa-aa86eb3926ab/BUILD/php-pecl-archive-0.2/archive.c:41:2: warning: initialization makes integer from pointer without a cast [enabled by default]
/tmp/B.cdf76908-70c1-463d-b0aa-aa86eb3926ab/BUILD/php-pecl-archive-0.2/archive.c:41:2: warning: (near initialization for 'archive_functions[0]') [enabled by default]
/usr/include/php/Zend/zend_API.h:71:129: warning: (near initialization for 'funcs_ArchiveEntry[0]') [enabled by default]
 #define ZEND_FENTRY(zend_name, name, arg_info, flags) { #zend_name, name, arg_info, (zend_uint) (sizeof(arg_info)/sizeof(struct _zend_arg_info)-1), flags },
                                                                                                                                 ^
/usr/include/php/Zend/zend_API.h:82:51: note: in expansion of macro 'ZEND_FENTRY'
 #define ZEND_ME(classname, name, arg_info, flags) ZEND_FENTRY(name, ZEND_MN(classname##_##name), arg_info, flags)
                                                   ^
/tmp/B.cdf76908-70c1-463d-b0aa-aa86eb3926ab/BUILD/php-pecl-archive-0.2/archive_entry.c:34:2: note: in expansion of macro 'ZEND_ME'
  ZEND_ME(ArchiveEntry, __construct,  NULL, 0)
  ^
/tmp/B.cdf76908-70c1-463d-b0aa-aa86eb3926ab/BUILD/php-pecl-archive-0.2/archive_writer.c:40:3: warning: braces around scalar initializer [enabled by default]
   ZEND_ABSTRACT_ME(ArchiveWriter, __construct,  NULL)
   ^
/tmp/B.cdf76908-70c1-463d-b0aa-aa86eb3926ab/BUILD/php-pecl-archive-0.2/archive.c:41:2: warning: excess elements in scalar initializer [enabled by default]
/tmp/B.cdf76908-70c1-463d-b0aa-aa86eb3926ab/BUILD/php-pecl-archive-0.2/archive.c:41:2: warning: (near initialization for 'archive_functions[0]') [enabled by default]
/tmp/B.cdf76908-70c1-463d-b0aa-aa86eb3926ab/BUILD/php-pecl-archive-0.2/archive_writer.c:40:3: warning: (near initialization for 'funcs_ArchiveWriterInterface[0]') [enabled by default]
/tmp/B.cdf76908-70c1-463d-b0aa-aa86eb3926ab/BUILD/php-pecl-archive-0.2/archive.c:41:2: warning: excess elements in scalar initializer [enabled by default]
/tmp/B.cdf76908-70c1-463d-b0aa-aa86eb3926ab/BUILD/php-pecl-archive-0.2/archive.c:41:2: warning: (near initialization for 'archive_functions[0]') [enabled by default]
/tmp/B.cdf76908-70c1-463d-b0aa-aa86eb3926ab/BUILD/php-pecl-archive-0.2/archive_entry.c:35:2: warning: braces around scalar initializer [enabled by default]
  ZEND_ME(ArchiveEntry, isDir,  NULL, 0)
  ^
/tmp/B.cdf76908-70c1-463d-b0aa-aa86eb3926ab/BUILD/php-pecl-archive-0.2/archive_entry.c:35:2: warning: (near initialization for 'funcs_ArchiveEntry[1]') [enabled by default]
/tmp/B.cdf76908-70c1-463d-b0aa-aa86eb3926ab/BUILD/php-pecl-archive-0.2/archive_entry.c:35:2: warning: initialization makes integer from pointer without a cast [enabled by default]
/tmp/B.cdf76908-70c1-463d-b0aa-aa86eb3926ab/BUILD/php-pecl-archive-0.2/archive_writer.c:40:3: warning: initialization makes integer from pointer without a cast [enabled by default]
/tmp/B.cdf76908-70c1-463d-b0aa-aa86eb3926ab/BUILD/php-pecl-archive-0.2/archive_entry.c:35:2: warning: (near initialization for 'funcs_ArchiveEntry[1]') [enabled by default]
/tmp/B.cdf76908-70c1-463d-b0aa-aa86eb3926ab/BUILD/php-pecl-archive-0.2/archive_writer.c:40:3: warning: (near initialization for 'funcs_ArchiveWriterInterface[0]') [enabled by default]
/tmp/B.cdf76908-70c1-463d-b0aa-aa86eb3926ab/BUILD/php-pecl-archive-0.2/archive_entry.c:35:2: warning: excess elements in scalar initializer [enabled by default]
/tmp/B.cdf76908-70c1-463d-b0aa-aa86eb3926ab/BUILD/php-pecl-archive-0.2/archive_entry.c:35:2: warning: (near initialization for 'funcs_ArchiveEntry[1]') [enabled by default]
/tmp/B.cdf76908-70c1-463d-b0aa-aa86eb3926ab/BUILD/php-pecl-archive-0.2/archive_writer.c:40:3: warning: excess elements in scalar initializer [enabled by default]
/tmp/B.cdf76908-70c1-463d-b0aa-aa86eb3926ab/BUILD/php-pecl-archive-0.2/archive_entry.c:35:2: warning: excess elements in scalar initializer [enabled by default]
/tmp/B.cdf76908-70c1-463d-b0aa-aa86eb3926ab/BUILD/php-pecl-archive-0.2/archive_writer.c:40:3: warning: (near initialization for 'funcs_ArchiveWriterInterface[0]') [enabled by default]
/tmp/B.cdf76908-70c1-463d-b0aa-aa86eb3926ab/BUILD/php-pecl-archive-0.2/archive_entry.c:35:2: warning: (near initialization for 'funcs_ArchiveEntry[1]') [enabled by default]
/tmp/B.cdf76908-70c1-463d-b0aa-aa86eb3926ab/BUILD/php-pecl-archive-0.2/archive_writer.c:40:3: warning: excess elements in scalar initializer [enabled by default]
/tmp/B.cdf76908-70c1-463d-b0aa-aa86eb3926ab/BUILD/php-pecl-archive-0.2/archive_writer.c:40:3: warning: (near initialization for 'funcs_ArchiveWriterInterface[0]') [enabled by default]
/tmp/B.cdf76908-70c1-463d-b0aa-aa86eb3926ab/BUILD/php-pecl-archive-0.2/archive.c:52:2: warning: initialization from incompatible pointer type [enabled by default]
  archive_functions,
  ^
/tmp/B.cdf76908-70c1-463d-b0aa-aa86eb3926ab/BUILD/php-pecl-archive-0.2/archive.c:52:2: warning: (near initialization for 'archive_module_entry.functions') [enabled by default]
In file included from /usr/include/php/main/php.h:38:0,
                 from /tmp/B.cdf76908-70c1-463d-b0aa-aa86eb3926ab/BUILD/php-pecl-archive-0.2/archive_entry.c:27:
/usr/include/php/Zend/zend_API.h:71:129: warning: excess elements in scalar initializer [enabled by default]
 #define ZEND_FENTRY(zend_name, name, arg_info, flags) { #zend_name, name, arg_info, (zend_uint) (sizeof(arg_info)/sizeof(struct _zend_arg_info)-1), flags },
                                                                                                                                 ^
/usr/include/php/Zend/zend_API.h:82:51: note: in expansion of macro 'ZEND_FENTRY'
 #define ZEND_ME(classname, name, arg_info, flags) ZEND_FENTRY(name, ZEND_MN(classname##_##name), arg_info, flags)
                                                   ^
/tmp/B.cdf76908-70c1-463d-b0aa-aa86eb3926ab/BUILD/php-pecl-archive-0.2/archive_entry.c:35:2: note: in expansion of macro 'ZEND_ME'
  ZEND_ME(ArchiveEntry, isDir,  NULL, 0)
  ^
In file included from /usr/include/php/main/php.h:38:0,
                 from /tmp/B.cdf76908-70c1-463d-b0aa-aa86eb3926ab/BUILD/php-pecl-archive-0.2/archive_writer.c:25:
/usr/include/php/Zend/zend_API.h:71:129: warning: excess elements in scalar initializer [enabled by default]
 #define ZEND_FENTRY(zend_name, name, arg_info, flags) { #zend_name, name, arg_info, (zend_uint) (sizeof(arg_info)/sizeof(struct _zend_arg_info)-1), flags },
                                                                                                                                 ^
/usr/include/php/Zend/zend_API.h:83:53: note: in expansion of macro 'ZEND_FENTRY'
 #define ZEND_ABSTRACT_ME(classname, name, arg_info) ZEND_FENTRY(name, NULL, arg_info, ZEND_ACC_PUBLIC|ZEND_ACC_ABSTRACT)
                                                     ^
/tmp/B.cdf76908-70c1-463d-b0aa-aa86eb3926ab/BUILD/php-pecl-archive-0.2/archive_writer.c:40:3: note: in expansion of macro 'ZEND_ABSTRACT_ME'
   ZEND_ABSTRACT_ME(ArchiveWriter, __construct,  NULL)
   ^
/usr/include/php/Zend/zend_API.h:71:129: warning: (near initialization for 'funcs_ArchiveEntry[1]') [enabled by default]
 #define ZEND_FENTRY(zend_name, name, arg_info, flags) { #zend_name, name, arg_info, (zend_uint) (sizeof(arg_info)/sizeof(struct _zend_arg_info)-1), flags },
                                                                                                                                 ^
/usr/include/php/Zend/zend_API.h:82:51: note: in expansion of macro 'ZEND_FENTRY'
 #define ZEND_ME(classname, name, arg_info, flags) ZEND_FENTRY(name, ZEND_MN(classname##_##name), arg_info, flags)
                                                   ^
/tmp/B.cdf76908-70c1-463d-b0aa-aa86eb3926ab/BUILD/php-pecl-archive-0.2/archive_entry.c:35:2: note: in expansion of macro 'ZEND_ME'
  ZEND_ME(ArchiveEntry, isDir,  NULL, 0)
  ^
/usr/include/php/Zend/zend_API.h:71:129: warning: (near initialization for 'funcs_ArchiveWriterInterface[0]') [enabled by default]
 #define ZEND_FENTRY(zend_name, name, arg_info, flags) { #zend_name, name, arg_info, (zend_uint) (sizeof(arg_info)/sizeof(struct _zend_arg_info)-1), flags },
                                                                                                                                 ^
/usr/include/php/Zend/zend_API.h:83:53: note: in expansion of macro 'ZEND_FENTRY'
 #define ZEND_ABSTRACT_ME(classname, name, arg_info) ZEND_FENTRY(name, NULL, arg_info, ZEND_ACC_PUBLIC|ZEND_ACC_ABSTRACT)
                                                     ^
/tmp/B.cdf76908-70c1-463d-b0aa-aa86eb3926ab/BUILD/php-pecl-archive-0.2/archive_writer.c:40:3: note: in expansion of macro 'ZEND_ABSTRACT_ME'
   ZEND_ABSTRACT_ME(ArchiveWriter, __construct,  NULL)
   ^
/usr/include/php/Zend/zend_API.h:71:129: warning: excess elements in scalar initializer [enabled by default]
 #define ZEND_FENTRY(zend_name, name, arg_info, flags) { #zend_name, name, arg_info, (zend_uint) (sizeof(arg_info)/sizeof(struct _zend_arg_info)-1), flags },
                                                                                                                                 ^
/usr/include/php/Zend/zend_API.h:82:51: note: in expansion of macro 'ZEND_FENTRY'
 #define ZEND_ME(classname, name, arg_info, flags) ZEND_FENTRY(name, ZEND_MN(classname##_##name), arg_info, flags)
                                                   ^
/tmp/B.cdf76908-70c1-463d-b0aa-aa86eb3926ab/BUILD/php-pecl-archive-0.2/archive_entry.c:35:2: note: in expansion of macro 'ZEND_ME'
  ZEND_ME(ArchiveEntry, isDir,  NULL, 0)
  ^
/tmp/B.cdf76908-70c1-463d-b0aa-aa86eb3926ab/BUILD/php-pecl-archive-0.2/archive.c: In function '_archive_desc_dtor':
/tmp/B.cdf76908-70c1-463d-b0aa-aa86eb3926ab/BUILD/php-pecl-archive-0.2/archive.c:89:3: warning: 'archive_read_finish' is deprecated (declared at /usr/include/archive.h:585) [-Wdeprecated-declarations]
   archive_read_finish(arch->arch);
   ^
/usr/include/php/Zend/zend_API.h:71:129: warning: (near initialization for 'funcs_ArchiveEntry[1]') [enabled by default]
 #define ZEND_FENTRY(zend_name, name, arg_info, flags) { #zend_name, name, arg_info, (zend_uint) (sizeof(arg_info)/sizeof(struct _zend_arg_info)-1), flags },
                                                                                                                                 ^
/usr/include/php/Zend/zend_API.h:82:51: note: in expansion of macro 'ZEND_FENTRY'
 #define ZEND_ME(classname, name, arg_info, flags) ZEND_FENTRY(name, ZEND_MN(classname##_##name), arg_info, flags)
                                                   ^
/tmp/B.cdf76908-70c1-463d-b0aa-aa86eb3926ab/BUILD/php-pecl-archive-0.2/archive_entry.c:35:2: note: in expansion of macro 'ZEND_ME'
  ZEND_ME(ArchiveEntry, isDir,  NULL, 0)
  ^
/tmp/B.cdf76908-70c1-463d-b0aa-aa86eb3926ab/BUILD/php-pecl-archive-0.2/archive.c:93:3: warning: 'archive_write_finish' is deprecated (declared at /usr/include/archive.h:721) [-Wdeprecated-declarations]
   archive_write_finish(arch->arch);
   ^
/usr/include/php/Zend/zend_API.h:71:129: warning: excess elements in scalar initializer [enabled by default]
 #define ZEND_FENTRY(zend_name, name, arg_info, flags) { #zend_name, name, arg_info, (zend_uint) (sizeof(arg_info)/sizeof(struct _zend_arg_info)-1), flags },
                                                                                                                                 ^
/usr/include/php/Zend/zend_API.h:83:53: note: in expansion of macro 'ZEND_FENTRY'
 #define ZEND_ABSTRACT_ME(classname, name, arg_info) ZEND_FENTRY(name, NULL, arg_info, ZEND_ACC_PUBLIC|ZEND_ACC_ABSTRACT)
                                                     ^
/tmp/B.cdf76908-70c1-463d-b0aa-aa86eb3926ab/BUILD/php-pecl-archive-0.2/archive_writer.c:40:3: note: in expansion of macro 'ZEND_ABSTRACT_ME'
   ZEND_ABSTRACT_ME(ArchiveWriter, __construct,  NULL)
   ^
/tmp/B.cdf76908-70c1-463d-b0aa-aa86eb3926ab/BUILD/php-pecl-archive-0.2/archive_entry.c:36:2: warning: braces around scalar initializer [enabled by default]
  ZEND_ME(ArchiveEntry, isFile,  NULL, 0)
  ^
/tmp/B.cdf76908-70c1-463d-b0aa-aa86eb3926ab/BUILD/php-pecl-archive-0.2/archive_entry.c:36:2: warning: (near initialization for 'funcs_ArchiveEntry[2]') [enabled by default]
/tmp/B.cdf76908-70c1-463d-b0aa-aa86eb3926ab/BUILD/php-pecl-archive-0.2/archive_entry.c:36:2: warning: initialization makes integer from pointer without a cast [enabled by default]
/tmp/B.cdf76908-70c1-463d-b0aa-aa86eb3926ab/BUILD/php-pecl-archive-0.2/archive_entry.c:36:2: warning: (near initialization for 'funcs_ArchiveEntry[2]') [enabled by default]
/tmp/B.cdf76908-70c1-463d-b0aa-aa86eb3926ab/BUILD/php-pecl-archive-0.2/archive_entry.c:36:2: warning: excess elements in scalar initializer [enabled by default]
/tmp/B.cdf76908-70c1-463d-b0aa-aa86eb3926ab/BUILD/php-pecl-archive-0.2/archive_entry.c:36:2: warning: (near initialization for 'funcs_ArchiveEntry[2]') [enabled by default]
/tmp/B.cdf76908-70c1-463d-b0aa-aa86eb3926ab/BUILD/php-pecl-archive-0.2/archive_entry.c:36:2: warning: excess elements in scalar initializer [enabled by default]
/tmp/B.cdf76908-70c1-463d-b0aa-aa86eb3926ab/BUILD/php-pecl-archive-0.2/archive_entry.c:36:2: warning: (near initialization for 'funcs_ArchiveEntry[2]') [enabled by default]
/usr/include/php/Zend/zend_API.h:71:129: warning: (near initialization for 'funcs_ArchiveWriterInterface[0]') [enabled by default]
 #define ZEND_FENTRY(zend_name, name, arg_info, flags) { #zend_name, name, arg_info, (zend_uint) (sizeof(arg_info)/sizeof(struct _zend_arg_info)-1), flags },
                                                                                                                                 ^
/usr/include/php/Zend/zend_API.h:83:53: note: in expansion of macro 'ZEND_FENTRY'
 #define ZEND_ABSTRACT_ME(classname, name, arg_info) ZEND_FENTRY(name, NULL, arg_info, ZEND_ACC_PUBLIC|ZEND_ACC_ABSTRACT)
                                                     ^
/tmp/B.cdf76908-70c1-463d-b0aa-aa86eb3926ab/BUILD/php-pecl-archive-0.2/archive_writer.c:40:3: note: in expansion of macro 'ZEND_ABSTRACT_ME'
   ZEND_ABSTRACT_ME(ArchiveWriter, __construct,  NULL)
   ^
/tmp/B.cdf76908-70c1-463d-b0aa-aa86eb3926ab/BUILD/php-pecl-archive-0.2/archive_writer.c:41:2: warning: braces around scalar initializer [enabled by default]
  ZEND_ABSTRACT_ME(ArchiveWriter, addEntry,  NULL)
  ^
/tmp/B.cdf76908-70c1-463d-b0aa-aa86eb3926ab/BUILD/php-pecl-archive-0.2/archive_writer.c:41:2: warning: (near initialization for 'funcs_ArchiveWriterInterface[1]') [enabled by default]
/tmp/B.cdf76908-70c1-463d-b0aa-aa86eb3926ab/BUILD/php-pecl-archive-0.2/archive_writer.c:41:2: warning: initialization makes integer from pointer without a cast [enabled by default]
In file included from /usr/include/php/main/php.h:38:0,
                 from /tmp/B.cdf76908-70c1-463d-b0aa-aa86eb3926ab/BUILD/php-pecl-archive-0.2/archive_entry.c:27:
/usr/include/php/Zend/zend_API.h:71:129: warning: excess elements in scalar initializer [enabled by default]
 #define ZEND_FENTRY(zend_name, name, arg_info, flags) { #zend_name, name, arg_info, (zend_uint) (sizeof(arg_info)/sizeof(struct _zend_arg_info)-1), flags },
                                                                                                                                 ^
/usr/include/php/Zend/zend_API.h:82:51: note: in expansion of macro 'ZEND_FENTRY'
 #define ZEND_ME(classname, name, arg_info, flags) ZEND_FENTRY(name, ZEND_MN(classname##_##name), arg_info, flags)
                                                   ^
/tmp/B.cdf76908-70c1-463d-b0aa-aa86eb3926ab/BUILD/php-pecl-archive-0.2/archive_entry.c:36:2: note: in expansion of macro 'ZEND_ME'
  ZEND_ME(ArchiveEntry, isFile,  NULL, 0)
  ^
/tmp/B.cdf76908-70c1-463d-b0aa-aa86eb3926ab/BUILD/php-pecl-archive-0.2/archive_writer.c:41:2: warning: (near initialization for 'funcs_ArchiveWriterInterface[1]') [enabled by default]
/tmp/B.cdf76908-70c1-463d-b0aa-aa86eb3926ab/BUILD/php-pecl-archive-0.2/archive_writer.c:41:2: warning: excess elements in scalar initializer [enabled by default]
/tmp/B.cdf76908-70c1-463d-b0aa-aa86eb3926ab/BUILD/php-pecl-archive-0.2/archive_writer.c:41:2: warning: (near initialization for 'funcs_ArchiveWriterInterface[1]') [enabled by default]
/tmp/B.cdf76908-70c1-463d-b0aa-aa86eb3926ab/BUILD/php-pecl-archive-0.2/archive_writer.c:41:2: warning: excess elements in scalar initializer [enabled by default]
/tmp/B.cdf76908-70c1-463d-b0aa-aa86eb3926ab/BUILD/php-pecl-archive-0.2/archive_writer.c:41:2: warning: (near initialization for 'funcs_ArchiveWriterInterface[1]') [enabled by default]
/usr/include/php/Zend/zend_API.h:71:129: warning: (near initialization for 'funcs_ArchiveEntry[2]') [enabled by default]
 #define ZEND_FENTRY(zend_name, name, arg_info, flags) { #zend_name, name, arg_info, (zend_uint) (sizeof(arg_info)/sizeof(struct _zend_arg_info)-1), flags },
                                                                                                                                 ^
/usr/include/php/Zend/zend_API.h:82:51: note: in expansion of macro 'ZEND_FENTRY'
 #define ZEND_ME(classname, name, arg_info, flags) ZEND_FENTRY(name, ZEND_MN(classname##_##name), arg_info, flags)
                                                   ^
/tmp/B.cdf76908-70c1-463d-b0aa-aa86eb3926ab/BUILD/php-pecl-archive-0.2/archive_entry.c:36:2: note: in expansion of macro 'ZEND_ME'
  ZEND_ME(ArchiveEntry, isFile,  NULL, 0)
  ^
/usr/include/php/Zend/zend_API.h:71:129: warning: excess elements in scalar initializer [enabled by default]
 #define ZEND_FENTRY(zend_name, name, arg_info, flags) { #zend_name, name, arg_info, (zend_uint) (sizeof(arg_info)/sizeof(struct _zend_arg_info)-1), flags },
                                                                                                                                 ^
/usr/include/php/Zend/zend_API.h:82:51: note: in expansion of macro 'ZEND_FENTRY'
 #define ZEND_ME(classname, name, arg_info, flags) ZEND_FENTRY(name, ZEND_MN(classname##_##name), arg_info, flags)
                                                   ^
/tmp/B.cdf76908-70c1-463d-b0aa-aa86eb3926ab/BUILD/php-pecl-archive-0.2/archive_entry.c:36:2: note: in expansion of macro 'ZEND_ME'
  ZEND_ME(ArchiveEntry, isFile,  NULL, 0)
  ^
In file included from /usr/include/php/main/php.h:38:0,
                 from /tmp/B.cdf76908-70c1-463d-b0aa-aa86eb3926ab/BUILD/php-pecl-archive-0.2/archive_writer.c:25:
/usr/include/php/Zend/zend_API.h:71:129: warning: excess elements in scalar initializer [enabled by default]
 #define ZEND_FENTRY(zend_name, name, arg_info, flags) { #zend_name, name, arg_info, (zend_uint) (sizeof(arg_info)/sizeof(struct _zend_arg_info)-1), flags },
                                                                                                                                 ^
/usr/include/php/Zend/zend_API.h:83:53: note: in expansion of macro 'ZEND_FENTRY'
 #define ZEND_ABSTRACT_ME(classname, name, arg_info) ZEND_FENTRY(name, NULL, arg_info, ZEND_ACC_PUBLIC|ZEND_ACC_ABSTRACT)
                                                     ^
/tmp/B.cdf76908-70c1-463d-b0aa-aa86eb3926ab/BUILD/php-pecl-archive-0.2/archive_writer.c:41:2: note: in expansion of macro 'ZEND_ABSTRACT_ME'
  ZEND_ABSTRACT_ME(ArchiveWriter, addEntry,  NULL)
  ^
/usr/include/php/Zend/zend_API.h:71:129: warning: (near initialization for 'funcs_ArchiveEntry[2]') [enabled by default]
 #define ZEND_FENTRY(zend_name, name, arg_info, flags) { #zend_name, name, arg_info, (zend_uint) (sizeof(arg_info)/sizeof(struct _zend_arg_info)-1), flags },
                                                                                                                                 ^
/usr/include/php/Zend/zend_API.h:82:51: note: in expansion of macro 'ZEND_FENTRY'
 #define ZEND_ME(classname, name, arg_info, flags) ZEND_FENTRY(name, ZEND_MN(classname##_##name), arg_info, flags)
                                                   ^
/tmp/B.cdf76908-70c1-463d-b0aa-aa86eb3926ab/BUILD/php-pecl-archive-0.2/archive_entry.c:36:2: note: in expansion of macro 'ZEND_ME'
  ZEND_ME(ArchiveEntry, isFile,  NULL, 0)
  ^
/usr/include/php/Zend/zend_API.h:71:129: warning: (near initialization for 'funcs_ArchiveWriterInterface[1]') [enabled by default]
 #define ZEND_FENTRY(zend_name, name, arg_info, flags) { #zend_name, name, arg_info, (zend_uint) (sizeof(arg_info)/sizeof(struct _zend_arg_info)-1), flags },
                                                                                                                                 ^
/usr/include/php/Zend/zend_API.h:83:53: note: in expansion of macro 'ZEND_FENTRY'
 #define ZEND_ABSTRACT_ME(classname, name, arg_info) ZEND_FENTRY(name, NULL, arg_info, ZEND_ACC_PUBLIC|ZEND_ACC_ABSTRACT)
                                                     ^
/tmp/B.cdf76908-70c1-463d-b0aa-aa86eb3926ab/BUILD/php-pecl-archive-0.2/archive_writer.c:41:2: note: in expansion of macro 'ZEND_ABSTRACT_ME'
  ZEND_ABSTRACT_ME(ArchiveWriter, addEntry,  NULL)
  ^
/tmp/B.cdf76908-70c1-463d-b0aa-aa86eb3926ab/BUILD/php-pecl-archive-0.2/archive_entry.c:37:2: warning: braces around scalar initializer [enabled by default]
  ZEND_ME(ArchiveEntry, isLink,  NULL, 0)
  ^
/tmp/B.cdf76908-70c1-463d-b0aa-aa86eb3926ab/BUILD/php-pecl-archive-0.2/archive_entry.c:37:2: warning: (near initialization for 'funcs_ArchiveEntry[3]') [enabled by default]
/tmp/B.cdf76908-70c1-463d-b0aa-aa86eb3926ab/BUILD/php-pecl-archive-0.2/archive_entry.c:37:2: warning: initialization makes integer from pointer without a cast [enabled by default]
/tmp/B.cdf76908-70c1-463d-b0aa-aa86eb3926ab/BUILD/php-pecl-archive-0.2/archive_entry.c:37:2: warning: (near initialization for 'funcs_ArchiveEntry[3]') [enabled by default]
/tmp/B.cdf76908-70c1-463d-b0aa-aa86eb3926ab/BUILD/php-pecl-archive-0.2/archive_entry.c:37:2: warning: excess elements in scalar initializer [enabled by default]
/tmp/B.cdf76908-70c1-463d-b0aa-aa86eb3926ab/BUILD/php-pecl-archive-0.2/archive_entry.c:37:2: warning: (near initialization for 'funcs_ArchiveEntry[3]') [enabled by default]
/tmp/B.cdf76908-70c1-463d-b0aa-aa86eb3926ab/BUILD/php-pecl-archive-0.2/archive_entry.c:37:2: warning: excess elements in scalar initializer [enabled by default]
/tmp/B.cdf76908-70c1-463d-b0aa-aa86eb3926ab/BUILD/php-pecl-archive-0.2/archive_entry.c:37:2: warning: (near initialization for 'funcs_ArchiveEntry[3]') [enabled by default]
/usr/include/php/Zend/zend_API.h:71:129: warning: excess elements in scalar initializer [enabled by default]
 #define ZEND_FENTRY(zend_name, name, arg_info, flags) { #zend_name, name, arg_info, (zend_uint) (sizeof(arg_info)/sizeof(struct _zend_arg_info)-1), flags },
                                                                                                                                 ^
/usr/include/php/Zend/zend_API.h:83:53: note: in expansion of macro 'ZEND_FENTRY'
 #define ZEND_ABSTRACT_ME(classname, name, arg_info) ZEND_FENTRY(name, NULL, arg_info, ZEND_ACC_PUBLIC|ZEND_ACC_ABSTRACT)
                                                     ^
/tmp/B.cdf76908-70c1-463d-b0aa-aa86eb3926ab/BUILD/php-pecl-archive-0.2/archive_writer.c:41:2: note: in expansion of macro 'ZEND_ABSTRACT_ME'
  ZEND_ABSTRACT_ME(ArchiveWriter, addEntry,  NULL)
  ^
/usr/include/php/Zend/zend_API.h:71:129: warning: (near initialization for 'funcs_ArchiveWriterInterface[1]') [enabled by default]
 #define ZEND_FENTRY(zend_name, name, arg_info, flags) { #zend_name, name, arg_info, (zend_uint) (sizeof(arg_info)/sizeof(struct _zend_arg_info)-1), flags },
                                                                                                                                 ^
/usr/include/php/Zend/zend_API.h:83:53: note: in expansion of macro 'ZEND_FENTRY'
 #define ZEND_ABSTRACT_ME(classname, name, arg_info) ZEND_FENTRY(name, NULL, arg_info, ZEND_ACC_PUBLIC|ZEND_ACC_ABSTRACT)
                                                     ^
/tmp/B.cdf76908-70c1-463d-b0aa-aa86eb3926ab/BUILD/php-pecl-archive-0.2/archive_writer.c:41:2: note: in expansion of macro 'ZEND_ABSTRACT_ME'
  ZEND_ABSTRACT_ME(ArchiveWriter, addEntry,  NULL)
  ^
In file included from /usr/include/php/main/php.h:38:0,
                 from /tmp/B.cdf76908-70c1-463d-b0aa-aa86eb3926ab/BUILD/php-pecl-archive-0.2/archive_entry.c:27:
/usr/include/php/Zend/zend_API.h:71:129: warning: excess elements in scalar initializer [enabled by default]
 #define ZEND_FENTRY(zend_name, name, arg_info, flags) { #zend_name, name, arg_info, (zend_uint) (sizeof(arg_info)/sizeof(struct _zend_arg_info)-1), flags },
                                                                                                                                 ^
/usr/include/php/Zend/zend_API.h:82:51: note: in expansion of macro 'ZEND_FENTRY'
 #define ZEND_ME(classname, name, arg_info, flags) ZEND_FENTRY(name, ZEND_MN(classname##_##name), arg_info, flags)
                                                   ^
/tmp/B.cdf76908-70c1-463d-b0aa-aa86eb3926ab/BUILD/php-pecl-archive-0.2/archive_entry.c:37:2: note: in expansion of macro 'ZEND_ME'
  ZEND_ME(ArchiveEntry, isLink,  NULL, 0)
  ^
/tmp/B.cdf76908-70c1-463d-b0aa-aa86eb3926ab/BUILD/php-pecl-archive-0.2/archive_writer.c:42:2: warning: braces around scalar initializer [enabled by default]
  ZEND_ABSTRACT_ME(ArchiveWriter, finish,  NULL)
  ^
/tmp/B.cdf76908-70c1-463d-b0aa-aa86eb3926ab/BUILD/php-pecl-archive-0.2/archive_writer.c:42:2: warning: (near initialization for 'funcs_ArchiveWriterInterface[2]') [enabled by default]
/tmp/B.cdf76908-70c1-463d-b0aa-aa86eb3926ab/BUILD/php-pecl-archive-0.2/archive_writer.c:42:2: warning: initialization makes integer from pointer without a cast [enabled by default]
/tmp/B.cdf76908-70c1-463d-b0aa-aa86eb3926ab/BUILD/php-pecl-archive-0.2/archive_writer.c:42:2: warning: (near initialization for 'funcs_ArchiveWriterInterface[2]') [enabled by default]
/tmp/B.cdf76908-70c1-463d-b0aa-aa86eb3926ab/BUILD/php-pecl-archive-0.2/archive_writer.c:42:2: warning: excess elements in scalar initializer [enabled by default]
/usr/include/php/Zend/zend_API.h:71:129: warning: (near initialization for 'funcs_ArchiveEntry[3]') [enabled by default]
 #define ZEND_FENTRY(zend_name, name, arg_info, flags) { #zend_name, name, arg_info, (zend_uint) (sizeof(arg_info)/sizeof(struct _zend_arg_info)-1), flags },
                                                                                                                                 ^
/usr/include/php/Zend/zend_API.h:82:51: note: in expansion of macro 'ZEND_FENTRY'
 #define ZEND_ME(classname, name, arg_info, flags) ZEND_FENTRY(name, ZEND_MN(classname##_##name), arg_info, flags)
                                                   ^
/tmp/B.cdf76908-70c1-463d-b0aa-aa86eb3926ab/BUILD/php-pecl-archive-0.2/archive_entry.c:37:2: note: in expansion of macro 'ZEND_ME'
  ZEND_ME(ArchiveEntry, isLink,  NULL, 0)
  ^
/tmp/B.cdf76908-70c1-463d-b0aa-aa86eb3926ab/BUILD/php-pecl-archive-0.2/archive_writer.c:42:2: warning: (near initialization for 'funcs_ArchiveWriterInterface[2]') [enabled by default]
/tmp/B.cdf76908-70c1-463d-b0aa-aa86eb3926ab/BUILD/php-pecl-archive-0.2/archive_writer.c:42:2: warning: excess elements in scalar initializer [enabled by default]
/tmp/B.cdf76908-70c1-463d-b0aa-aa86eb3926ab/BUILD/php-pecl-archive-0.2/archive_writer.c:42:2: warning: (near initialization for 'funcs_ArchiveWriterInterface[2]') [enabled by default]
/usr/include/php/Zend/zend_API.h:71:129: warning: excess elements in scalar initializer [enabled by default]
 #define ZEND_FENTRY(zend_name, name, arg_info, flags) { #zend_name, name, arg_info, (zend_uint) (sizeof(arg_info)/sizeof(struct _zend_arg_info)-1), flags },
                                                                                                                                 ^
/usr/include/php/Zend/zend_API.h:82:51: note: in expansion of macro 'ZEND_FENTRY'
 #define ZEND_ME(classname, name, arg_info, flags) ZEND_FENTRY(name, ZEND_MN(classname##_##name), arg_info, flags)
                                                   ^
/tmp/B.cdf76908-70c1-463d-b0aa-aa86eb3926ab/BUILD/php-pecl-archive-0.2/archive_entry.c:37:2: note: in expansion of macro 'ZEND_ME'
  ZEND_ME(ArchiveEntry, isLink,  NULL, 0)
  ^
In file included from /usr/include/php/main/php.h:38:0,
                 from /tmp/B.cdf76908-70c1-463d-b0aa-aa86eb3926ab/BUILD/php-pecl-archive-0.2/archive_writer.c:25:
/usr/include/php/Zend/zend_API.h:71:129: warning: excess elements in scalar initializer [enabled by default]
 #define ZEND_FENTRY(zend_name, name, arg_info, flags) { #zend_name, name, arg_info, (zend_uint) (sizeof(arg_info)/sizeof(struct _zend_arg_info)-1), flags },
                                                                                                                                 ^
/usr/include/php/Zend/zend_API.h:83:53: note: in expansion of macro 'ZEND_FENTRY'
 #define ZEND_ABSTRACT_ME(classname, name, arg_info) ZEND_FENTRY(name, NULL, arg_info, ZEND_ACC_PUBLIC|ZEND_ACC_ABSTRACT)
                                                     ^
/tmp/B.cdf76908-70c1-463d-b0aa-aa86eb3926ab/BUILD/php-pecl-archive-0.2/archive_writer.c:42:2: note: in expansion of macro 'ZEND_ABSTRACT_ME'
  ZEND_ABSTRACT_ME(ArchiveWriter, finish,  NULL)
  ^
/usr/include/php/Zend/zend_API.h:71:129: warning: (near initialization for 'funcs_ArchiveEntry[3]') [enabled by default]
 #define ZEND_FENTRY(zend_name, name, arg_info, flags) { #zend_name, name, arg_info, (zend_uint) (sizeof(arg_info)/sizeof(struct _zend_arg_info)-1), flags },
                                                                                                                                 ^
/usr/include/php/Zend/zend_API.h:82:51: note: in expansion of macro 'ZEND_FENTRY'
 #define ZEND_ME(classname, name, arg_info, flags) ZEND_FENTRY(name, ZEND_MN(classname##_##name), arg_info, flags)
                                                   ^
/tmp/B.cdf76908-70c1-463d-b0aa-aa86eb3926ab/BUILD/php-pecl-archive-0.2/archive_entry.c:37:2: note: in expansion of macro 'ZEND_ME'
  ZEND_ME(ArchiveEntry, isLink,  NULL, 0)
  ^
/usr/include/php/Zend/zend_API.h:71:129: warning: (near initialization for 'funcs_ArchiveWriterInterface[2]') [enabled by default]
 #define ZEND_FENTRY(zend_name, name, arg_info, flags) { #zend_name, name, arg_info, (zend_uint) (sizeof(arg_info)/sizeof(struct _zend_arg_info)-1), flags },
                                                                                                                                 ^
/usr/include/php/Zend/zend_API.h:83:53: note: in expansion of macro 'ZEND_FENTRY'
 #define ZEND_ABSTRACT_ME(classname, name, arg_info) ZEND_FENTRY(name, NULL, arg_info, ZEND_ACC_PUBLIC|ZEND_ACC_ABSTRACT)
                                                     ^
/tmp/B.cdf76908-70c1-463d-b0aa-aa86eb3926ab/BUILD/php-pecl-archive-0.2/archive_writer.c:42:2: note: in expansion of macro 'ZEND_ABSTRACT_ME'
  ZEND_ABSTRACT_ME(ArchiveWriter, finish,  NULL)
  ^
/tmp/B.cdf76908-70c1-463d-b0aa-aa86eb3926ab/BUILD/php-pecl-archive-0.2/archive_entry.c:38:2: warning: braces around scalar initializer [enabled by default]
  ZEND_ME(ArchiveEntry, getPathname,  NULL, 0)
  ^
/tmp/B.cdf76908-70c1-463d-b0aa-aa86eb3926ab/BUILD/php-pecl-archive-0.2/archive_entry.c:38:2: warning: (near initialization for 'funcs_ArchiveEntry[4]') [enabled by default]
/tmp/B.cdf76908-70c1-463d-b0aa-aa86eb3926ab/BUILD/php-pecl-archive-0.2/archive_entry.c:38:2: warning: initialization makes integer from pointer without a cast [enabled by default]
/tmp/B.cdf76908-70c1-463d-b0aa-aa86eb3926ab/BUILD/php-pecl-archive-0.2/archive_entry.c:38:2: warning: (near initialization for 'funcs_ArchiveEntry[4]') [enabled by default]
/tmp/B.cdf76908-70c1-463d-b0aa-aa86eb3926ab/BUILD/php-pecl-archive-0.2/archive_entry.c:38:2: warning: excess elements in scalar initializer [enabled by default]
/tmp/B.cdf76908-70c1-463d-b0aa-aa86eb3926ab/BUILD/php-pecl-archive-0.2/archive_entry.c:38:2: warning: (near initialization for 'funcs_ArchiveEntry[4]') [enabled by default]
/tmp/B.cdf76908-70c1-463d-b0aa-aa86eb3926ab/BUILD/php-pecl-archive-0.2/archive_entry.c:38:2: warning: excess elements in scalar initializer [enabled by default]
/tmp/B.cdf76908-70c1-463d-b0aa-aa86eb3926ab/BUILD/php-pecl-archive-0.2/archive_entry.c:38:2: warning: (near initialization for 'funcs_ArchiveEntry[4]') [enabled by default]
/usr/include/php/Zend/zend_API.h:71:129: warning: excess elements in scalar initializer [enabled by default]
 #define ZEND_FENTRY(zend_name, name, arg_info, flags) { #zend_name, name, arg_info, (zend_uint) (sizeof(arg_info)/sizeof(struct _zend_arg_info)-1), flags },
                                                                                                                                 ^
/usr/include/php/Zend/zend_API.h:83:53: note: in expansion of macro 'ZEND_FENTRY'
 #define ZEND_ABSTRACT_ME(classname, name, arg_info) ZEND_FENTRY(name, NULL, arg_info, ZEND_ACC_PUBLIC|ZEND_ACC_ABSTRACT)
                                                     ^
/tmp/B.cdf76908-70c1-463d-b0aa-aa86eb3926ab/BUILD/php-pecl-archive-0.2/archive_writer.c:42:2: note: in expansion of macro 'ZEND_ABSTRACT_ME'
  ZEND_ABSTRACT_ME(ArchiveWriter, finish,  NULL)
  ^
In file included from /usr/include/php/main/php.h:38:0,
                 from /tmp/B.cdf76908-70c1-463d-b0aa-aa86eb3926ab/BUILD/php-pecl-archive-0.2/archive_entry.c:27:
/usr/include/php/Zend/zend_API.h:71:129: warning: excess elements in scalar initializer [enabled by default]
 #define ZEND_FENTRY(zend_name, name, arg_info, flags) { #zend_name, name, arg_info, (zend_uint) (sizeof(arg_info)/sizeof(struct _zend_arg_info)-1), flags },
                                                                                                                                 ^
/usr/include/php/Zend/zend_API.h:82:51: note: in expansion of macro 'ZEND_FENTRY'
 #define ZEND_ME(classname, name, arg_info, flags) ZEND_FENTRY(name, ZEND_MN(classname##_##name), arg_info, flags)
                                                   ^
/tmp/B.cdf76908-70c1-463d-b0aa-aa86eb3926ab/BUILD/php-pecl-archive-0.2/archive_entry.c:38:2: note: in expansion of macro 'ZEND_ME'
  ZEND_ME(ArchiveEntry, getPathname,  NULL, 0)
  ^
/usr/include/php/Zend/zend_API.h:71:129: warning: (near initialization for 'funcs_ArchiveWriterInterface[2]') [enabled by default]
 #define ZEND_FENTRY(zend_name, name, arg_info, flags) { #zend_name, name, arg_info, (zend_uint) (sizeof(arg_info)/sizeof(struct _zend_arg_info)-1), flags },
                                                                                                                                 ^
/usr/include/php/Zend/zend_API.h:83:53: note: in expansion of macro 'ZEND_FENTRY'
 #define ZEND_ABSTRACT_ME(classname, name, arg_info) ZEND_FENTRY(name, NULL, arg_info, ZEND_ACC_PUBLIC|ZEND_ACC_ABSTRACT)
                                                     ^
/tmp/B.cdf76908-70c1-463d-b0aa-aa86eb3926ab/BUILD/php-pecl-archive-0.2/archive_writer.c:42:2: note: in expansion of macro 'ZEND_ABSTRACT_ME'
  ZEND_ABSTRACT_ME(ArchiveWriter, finish,  NULL)
  ^
/tmp/B.cdf76908-70c1-463d-b0aa-aa86eb3926ab/BUILD/php-pecl-archive-0.2/archive_reader.c:36:1: error: unknown type name 'function_entry'
 function_entry funcs_ArchiveReaderInterface[] = {
 ^
/tmp/B.cdf76908-70c1-463d-b0aa-aa86eb3926ab/BUILD/php-pecl-archive-0.2/archive_writer.c:43:2: warning: braces around scalar initializer [enabled by default]
  {NULL, NULL, NULL}
  ^
/tmp/B.cdf76908-70c1-463d-b0aa-aa86eb3926ab/BUILD/php-pecl-archive-0.2/archive_writer.c:43:2: warning: (near initialization for 'funcs_ArchiveWriterInterface[3]') [enabled by default]
/tmp/B.cdf76908-70c1-463d-b0aa-aa86eb3926ab/BUILD/php-pecl-archive-0.2/archive_writer.c:43:2: warning: initialization makes integer from pointer without a cast [enabled by default]
/tmp/B.cdf76908-70c1-463d-b0aa-aa86eb3926ab/BUILD/php-pecl-archive-0.2/archive_writer.c:43:2: warning: (near initialization for 'funcs_ArchiveWriterInterface[3]') [enabled by default]
/usr/include/php/Zend/zend_API.h:71:129: warning: (near initialization for 'funcs_ArchiveEntry[4]') [enabled by default]
 #define ZEND_FENTRY(zend_name, name, arg_info, flags) { #zend_name, name, arg_info, (zend_uint) (sizeof(arg_info)/sizeof(struct _zend_arg_info)-1), flags },
                                                                                                                                 ^
/usr/include/php/Zend/zend_API.h:82:51: note: in expansion of macro 'ZEND_FENTRY'
 #define ZEND_ME(classname, name, arg_info, flags) ZEND_FENTRY(name, ZEND_MN(classname##_##name), arg_info, flags)
                                                   ^
/tmp/B.cdf76908-70c1-463d-b0aa-aa86eb3926ab/BUILD/php-pecl-archive-0.2/archive_entry.c:38:2: note: in expansion of macro 'ZEND_ME'
  ZEND_ME(ArchiveEntry, getPathname,  NULL, 0)
  ^
/tmp/B.cdf76908-70c1-463d-b0aa-aa86eb3926ab/BUILD/php-pecl-archive-0.2/archive_writer.c:43:2: warning: excess elements in scalar initializer [enabled by default]
/tmp/B.cdf76908-70c1-463d-b0aa-aa86eb3926ab/BUILD/php-pecl-archive-0.2/archive_writer.c:43:2: warning: (near initialization for 'funcs_ArchiveWriterInterface[3]') [enabled by default]
/tmp/B.cdf76908-70c1-463d-b0aa-aa86eb3926ab/BUILD/php-pecl-archive-0.2/archive_reader.c:37:3: warning: braces around scalar initializer [enabled by default]
   ZEND_ABSTRACT_ME(ArchiveReader, __construct,  NULL)
   ^
/tmp/B.cdf76908-70c1-463d-b0aa-aa86eb3926ab/BUILD/php-pecl-archive-0.2/archive_writer.c:43:2: warning: excess elements in scalar initializer [enabled by default]
/tmp/B.cdf76908-70c1-463d-b0aa-aa86eb3926ab/BUILD/php-pecl-archive-0.2/archive_reader.c:37:3: warning: (near initialization for 'funcs_ArchiveReaderInterface[0]') [enabled by default]
/tmp/B.cdf76908-70c1-463d-b0aa-aa86eb3926ab/BUILD/php-pecl-archive-0.2/archive_writer.c:43:2: warning: (near initialization for 'funcs_ArchiveWriterInterface[3]') [enabled by default]
/usr/include/php/Zend/zend_API.h:71:129: warning: excess elements in scalar initializer [enabled by default]
 #define ZEND_FENTRY(zend_name, name, arg_info, flags) { #zend_name, name, arg_info, (zend_uint) (sizeof(arg_info)/sizeof(struct _zend_arg_info)-1), flags },
                                                                                                                                 ^
/usr/include/php/Zend/zend_API.h:82:51: note: in expansion of macro 'ZEND_FENTRY'
 #define ZEND_ME(classname, name, arg_info, flags) ZEND_FENTRY(name, ZEND_MN(classname##_##name), arg_info, flags)
                                                   ^
/tmp/B.cdf76908-70c1-463d-b0aa-aa86eb3926ab/BUILD/php-pecl-archive-0.2/archive_entry.c:38:2: note: in expansion of macro 'ZEND_ME'
  ZEND_ME(ArchiveEntry, getPathname,  NULL, 0)
  ^
/tmp/B.cdf76908-70c1-463d-b0aa-aa86eb3926ab/BUILD/php-pecl-archive-0.2/archive_reader.c:37:3: warning: initialization makes integer from pointer without a cast [enabled by default]
/tmp/B.cdf76908-70c1-463d-b0aa-aa86eb3926ab/BUILD/php-pecl-archive-0.2/archive_reader.c:37:3: warning: (near initialization for 'funcs_ArchiveReaderInterface[0]') [enabled by default]
/tmp/B.cdf76908-70c1-463d-b0aa-aa86eb3926ab/BUILD/php-pecl-archive-0.2/archive_reader.c:37:3: warning: excess elements in scalar initializer [enabled by default]
/tmp/B.cdf76908-70c1-463d-b0aa-aa86eb3926ab/BUILD/php-pecl-archive-0.2/archive_reader.c:37:3: warning: (near initialization for 'funcs_ArchiveReaderInterface[0]') [enabled by default]
/tmp/B.cdf76908-70c1-463d-b0aa-aa86eb3926ab/BUILD/php-pecl-archive-0.2/archive_reader.c:37:3: warning: excess elements in scalar initializer [enabled by default]
/tmp/B.cdf76908-70c1-463d-b0aa-aa86eb3926ab/BUILD/php-pecl-archive-0.2/archive_reader.c:37:3: warning: (near initialization for 'funcs_ArchiveReaderInterface[0]') [enabled by default]
/tmp/B.cdf76908-70c1-463d-b0aa-aa86eb3926ab/BUILD/php-pecl-archive-0.2/archive_writer.c:48:1: error: unknown type name 'function_entry'
 function_entry funcs_ArchiveWriter[] = {
 ^
/usr/include/php/Zend/zend_API.h:71:129: warning: (near initialization for 'funcs_ArchiveEntry[4]') [enabled by default]
 #define ZEND_FENTRY(zend_name, name, arg_info, flags) { #zend_name, name, arg_info, (zend_uint) (sizeof(arg_info)/sizeof(struct _zend_arg_info)-1), flags },
                                                                                                                                 ^
/usr/include/php/Zend/zend_API.h:82:51: note: in expansion of macro 'ZEND_FENTRY'
 #define ZEND_ME(classname, name, arg_info, flags) ZEND_FENTRY(name, ZEND_MN(classname##_##name), arg_info, flags)
                                                   ^
/tmp/B.cdf76908-70c1-463d-b0aa-aa86eb3926ab/BUILD/php-pecl-archive-0.2/archive_entry.c:38:2: note: in expansion of macro 'ZEND_ME'
  ZEND_ME(ArchiveEntry, getPathname,  NULL, 0)
  ^
/tmp/B.cdf76908-70c1-463d-b0aa-aa86eb3926ab/BUILD/php-pecl-archive-0.2/archive_entry.c:39:2: warning: braces around scalar initializer [enabled by default]
  ZEND_ME(ArchiveEntry, getResolvedPathname,  NULL, 0)
  ^
In file included from /usr/include/php/main/php.h:38:0,
                 from /tmp/B.cdf76908-70c1-463d-b0aa-aa86eb3926ab/BUILD/php-pecl-archive-0.2/archive_reader.c:25:
/usr/include/php/Zend/zend_API.h:71:129: warning: excess elements in scalar initializer [enabled by default]
 #define ZEND_FENTRY(zend_name, name, arg_info, flags) { #zend_name, name, arg_info, (zend_uint) (sizeof(arg_info)/sizeof(struct _zend_arg_info)-1), flags },
                                                                                                                                 ^
/usr/include/php/Zend/zend_API.h:83:53: note: in expansion of macro 'ZEND_FENTRY'
 #define ZEND_ABSTRACT_ME(classname, name, arg_info) ZEND_FENTRY(name, NULL, arg_info, ZEND_ACC_PUBLIC|ZEND_ACC_ABSTRACT)
                                                     ^
/tmp/B.cdf76908-70c1-463d-b0aa-aa86eb3926ab/BUILD/php-pecl-archive-0.2/archive_reader.c:37:3: note: in expansion of macro 'ZEND_ABSTRACT_ME'
   ZEND_ABSTRACT_ME(ArchiveReader, __construct,  NULL)
   ^
/tmp/B.cdf76908-70c1-463d-b0aa-aa86eb3926ab/BUILD/php-pecl-archive-0.2/archive_writer.c:49:3: warning: braces around scalar initializer [enabled by default]
   ZEND_ME(ArchiveWriter, __construct,  NULL, 0)
   ^
/tmp/B.cdf76908-70c1-463d-b0aa-aa86eb3926ab/BUILD/php-pecl-archive-0.2/archive_entry.c:39:2: warning: (near initialization for 'funcs_ArchiveEntry[5]') [enabled by default]
/tmp/B.cdf76908-70c1-463d-b0aa-aa86eb3926ab/BUILD/php-pecl-archive-0.2/archive_writer.c:49:3: warning: (near initialization for 'funcs_ArchiveWriter[0]') [enabled by default]
/tmp/B.cdf76908-70c1-463d-b0aa-aa86eb3926ab/BUILD/php-pecl-archive-0.2/archive_entry.c:39:2: warning: initialization makes integer from pointer without a cast [enabled by default]
/tmp/B.cdf76908-70c1-463d-b0aa-aa86eb3926ab/BUILD/php-pecl-archive-0.2/archive_writer.c:49:3: warning: initialization makes integer from pointer without a cast [enabled by default]
/tmp/B.cdf76908-70c1-463d-b0aa-aa86eb3926ab/BUILD/php-pecl-archive-0.2/archive_entry.c:39:2: warning: (near initialization for 'funcs_ArchiveEntry[5]') [enabled by default]
/tmp/B.cdf76908-70c1-463d-b0aa-aa86eb3926ab/BUILD/php-pecl-archive-0.2/archive_writer.c:49:3: warning: (near initialization for 'funcs_ArchiveWriter[0]') [enabled by default]
/usr/include/php/Zend/zend_API.h:71:129: warning: (near initialization for 'funcs_ArchiveReaderInterface[0]') [enabled by default]
 #define ZEND_FENTRY(zend_name, name, arg_info, flags) { #zend_name, name, arg_info, (zend_uint) (sizeof(arg_info)/sizeof(struct _zend_arg_info)-1), flags },
                                                                                                                                 ^
/usr/include/php/Zend/zend_API.h:83:53: note: in expansion of macro 'ZEND_FENTRY'
 #define ZEND_ABSTRACT_ME(classname, name, arg_info) ZEND_FENTRY(name, NULL, arg_info, ZEND_ACC_PUBLIC|ZEND_ACC_ABSTRACT)
                                                     ^
/tmp/B.cdf76908-70c1-463d-b0aa-aa86eb3926ab/BUILD/php-pecl-archive-0.2/archive_reader.c:37:3: note: in expansion of macro 'ZEND_ABSTRACT_ME'
   ZEND_ABSTRACT_ME(ArchiveReader, __construct,  NULL)
   ^
/tmp/B.cdf76908-70c1-463d-b0aa-aa86eb3926ab/BUILD/php-pecl-archive-0.2/archive_writer.c:49:3: warning: excess elements in scalar initializer [enabled by default]
/tmp/B.cdf76908-70c1-463d-b0aa-aa86eb3926ab/BUILD/php-pecl-archive-0.2/archive_entry.c:39:2: warning: excess elements in scalar initializer [enabled by default]
/tmp/B.cdf76908-70c1-463d-b0aa-aa86eb3926ab/BUILD/php-pecl-archive-0.2/archive_writer.c:49:3: warning: (near initialization for 'funcs_ArchiveWriter[0]') [enabled by default]
/tmp/B.cdf76908-70c1-463d-b0aa-aa86eb3926ab/BUILD/php-pecl-archive-0.2/archive_entry.c:39:2: warning: (near initialization for 'funcs_ArchiveEntry[5]') [enabled by default]
/tmp/B.cdf76908-70c1-463d-b0aa-aa86eb3926ab/BUILD/php-pecl-archive-0.2/archive_writer.c:49:3: warning: excess elements in scalar initializer [enabled by default]
/tmp/B.cdf76908-70c1-463d-b0aa-aa86eb3926ab/BUILD/php-pecl-archive-0.2/archive_entry.c:39:2: warning: excess elements in scalar initializer [enabled by default]
/tmp/B.cdf76908-70c1-463d-b0aa-aa86eb3926ab/BUILD/php-pecl-archive-0.2/archive_writer.c:49:3: warning: (near initialization for 'funcs_ArchiveWriter[0]') [enabled by default]
/tmp/B.cdf76908-70c1-463d-b0aa-aa86eb3926ab/BUILD/php-pecl-archive-0.2/archive_entry.c:39:2: warning: (near initialization for 'funcs_ArchiveEntry[5]') [enabled by default]
/usr/include/php/Zend/zend_API.h:71:129: warning: excess elements in scalar initializer [enabled by default]
 #define ZEND_FENTRY(zend_name, name, arg_info, flags) { #zend_name, name, arg_info, (zend_uint) (sizeof(arg_info)/sizeof(struct _zend_arg_info)-1), flags },
                                                                                                                                 ^
/usr/include/php/Zend/zend_API.h:83:53: note: in expansion of macro 'ZEND_FENTRY'
 #define ZEND_ABSTRACT_ME(classname, name, arg_info) ZEND_FENTRY(name, NULL, arg_info, ZEND_ACC_PUBLIC|ZEND_ACC_ABSTRACT)
                                                     ^
/tmp/B.cdf76908-70c1-463d-b0aa-aa86eb3926ab/BUILD/php-pecl-archive-0.2/archive_reader.c:37:3: note: in expansion of macro 'ZEND_ABSTRACT_ME'
   ZEND_ABSTRACT_ME(ArchiveReader, __construct,  NULL)
   ^
In file included from /usr/include/php/main/php.h:38:0,
                 from /tmp/B.cdf76908-70c1-463d-b0aa-aa86eb3926ab/BUILD/php-pecl-archive-0.2/archive_writer.c:25:
/usr/include/php/Zend/zend_API.h:71:129: warning: excess elements in scalar initializer [enabled by default]
 #define ZEND_FENTRY(zend_name, name, arg_info, flags) { #zend_name, name, arg_info, (zend_uint) (sizeof(arg_info)/sizeof(struct _zend_arg_info)-1), flags },
                                                                                                                                 ^
/usr/include/php/Zend/zend_API.h:82:51: note: in expansion of macro 'ZEND_FENTRY'
 #define ZEND_ME(classname, name, arg_info, flags) ZEND_FENTRY(name, ZEND_MN(classname##_##name), arg_info, flags)
                                                   ^
/tmp/B.cdf76908-70c1-463d-b0aa-aa86eb3926ab/BUILD/php-pecl-archive-0.2/archive_writer.c:49:3: note: in expansion of macro 'ZEND_ME'
   ZEND_ME(ArchiveWriter, __construct,  NULL, 0)
   ^
/usr/include/php/Zend/zend_API.h:71:129: warning: (near initialization for 'funcs_ArchiveReaderInterface[0]') [enabled by default]
 #define ZEND_FENTRY(zend_name, name, arg_info, flags) { #zend_name, name, arg_info, (zend_uint) (sizeof(arg_info)/sizeof(struct _zend_arg_info)-1), flags },
                                                                                                                                 ^
/usr/include/php/Zend/zend_API.h:83:53: note: in expansion of macro 'ZEND_FENTRY'
 #define ZEND_ABSTRACT_ME(classname, name, arg_info) ZEND_FENTRY(name, NULL, arg_info, ZEND_ACC_PUBLIC|ZEND_ACC_ABSTRACT)
                                                     ^
/tmp/B.cdf76908-70c1-463d-b0aa-aa86eb3926ab/BUILD/php-pecl-archive-0.2/archive_reader.c:37:3: note: in expansion of macro 'ZEND_ABSTRACT_ME'
   ZEND_ABSTRACT_ME(ArchiveReader, __construct,  NULL)
   ^
In file included from /usr/include/php/main/php.h:38:0,
                 from /tmp/B.cdf76908-70c1-463d-b0aa-aa86eb3926ab/BUILD/php-pecl-archive-0.2/archive_entry.c:27:
/usr/include/php/Zend/zend_API.h:71:129: warning: excess elements in scalar initializer [enabled by default]
 #define ZEND_FENTRY(zend_name, name, arg_info, flags) { #zend_name, name, arg_info, (zend_uint) (sizeof(arg_info)/sizeof(struct _zend_arg_info)-1), flags },
                                                                                                                                 ^
/usr/include/php/Zend/zend_API.h:82:51: note: in expansion of macro 'ZEND_FENTRY'
 #define ZEND_ME(classname, name, arg_info, flags) ZEND_FENTRY(name, ZEND_MN(classname##_##name), arg_info, flags)
                                                   ^
/tmp/B.cdf76908-70c1-463d-b0aa-aa86eb3926ab/BUILD/php-pecl-archive-0.2/archive_entry.c:39:2: note: in expansion of macro 'ZEND_ME'
  ZEND_ME(ArchiveEntry, getResolvedPathname,  NULL, 0)
  ^
/tmp/B.cdf76908-70c1-463d-b0aa-aa86eb3926ab/BUILD/php-pecl-archive-0.2/archive_reader.c:38:2: warning: braces around scalar initializer [enabled by default]
  ZEND_ABSTRACT_ME(ArchiveReader, getNextEntry,  NULL)
  ^
/tmp/B.cdf76908-70c1-463d-b0aa-aa86eb3926ab/BUILD/php-pecl-archive-0.2/archive_reader.c:38:2: warning: (near initialization for 'funcs_ArchiveReaderInterface[1]') [enabled by default]
/tmp/B.cdf76908-70c1-463d-b0aa-aa86eb3926ab/BUILD/php-pecl-archive-0.2/archive_reader.c:38:2: warning: initialization makes integer from pointer without a cast [enabled by default]
/tmp/B.cdf76908-70c1-463d-b0aa-aa86eb3926ab/BUILD/php-pecl-archive-0.2/archive_reader.c:38:2: warning: (near initialization for 'funcs_ArchiveReaderInterface[1]') [enabled by default]
/usr/include/php/Zend/zend_API.h:71:129: warning: (near initialization for 'funcs_ArchiveWriter[0]') [enabled by default]
 #define ZEND_FENTRY(zend_name, name, arg_info, flags) { #zend_name, name, arg_info, (zend_uint) (sizeof(arg_info)/sizeof(struct _zend_arg_info)-1), flags },
                                                                                                                                 ^
/usr/include/php/Zend/zend_API.h:82:51: note: in expansion of macro 'ZEND_FENTRY'
 #define ZEND_ME(classname, name, arg_info, flags) ZEND_FENTRY(name, ZEND_MN(classname##_##name), arg_info, flags)
                                                   ^
/tmp/B.cdf76908-70c1-463d-b0aa-aa86eb3926ab/BUILD/php-pecl-archive-0.2/archive_writer.c:49:3: note: in expansion of macro 'ZEND_ME'
   ZEND_ME(ArchiveWriter, __construct,  NULL, 0)
   ^
/tmp/B.cdf76908-70c1-463d-b0aa-aa86eb3926ab/BUILD/php-pecl-archive-0.2/archive_reader.c:38:2: warning: excess elements in scalar initializer [enabled by default]
/tmp/B.cdf76908-70c1-463d-b0aa-aa86eb3926ab/BUILD/php-pecl-archive-0.2/archive_reader.c:38:2: warning: (near initialization for 'funcs_ArchiveReaderInterface[1]') [enabled by default]
/tmp/B.cdf76908-70c1-463d-b0aa-aa86eb3926ab/BUILD/php-pecl-archive-0.2/archive_reader.c:38:2: warning: excess elements in scalar initializer [enabled by default]
/tmp/B.cdf76908-70c1-463d-b0aa-aa86eb3926ab/BUILD/php-pecl-archive-0.2/archive_reader.c:38:2: warning: (near initialization for 'funcs_ArchiveReaderInterface[1]') [enabled by default]
/usr/include/php/Zend/zend_API.h:71:129: warning: (near initialization for 'funcs_ArchiveEntry[5]') [enabled by default]
 #define ZEND_FENTRY(zend_name, name, arg_info, flags) { #zend_name, name, arg_info, (zend_uint) (sizeof(arg_info)/sizeof(struct _zend_arg_info)-1), flags },
                                                                                                                                 ^
/usr/include/php/Zend/zend_API.h:82:51: note: in expansion of macro 'ZEND_FENTRY'
 #define ZEND_ME(classname, name, arg_info, flags) ZEND_FENTRY(name, ZEND_MN(classname##_##name), arg_info, flags)
                                                   ^
/tmp/B.cdf76908-70c1-463d-b0aa-aa86eb3926ab/BUILD/php-pecl-archive-0.2/archive_entry.c:39:2: note: in expansion of macro 'ZEND_ME'
  ZEND_ME(ArchiveEntry, getResolvedPathname,  NULL, 0)
  ^
/usr/include/php/Zend/zend_API.h:71:129: warning: excess elements in scalar initializer [enabled by default]
 #define ZEND_FENTRY(zend_name, name, arg_info, flags) { #zend_name, name, arg_info, (zend_uint) (sizeof(arg_info)/sizeof(struct _zend_arg_info)-1), flags },
                                                                                                                                 ^
/usr/include/php/Zend/zend_API.h:82:51: note: in expansion of macro 'ZEND_FENTRY'
 #define ZEND_ME(classname, name, arg_info, flags) ZEND_FENTRY(name, ZEND_MN(classname##_##name), arg_info, flags)
                                                   ^
/tmp/B.cdf76908-70c1-463d-b0aa-aa86eb3926ab/BUILD/php-pecl-archive-0.2/archive_writer.c:49:3: note: in expansion of macro 'ZEND_ME'
   ZEND_ME(ArchiveWriter, __construct,  NULL, 0)
   ^
In file included from /usr/include/php/main/php.h:38:0,
                 from /tmp/B.cdf76908-70c1-463d-b0aa-aa86eb3926ab/BUILD/php-pecl-archive-0.2/archive_reader.c:25:
/usr/include/php/Zend/zend_API.h:71:129: warning: excess elements in scalar initializer [enabled by default]
 #define ZEND_FENTRY(zend_name, name, arg_info, flags) { #zend_name, name, arg_info, (zend_uint) (sizeof(arg_info)/sizeof(struct _zend_arg_info)-1), flags },
                                                                                                                                 ^
/usr/include/php/Zend/zend_API.h:83:53: note: in expansion of macro 'ZEND_FENTRY'
 #define ZEND_ABSTRACT_ME(classname, name, arg_info) ZEND_FENTRY(name, NULL, arg_info, ZEND_ACC_PUBLIC|ZEND_ACC_ABSTRACT)
                                                     ^
/tmp/B.cdf76908-70c1-463d-b0aa-aa86eb3926ab/BUILD/php-pecl-archive-0.2/archive_reader.c:38:2: note: in expansion of macro 'ZEND_ABSTRACT_ME'
  ZEND_ABSTRACT_ME(ArchiveReader, getNextEntry,  NULL)
  ^
/usr/include/php/Zend/zend_API.h:71:129: warning: excess elements in scalar initializer [enabled by default]
 #define ZEND_FENTRY(zend_name, name, arg_info, flags) { #zend_name, name, arg_info, (zend_uint) (sizeof(arg_info)/sizeof(struct _zend_arg_info)-1), flags },
                                                                                                                                 ^
/usr/include/php/Zend/zend_API.h:82:51: note: in expansion of macro 'ZEND_FENTRY'
 #define ZEND_ME(classname, name, arg_info, flags) ZEND_FENTRY(name, ZEND_MN(classname##_##name), arg_info, flags)
                                                   ^
/tmp/B.cdf76908-70c1-463d-b0aa-aa86eb3926ab/BUILD/php-pecl-archive-0.2/archive_entry.c:39:2: note: in expansion of macro 'ZEND_ME'
  ZEND_ME(ArchiveEntry, getResolvedPathname,  NULL, 0)
  ^
/usr/include/php/Zend/zend_API.h:71:129: warning: (near initialization for 'funcs_ArchiveWriter[0]') [enabled by default]
 #define ZEND_FENTRY(zend_name, name, arg_info, flags) { #zend_name, name, arg_info, (zend_uint) (sizeof(arg_info)/sizeof(struct _zend_arg_info)-1), flags },
                                                                                                                                 ^
/usr/include/php/Zend/zend_API.h:82:51: note: in expansion of macro 'ZEND_FENTRY'
 #define ZEND_ME(classname, name, arg_info, flags) ZEND_FENTRY(name, ZEND_MN(classname##_##name), arg_info, flags)
                                                   ^
/tmp/B.cdf76908-70c1-463d-b0aa-aa86eb3926ab/BUILD/php-pecl-archive-0.2/archive_writer.c:49:3: note: in expansion of macro 'ZEND_ME'
   ZEND_ME(ArchiveWriter, __construct,  NULL, 0)
   ^
/tmp/B.cdf76908-70c1-463d-b0aa-aa86eb3926ab/BUILD/php-pecl-archive-0.2/archive_writer.c:50:2: warning: braces around scalar initializer [enabled by default]
  ZEND_ME(ArchiveWriter, addEntry,  NULL, 0)
  ^
/tmp/B.cdf76908-70c1-463d-b0aa-aa86eb3926ab/BUILD/php-pecl-archive-0.2/archive_writer.c:50:2: warning: (near initialization for 'funcs_ArchiveWriter[1]') [enabled by default]
/usr/include/php/Zend/zend_API.h:71:129: warning: (near initialization for 'funcs_ArchiveReaderInterface[1]') [enabled by default]
 #define ZEND_FENTRY(zend_name, name, arg_info, flags) { #zend_name, name, arg_info, (zend_uint) (sizeof(arg_info)/sizeof(struct _zend_arg_info)-1), flags },
                                                                                                                                 ^
/usr/include/php/Zend/zend_API.h:83:53: note: in expansion of macro 'ZEND_FENTRY'
 #define ZEND_ABSTRACT_ME(classname, name, arg_info) ZEND_FENTRY(name, NULL, arg_info, ZEND_ACC_PUBLIC|ZEND_ACC_ABSTRACT)
                                                     ^
/tmp/B.cdf76908-70c1-463d-b0aa-aa86eb3926ab/BUILD/php-pecl-archive-0.2/archive_reader.c:38:2: note: in expansion of macro 'ZEND_ABSTRACT_ME'
  ZEND_ABSTRACT_ME(ArchiveReader, getNextEntry,  NULL)
  ^
/tmp/B.cdf76908-70c1-463d-b0aa-aa86eb3926ab/BUILD/php-pecl-archive-0.2/archive_writer.c:50:2: warning: initialization makes integer from pointer without a cast [enabled by default]
/tmp/B.cdf76908-70c1-463d-b0aa-aa86eb3926ab/BUILD/php-pecl-archive-0.2/archive_writer.c:50:2: warning: (near initialization for 'funcs_ArchiveWriter[1]') [enabled by default]
/tmp/B.cdf76908-70c1-463d-b0aa-aa86eb3926ab/BUILD/php-pecl-archive-0.2/archive_writer.c:50:2: warning: excess elements in scalar initializer [enabled by default]
/usr/include/php/Zend/zend_API.h:71:129: warning: (near initialization for 'funcs_ArchiveEntry[5]') [enabled by default]
 #define ZEND_FENTRY(zend_name, name, arg_info, flags) { #zend_name, name, arg_info, (zend_uint) (sizeof(arg_info)/sizeof(struct _zend_arg_info)-1), flags },
                                                                                                                                 ^
/usr/include/php/Zend/zend_API.h:82:51: note: in expansion of macro 'ZEND_FENTRY'
 #define ZEND_ME(classname, name, arg_info, flags) ZEND_FENTRY(name, ZEND_MN(classname##_##name), arg_info, flags)
                                                   ^
/tmp/B.cdf76908-70c1-463d-b0aa-aa86eb3926ab/BUILD/php-pecl-archive-0.2/archive_entry.c:39:2: note: in expansion of macro 'ZEND_ME'
  ZEND_ME(ArchiveEntry, getResolvedPathname,  NULL, 0)
  ^
/tmp/B.cdf76908-70c1-463d-b0aa-aa86eb3926ab/BUILD/php-pecl-archive-0.2/archive_writer.c:50:2: warning: (near initialization for 'funcs_ArchiveWriter[1]') [enabled by default]
/tmp/B.cdf76908-70c1-463d-b0aa-aa86eb3926ab/BUILD/php-pecl-archive-0.2/archive_writer.c:50:2: warning: excess elements in scalar initializer [enabled by default]
/tmp/B.cdf76908-70c1-463d-b0aa-aa86eb3926ab/BUILD/php-pecl-archive-0.2/archive_writer.c:50:2: warning: (near initialization for 'funcs_ArchiveWriter[1]') [enabled by default]
/tmp/B.cdf76908-70c1-463d-b0aa-aa86eb3926ab/BUILD/php-pecl-archive-0.2/archive_entry.c:40:2: warning: braces around scalar initializer [enabled by default]
  ZEND_ME(ArchiveEntry, getUser,  NULL, 0)
  ^
/usr/include/php/Zend/zend_API.h:71:129: warning: excess elements in scalar initializer [enabled by default]
 #define ZEND_FENTRY(zend_name, name, arg_info, flags) { #zend_name, name, arg_info, (zend_uint) (sizeof(arg_info)/sizeof(struct _zend_arg_info)-1), flags },
                                                                                                                                 ^
/usr/include/php/Zend/zend_API.h:83:53: note: in expansion of macro 'ZEND_FENTRY'
 #define ZEND_ABSTRACT_ME(classname, name, arg_info) ZEND_FENTRY(name, NULL, arg_info, ZEND_ACC_PUBLIC|ZEND_ACC_ABSTRACT)
                                                     ^
/tmp/B.cdf76908-70c1-463d-b0aa-aa86eb3926ab/BUILD/php-pecl-archive-0.2/archive_reader.c:38:2: note: in expansion of macro 'ZEND_ABSTRACT_ME'
  ZEND_ABSTRACT_ME(ArchiveReader, getNextEntry,  NULL)
  ^
/tmp/B.cdf76908-70c1-463d-b0aa-aa86eb3926ab/BUILD/php-pecl-archive-0.2/archive_entry.c:40:2: warning: (near initialization for 'funcs_ArchiveEntry[6]') [enabled by default]
/tmp/B.cdf76908-70c1-463d-b0aa-aa86eb3926ab/BUILD/php-pecl-archive-0.2/archive_entry.c:40:2: warning: initialization makes integer from pointer without a cast [enabled by default]
/tmp/B.cdf76908-70c1-463d-b0aa-aa86eb3926ab/BUILD/php-pecl-archive-0.2/archive_entry.c:40:2: warning: (near initialization for 'funcs_ArchiveEntry[6]') [enabled by default]
/tmp/B.cdf76908-70c1-463d-b0aa-aa86eb3926ab/BUILD/php-pecl-archive-0.2/archive_entry.c:40:2: warning: excess elements in scalar initializer [enabled by default]
/tmp/B.cdf76908-70c1-463d-b0aa-aa86eb3926ab/BUILD/php-pecl-archive-0.2/archive_entry.c:40:2: warning: (near initialization for 'funcs_ArchiveEntry[6]') [enabled by default]
In file included from /usr/include/php/main/php.h:38:0,
                 from /tmp/B.cdf76908-70c1-463d-b0aa-aa86eb3926ab/BUILD/php-pecl-archive-0.2/archive_writer.c:25:
/usr/include/php/Zend/zend_API.h:71:129: warning: excess elements in scalar initializer [enabled by default]
 #define ZEND_FENTRY(zend_name, name, arg_info, flags) { #zend_name, name, arg_info, (zend_uint) (sizeof(arg_info)/sizeof(struct _zend_arg_info)-1), flags },
                                                                                                                                 ^
/usr/include/php/Zend/zend_API.h:82:51: note: in expansion of macro 'ZEND_FENTRY'
 #define ZEND_ME(classname, name, arg_info, flags) ZEND_FENTRY(name, ZEND_MN(classname##_##name), arg_info, flags)
                                                   ^
/tmp/B.cdf76908-70c1-463d-b0aa-aa86eb3926ab/BUILD/php-pecl-archive-0.2/archive_writer.c:50:2: note: in expansion of macro 'ZEND_ME'
  ZEND_ME(ArchiveWriter, addEntry,  NULL, 0)
  ^
/tmp/B.cdf76908-70c1-463d-b0aa-aa86eb3926ab/BUILD/php-pecl-archive-0.2/archive_entry.c:40:2: warning: excess elements in scalar initializer [enabled by default]
/tmp/B.cdf76908-70c1-463d-b0aa-aa86eb3926ab/BUILD/php-pecl-archive-0.2/archive_entry.c:40:2: warning: (near initialization for 'funcs_ArchiveEntry[6]') [enabled by default]
/usr/include/php/Zend/zend_API.h:71:129: warning: (near initialization for 'funcs_ArchiveReaderInterface[1]') [enabled by default]
 #define ZEND_FENTRY(zend_name, name, arg_info, flags) { #zend_name, name, arg_info, (zend_uint) (sizeof(arg_info)/sizeof(struct _zend_arg_info)-1), flags },
                                                                                                                                 ^
/usr/include/php/Zend/zend_API.h:83:53: note: in expansion of macro 'ZEND_FENTRY'
 #define ZEND_ABSTRACT_ME(classname, name, arg_info) ZEND_FENTRY(name, NULL, arg_info, ZEND_ACC_PUBLIC|ZEND_ACC_ABSTRACT)
                                                     ^
/tmp/B.cdf76908-70c1-463d-b0aa-aa86eb3926ab/BUILD/php-pecl-archive-0.2/archive_reader.c:38:2: note: in expansion of macro 'ZEND_ABSTRACT_ME'
  ZEND_ABSTRACT_ME(ArchiveReader, getNextEntry,  NULL)
  ^
/tmp/B.cdf76908-70c1-463d-b0aa-aa86eb3926ab/BUILD/php-pecl-archive-0.2/archive_reader.c:39:2: warning: braces around scalar initializer [enabled by default]
  ZEND_ABSTRACT_ME(ArchiveReader, getCurrentEntryData,  NULL)
  ^
/tmp/B.cdf76908-70c1-463d-b0aa-aa86eb3926ab/BUILD/php-pecl-archive-0.2/archive_reader.c:39:2: warning: (near initialization for 'funcs_ArchiveReaderInterface[2]') [enabled by default]
/tmp/B.cdf76908-70c1-463d-b0aa-aa86eb3926ab/BUILD/php-pecl-archive-0.2/archive_reader.c:39:2: warning: initialization makes integer from pointer without a cast [enabled by default]
/usr/include/php/Zend/zend_API.h:71:129: warning: (near initialization for 'funcs_ArchiveWriter[1]') [enabled by default]
 #define ZEND_FENTRY(zend_name, name, arg_info, flags) { #zend_name, name, arg_info, (zend_uint) (sizeof(arg_info)/sizeof(struct _zend_arg_info)-1), flags },
                                                                                                                                 ^
/usr/include/php/Zend/zend_API.h:82:51: note: in expansion of macro 'ZEND_FENTRY'
 #define ZEND_ME(classname, name, arg_info, flags) ZEND_FENTRY(name, ZEND_MN(classname##_##name), arg_info, flags)
                                                   ^
/tmp/B.cdf76908-70c1-463d-b0aa-aa86eb3926ab/BUILD/php-pecl-archive-0.2/archive_writer.c:50:2: note: in expansion of macro 'ZEND_ME'
  ZEND_ME(ArchiveWriter, addEntry,  NULL, 0)
  ^
/tmp/B.cdf76908-70c1-463d-b0aa-aa86eb3926ab/BUILD/php-pecl-archive-0.2/archive_reader.c:39:2: warning: (near initialization for 'funcs_ArchiveReaderInterface[2]') [enabled by default]
/tmp/B.cdf76908-70c1-463d-b0aa-aa86eb3926ab/BUILD/php-pecl-archive-0.2/archive_reader.c:39:2: warning: excess elements in scalar initializer [enabled by default]
/tmp/B.cdf76908-70c1-463d-b0aa-aa86eb3926ab/BUILD/php-pecl-archive-0.2/archive_reader.c:39:2: warning: (near initialization for 'funcs_ArchiveReaderInterface[2]') [enabled by default]
/tmp/B.cdf76908-70c1-463d-b0aa-aa86eb3926ab/BUILD/php-pecl-archive-0.2/archive_reader.c:39:2: warning: excess elements in scalar initializer [enabled by default]
/tmp/B.cdf76908-70c1-463d-b0aa-aa86eb3926ab/BUILD/php-pecl-archive-0.2/archive_reader.c:39:2: warning: (near initialization for 'funcs_ArchiveReaderInterface[2]') [enabled by default]
In file included from /usr/include/php/main/php.h:38:0,
                 from /tmp/B.cdf76908-70c1-463d-b0aa-aa86eb3926ab/BUILD/php-pecl-archive-0.2/archive_entry.c:27:
/usr/include/php/Zend/zend_API.h:71:129: warning: excess elements in scalar initializer [enabled by default]
 #define ZEND_FENTRY(zend_name, name, arg_info, flags) { #zend_name, name, arg_info, (zend_uint) (sizeof(arg_info)/sizeof(struct _zend_arg_info)-1), flags },
                                                                                                                                 ^
/usr/include/php/Zend/zend_API.h:82:51: note: in expansion of macro 'ZEND_FENTRY'
 #define ZEND_ME(classname, name, arg_info, flags) ZEND_FENTRY(name, ZEND_MN(classname##_##name), arg_info, flags)
                                                   ^
/tmp/B.cdf76908-70c1-463d-b0aa-aa86eb3926ab/BUILD/php-pecl-archive-0.2/archive_entry.c:40:2: note: in expansion of macro 'ZEND_ME'
  ZEND_ME(ArchiveEntry, getUser,  NULL, 0)
  ^
/usr/include/php/Zend/zend_API.h:71:129: warning: excess elements in scalar initializer [enabled by default]
 #define ZEND_FENTRY(zend_name, name, arg_info, flags) { #zend_name, name, arg_info, (zend_uint) (sizeof(arg_info)/sizeof(struct _zend_arg_info)-1), flags },
                                                                                                                                 ^
/usr/include/php/Zend/zend_API.h:82:51: note: in expansion of macro 'ZEND_FENTRY'
 #define ZEND_ME(classname, name, arg_info, flags) ZEND_FENTRY(name, ZEND_MN(classname##_##name), arg_info, flags)
                                                   ^
/tmp/B.cdf76908-70c1-463d-b0aa-aa86eb3926ab/BUILD/php-pecl-archive-0.2/archive_writer.c:50:2: note: in expansion of macro 'ZEND_ME'
  ZEND_ME(ArchiveWriter, addEntry,  NULL, 0)
  ^
In file included from /usr/include/php/main/php.h:38:0,
                 from /tmp/B.cdf76908-70c1-463d-b0aa-aa86eb3926ab/BUILD/php-pecl-archive-0.2/archive_reader.c:25:
/usr/include/php/Zend/zend_API.h:71:129: warning: excess elements in scalar initializer [enabled by default]
 #define ZEND_FENTRY(zend_name, name, arg_info, flags) { #zend_name, name, arg_info, (zend_uint) (sizeof(arg_info)/sizeof(struct _zend_arg_info)-1), flags },
                                                                                                                                 ^
/usr/include/php/Zend/zend_API.h:83:53: note: in expansion of macro 'ZEND_FENTRY'
 #define ZEND_ABSTRACT_ME(classname, name, arg_info) ZEND_FENTRY(name, NULL, arg_info, ZEND_ACC_PUBLIC|ZEND_ACC_ABSTRACT)
                                                     ^
/tmp/B.cdf76908-70c1-463d-b0aa-aa86eb3926ab/BUILD/php-pecl-archive-0.2/archive_reader.c:39:2: note: in expansion of macro 'ZEND_ABSTRACT_ME'
  ZEND_ABSTRACT_ME(ArchiveReader, getCurrentEntryData,  NULL)
  ^
/usr/include/php/Zend/zend_API.h:71:129: warning: (near initialization for 'funcs_ArchiveEntry[6]') [enabled by default]
 #define ZEND_FENTRY(zend_name, name, arg_info, flags) { #zend_name, name, arg_info, (zend_uint) (sizeof(arg_info)/sizeof(struct _zend_arg_info)-1), flags },
                                                                                                                                 ^
/usr/include/php/Zend/zend_API.h:82:51: note: in expansion of macro 'ZEND_FENTRY'
 #define ZEND_ME(classname, name, arg_info, flags) ZEND_FENTRY(name, ZEND_MN(classname##_##name), arg_info, flags)
                                                   ^
/tmp/B.cdf76908-70c1-463d-b0aa-aa86eb3926ab/BUILD/php-pecl-archive-0.2/archive_entry.c:40:2: note: in expansion of macro 'ZEND_ME'
  ZEND_ME(ArchiveEntry, getUser,  NULL, 0)
  ^
/usr/include/php/Zend/zend_API.h:71:129: warning: (near initialization for 'funcs_ArchiveWriter[1]') [enabled by default]
 #define ZEND_FENTRY(zend_name, name, arg_info, flags) { #zend_name, name, arg_info, (zend_uint) (sizeof(arg_info)/sizeof(struct _zend_arg_info)-1), flags },
                                                                                                                                 ^
/usr/include/php/Zend/zend_API.h:82:51: note: in expansion of macro 'ZEND_FENTRY'
 #define ZEND_ME(classname, name, arg_info, flags) ZEND_FENTRY(name, ZEND_MN(classname##_##name), arg_info, flags)
                                                   ^
/tmp/B.cdf76908-70c1-463d-b0aa-aa86eb3926ab/BUILD/php-pecl-archive-0.2/archive_writer.c:50:2: note: in expansion of macro 'ZEND_ME'
  ZEND_ME(ArchiveWriter, addEntry,  NULL, 0)
  ^
/usr/include/php/Zend/zend_API.h:71:129: warning: (near initialization for 'funcs_ArchiveReaderInterface[2]') [enabled by default]
 #define ZEND_FENTRY(zend_name, name, arg_info, flags) { #zend_name, name, arg_info, (zend_uint) (sizeof(arg_info)/sizeof(struct _zend_arg_info)-1), flags },
                                                                                                                                 ^
/usr/include/php/Zend/zend_API.h:83:53: note: in expansion of macro 'ZEND_FENTRY'
 #define ZEND_ABSTRACT_ME(classname, name, arg_info) ZEND_FENTRY(name, NULL, arg_info, ZEND_ACC_PUBLIC|ZEND_ACC_ABSTRACT)
                                                     ^
/tmp/B.cdf76908-70c1-463d-b0aa-aa86eb3926ab/BUILD/php-pecl-archive-0.2/archive_reader.c:39:2: note: in expansion of macro 'ZEND_ABSTRACT_ME'
  ZEND_ABSTRACT_ME(ArchiveReader, getCurrentEntryData,  NULL)
  ^
/tmp/B.cdf76908-70c1-463d-b0aa-aa86eb3926ab/BUILD/php-pecl-archive-0.2/archive_writer.c:51:2: warning: braces around scalar initializer [enabled by default]
  ZEND_ME(ArchiveWriter, finish,  NULL, 0)
  ^
/tmp/B.cdf76908-70c1-463d-b0aa-aa86eb3926ab/BUILD/php-pecl-archive-0.2/archive_writer.c:51:2: warning: (near initialization for 'funcs_ArchiveWriter[2]') [enabled by default]
/usr/include/php/Zend/zend_API.h:71:129: warning: excess elements in scalar initializer [enabled by default]
 #define ZEND_FENTRY(zend_name, name, arg_info, flags) { #zend_name, name, arg_info, (zend_uint) (sizeof(arg_info)/sizeof(struct _zend_arg_info)-1), flags },
                                                                                                                                 ^
/usr/include/php/Zend/zend_API.h:82:51: note: in expansion of macro 'ZEND_FENTRY'
 #define ZEND_ME(classname, name, arg_info, flags) ZEND_FENTRY(name, ZEND_MN(classname##_##name), arg_info, flags)
                                                   ^
/tmp/B.cdf76908-70c1-463d-b0aa-aa86eb3926ab/BUILD/php-pecl-archive-0.2/archive_entry.c:40:2: note: in expansion of macro 'ZEND_ME'
  ZEND_ME(ArchiveEntry, getUser,  NULL, 0)
  ^
/tmp/B.cdf76908-70c1-463d-b0aa-aa86eb3926ab/BUILD/php-pecl-archive-0.2/archive_writer.c:51:2: warning: initialization makes integer from pointer without a cast [enabled by default]
/tmp/B.cdf76908-70c1-463d-b0aa-aa86eb3926ab/BUILD/php-pecl-archive-0.2/archive_writer.c:51:2: warning: (near initialization for 'funcs_ArchiveWriter[2]') [enabled by default]
/tmp/B.cdf76908-70c1-463d-b0aa-aa86eb3926ab/BUILD/php-pecl-archive-0.2/archive_writer.c:51:2: warning: excess elements in scalar initializer [enabled by default]
/tmp/B.cdf76908-70c1-463d-b0aa-aa86eb3926ab/BUILD/php-pecl-archive-0.2/archive_writer.c:51:2: warning: (near initialization for 'funcs_ArchiveWriter[2]') [enabled by default]
/tmp/B.cdf76908-70c1-463d-b0aa-aa86eb3926ab/BUILD/php-pecl-archive-0.2/archive_writer.c:51:2: warning: excess elements in scalar initializer [enabled by default]
/tmp/B.cdf76908-70c1-463d-b0aa-aa86eb3926ab/BUILD/php-pecl-archive-0.2/archive_writer.c:51:2: warning: (near initialization for 'funcs_ArchiveWriter[2]') [enabled by default]
/usr/include/php/Zend/zend_API.h:71:129: warning: excess elements in scalar initializer [enabled by default]
 #define ZEND_FENTRY(zend_name, name, arg_info, flags) { #zend_name, name, arg_info, (zend_uint) (sizeof(arg_info)/sizeof(struct _zend_arg_info)-1), flags },
                                                                                                                                 ^
/usr/include/php/Zend/zend_API.h:83:53: note: in expansion of macro 'ZEND_FENTRY'
 #define ZEND_ABSTRACT_ME(classname, name, arg_info) ZEND_FENTRY(name, NULL, arg_info, ZEND_ACC_PUBLIC|ZEND_ACC_ABSTRACT)
                                                     ^
/tmp/B.cdf76908-70c1-463d-b0aa-aa86eb3926ab/BUILD/php-pecl-archive-0.2/archive_reader.c:39:2: note: in expansion of macro 'ZEND_ABSTRACT_ME'
  ZEND_ABSTRACT_ME(ArchiveReader, getCurrentEntryData,  NULL)
  ^
/usr/include/php/Zend/zend_API.h:71:129: warning: (near initialization for 'funcs_ArchiveEntry[6]') [enabled by default]
 #define ZEND_FENTRY(zend_name, name, arg_info, flags) { #zend_name, name, arg_info, (zend_uint) (sizeof(arg_info)/sizeof(struct _zend_arg_info)-1), flags },
                                                                                                                                 ^
/usr/include/php/Zend/zend_API.h:82:51: note: in expansion of macro 'ZEND_FENTRY'
 #define ZEND_ME(classname, name, arg_info, flags) ZEND_FENTRY(name, ZEND_MN(classname##_##name), arg_info, flags)
                                                   ^
/tmp/B.cdf76908-70c1-463d-b0aa-aa86eb3926ab/BUILD/php-pecl-archive-0.2/archive_entry.c:40:2: note: in expansion of macro 'ZEND_ME'
  ZEND_ME(ArchiveEntry, getUser,  NULL, 0)
  ^
In file included from /usr/include/php/main/php.h:38:0,
                 from /tmp/B.cdf76908-70c1-463d-b0aa-aa86eb3926ab/BUILD/php-pecl-archive-0.2/archive_writer.c:25:
/usr/include/php/Zend/zend_API.h:71:129: warning: excess elements in scalar initializer [enabled by default]
 #define ZEND_FENTRY(zend_name, name, arg_info, flags) { #zend_name, name, arg_info, (zend_uint) (sizeof(arg_info)/sizeof(struct _zend_arg_info)-1), flags },
                                                                                                                                 ^
/usr/include/php/Zend/zend_API.h:82:51: note: in expansion of macro 'ZEND_FENTRY'
 #define ZEND_ME(classname, name, arg_info, flags) ZEND_FENTRY(name, ZEND_MN(classname##_##name), arg_info, flags)
                                                   ^
/tmp/B.cdf76908-70c1-463d-b0aa-aa86eb3926ab/BUILD/php-pecl-archive-0.2/archive_writer.c:51:2: note: in expansion of macro 'ZEND_ME'
  ZEND_ME(ArchiveWriter, finish,  NULL, 0)
  ^
/tmp/B.cdf76908-70c1-463d-b0aa-aa86eb3926ab/BUILD/php-pecl-archive-0.2/archive_entry.c:41:2: warning: braces around scalar initializer [enabled by default]
  ZEND_ME(ArchiveEntry, getGroup,  NULL, 0)
  ^
/usr/include/php/Zend/zend_API.h:71:129: warning: (near initialization for 'funcs_ArchiveReaderInterface[2]') [enabled by default]
 #define ZEND_FENTRY(zend_name, name, arg_info, flags) { #zend_name, name, arg_info, (zend_uint) (sizeof(arg_info)/sizeof(struct _zend_arg_info)-1), flags },
                                                                                                                                 ^
/usr/include/php/Zend/zend_API.h:83:53: note: in expansion of macro 'ZEND_FENTRY'
 #define ZEND_ABSTRACT_ME(classname, name, arg_info) ZEND_FENTRY(name, NULL, arg_info, ZEND_ACC_PUBLIC|ZEND_ACC_ABSTRACT)
                                                     ^
/tmp/B.cdf76908-70c1-463d-b0aa-aa86eb3926ab/BUILD/php-pecl-archive-0.2/archive_reader.c:39:2: note: in expansion of macro 'ZEND_ABSTRACT_ME'
  ZEND_ABSTRACT_ME(ArchiveReader, getCurrentEntryData,  NULL)
  ^
/tmp/B.cdf76908-70c1-463d-b0aa-aa86eb3926ab/BUILD/php-pecl-archive-0.2/archive_entry.c:41:2: warning: (near initialization for 'funcs_ArchiveEntry[7]') [enabled by default]
/tmp/B.cdf76908-70c1-463d-b0aa-aa86eb3926ab/BUILD/php-pecl-archive-0.2/archive_entry.c:41:2: warning: initialization makes integer from pointer without a cast [enabled by default]
/tmp/B.cdf76908-70c1-463d-b0aa-aa86eb3926ab/BUILD/php-pecl-archive-0.2/archive_entry.c:41:2: warning: (near initialization for 'funcs_ArchiveEntry[7]') [enabled by default]
/tmp/B.cdf76908-70c1-463d-b0aa-aa86eb3926ab/BUILD/php-pecl-archive-0.2/archive_entry.c:41:2: warning: excess elements in scalar initializer [enabled by default]
/tmp/B.cdf76908-70c1-463d-b0aa-aa86eb3926ab/BUILD/php-pecl-archive-0.2/archive_entry.c:41:2: warning: (near initialization for 'funcs_ArchiveEntry[7]') [enabled by default]
/tmp/B.cdf76908-70c1-463d-b0aa-aa86eb3926ab/BUILD/php-pecl-archive-0.2/archive_reader.c:40:2: warning: braces around scalar initializer [enabled by default]
  ZEND_ABSTRACT_ME(ArchiveReader, extractCurrentEntry,  NULL)
  ^
/tmp/B.cdf76908-70c1-463d-b0aa-aa86eb3926ab/BUILD/php-pecl-archive-0.2/archive_entry.c:41:2: warning: excess elements in scalar initializer [enabled by default]
/tmp/B.cdf76908-70c1-463d-b0aa-aa86eb3926ab/BUILD/php-pecl-archive-0.2/archive_reader.c:40:2: warning: (near initialization for 'funcs_ArchiveReaderInterface[3]') [enabled by default]
/tmp/B.cdf76908-70c1-463d-b0aa-aa86eb3926ab/BUILD/php-pecl-archive-0.2/archive_entry.c:41:2: warning: (near initialization for 'funcs_ArchiveEntry[7]') [enabled by default]
/usr/include/php/Zend/zend_API.h:71:129: warning: (near initialization for 'funcs_ArchiveWriter[2]') [enabled by default]
 #define ZEND_FENTRY(zend_name, name, arg_info, flags) { #zend_name, name, arg_info, (zend_uint) (sizeof(arg_info)/sizeof(struct _zend_arg_info)-1), flags },
                                                                                                                                 ^
/usr/include/php/Zend/zend_API.h:82:51: note: in expansion of macro 'ZEND_FENTRY'
 #define ZEND_ME(classname, name, arg_info, flags) ZEND_FENTRY(name, ZEND_MN(classname##_##name), arg_info, flags)
                                                   ^
/tmp/B.cdf76908-70c1-463d-b0aa-aa86eb3926ab/BUILD/php-pecl-archive-0.2/archive_writer.c:51:2: note: in expansion of macro 'ZEND_ME'
  ZEND_ME(ArchiveWriter, finish,  NULL, 0)
  ^
/tmp/B.cdf76908-70c1-463d-b0aa-aa86eb3926ab/BUILD/php-pecl-archive-0.2/archive_reader.c:40:2: warning: initialization makes integer from pointer without a cast [enabled by default]
/tmp/B.cdf76908-70c1-463d-b0aa-aa86eb3926ab/BUILD/php-pecl-archive-0.2/archive_reader.c:40:2: warning: (near initialization for 'funcs_ArchiveReaderInterface[3]') [enabled by default]
/tmp/B.cdf76908-70c1-463d-b0aa-aa86eb3926ab/BUILD/php-pecl-archive-0.2/archive_reader.c:40:2: warning: excess elements in scalar initializer [enabled by default]
/tmp/B.cdf76908-70c1-463d-b0aa-aa86eb3926ab/BUILD/php-pecl-archive-0.2/archive_reader.c:40:2: warning: (near initialization for 'funcs_ArchiveReaderInterface[3]') [enabled by default]
/tmp/B.cdf76908-70c1-463d-b0aa-aa86eb3926ab/BUILD/php-pecl-archive-0.2/archive_reader.c:40:2: warning: excess elements in scalar initializer [enabled by default]
/tmp/B.cdf76908-70c1-463d-b0aa-aa86eb3926ab/BUILD/php-pecl-archive-0.2/archive_reader.c:40:2: warning: (near initialization for 'funcs_ArchiveReaderInterface[3]') [enabled by default]
/usr/include/php/Zend/zend_API.h:71:129: warning: excess elements in scalar initializer [enabled by default]
 #define ZEND_FENTRY(zend_name, name, arg_info, flags) { #zend_name, name, arg_info, (zend_uint) (sizeof(arg_info)/sizeof(struct _zend_arg_info)-1), flags },
                                                                                                                                 ^
/usr/include/php/Zend/zend_API.h:82:51: note: in expansion of macro 'ZEND_FENTRY'
 #define ZEND_ME(classname, name, arg_info, flags) ZEND_FENTRY(name, ZEND_MN(classname##_##name), arg_info, flags)
                                                   ^
/tmp/B.cdf76908-70c1-463d-b0aa-aa86eb3926ab/BUILD/php-pecl-archive-0.2/archive_writer.c:51:2: note: in expansion of macro 'ZEND_ME'
  ZEND_ME(ArchiveWriter, finish,  NULL, 0)
  ^
In file included from /usr/include/php/main/php.h:38:0,
                 from /tmp/B.cdf76908-70c1-463d-b0aa-aa86eb3926ab/BUILD/php-pecl-archive-0.2/archive_entry.c:27:
/usr/include/php/Zend/zend_API.h:71:129: warning: excess elements in scalar initializer [enabled by default]
 #define ZEND_FENTRY(zend_name, name, arg_info, flags) { #zend_name, name, arg_info, (zend_uint) (sizeof(arg_info)/sizeof(struct _zend_arg_info)-1), flags },
                                                                                                                                 ^
/usr/include/php/Zend/zend_API.h:82:51: note: in expansion of macro 'ZEND_FENTRY'
 #define ZEND_ME(classname, name, arg_info, flags) ZEND_FENTRY(name, ZEND_MN(classname##_##name), arg_info, flags)
                                                   ^
/tmp/B.cdf76908-70c1-463d-b0aa-aa86eb3926ab/BUILD/php-pecl-archive-0.2/archive_entry.c:41:2: note: in expansion of macro 'ZEND_ME'
  ZEND_ME(ArchiveEntry, getGroup,  NULL, 0)
  ^
In file included from /usr/include/php/main/php.h:38:0,
                 from /tmp/B.cdf76908-70c1-463d-b0aa-aa86eb3926ab/BUILD/php-pecl-archive-0.2/archive_reader.c:25:
/usr/include/php/Zend/zend_API.h:71:129: warning: excess elements in scalar initializer [enabled by default]
 #define ZEND_FENTRY(zend_name, name, arg_info, flags) { #zend_name, name, arg_info, (zend_uint) (sizeof(arg_info)/sizeof(struct _zend_arg_info)-1), flags },
                                                                                                                                 ^
/usr/include/php/Zend/zend_API.h:83:53: note: in expansion of macro 'ZEND_FENTRY'
 #define ZEND_ABSTRACT_ME(classname, name, arg_info) ZEND_FENTRY(name, NULL, arg_info, ZEND_ACC_PUBLIC|ZEND_ACC_ABSTRACT)
                                                     ^
/tmp/B.cdf76908-70c1-463d-b0aa-aa86eb3926ab/BUILD/php-pecl-archive-0.2/archive_reader.c:40:2: note: in expansion of macro 'ZEND_ABSTRACT_ME'
  ZEND_ABSTRACT_ME(ArchiveReader, extractCurrentEntry,  NULL)
  ^
/usr/include/php/Zend/zend_API.h:71:129: warning: (near initialization for 'funcs_ArchiveWriter[2]') [enabled by default]
 #define ZEND_FENTRY(zend_name, name, arg_info, flags) { #zend_name, name, arg_info, (zend_uint) (sizeof(arg_info)/sizeof(struct _zend_arg_info)-1), flags },
                                                                                                                                 ^
/usr/include/php/Zend/zend_API.h:82:51: note: in expansion of macro 'ZEND_FENTRY'
 #define ZEND_ME(classname, name, arg_info, flags) ZEND_FENTRY(name, ZEND_MN(classname##_##name), arg_info, flags)
                                                   ^
/tmp/B.cdf76908-70c1-463d-b0aa-aa86eb3926ab/BUILD/php-pecl-archive-0.2/archive_writer.c:51:2: note: in expansion of macro 'ZEND_ME'
  ZEND_ME(ArchiveWriter, finish,  NULL, 0)
  ^
/usr/include/php/Zend/zend_API.h:71:129: warning: (near initialization for 'funcs_ArchiveEntry[7]') [enabled by default]
 #define ZEND_FENTRY(zend_name, name, arg_info, flags) { #zend_name, name, arg_info, (zend_uint) (sizeof(arg_info)/sizeof(struct _zend_arg_info)-1), flags },
                                                                                                                                 ^
/usr/include/php/Zend/zend_API.h:82:51: note: in expansion of macro 'ZEND_FENTRY'
 #define ZEND_ME(classname, name, arg_info, flags) ZEND_FENTRY(name, ZEND_MN(classname##_##name), arg_info, flags)
                                                   ^
/tmp/B.cdf76908-70c1-463d-b0aa-aa86eb3926ab/BUILD/php-pecl-archive-0.2/archive_entry.c:41:2: note: in expansion of macro 'ZEND_ME'
  ZEND_ME(ArchiveEntry, getGroup,  NULL, 0)
  ^
/tmp/B.cdf76908-70c1-463d-b0aa-aa86eb3926ab/BUILD/php-pecl-archive-0.2/archive_writer.c:52:2: warning: braces around scalar initializer [enabled by default]
  {NULL, NULL, NULL}
  ^
/tmp/B.cdf76908-70c1-463d-b0aa-aa86eb3926ab/BUILD/php-pecl-archive-0.2/archive_writer.c:52:2: warning: (near initialization for 'funcs_ArchiveWriter[3]') [enabled by default]
/usr/include/php/Zend/zend_API.h:71:129: warning: (near initialization for 'funcs_ArchiveReaderInterface[3]') [enabled by default]
 #define ZEND_FENTRY(zend_name, name, arg_info, flags) { #zend_name, name, arg_info, (zend_uint) (sizeof(arg_info)/sizeof(struct _zend_arg_info)-1), flags },
                                                                                                                                 ^
/usr/include/php/Zend/zend_API.h:83:53: note: in expansion of macro 'ZEND_FENTRY'
 #define ZEND_ABSTRACT_ME(classname, name, arg_info) ZEND_FENTRY(name, NULL, arg_info, ZEND_ACC_PUBLIC|ZEND_ACC_ABSTRACT)
                                                     ^
/tmp/B.cdf76908-70c1-463d-b0aa-aa86eb3926ab/BUILD/php-pecl-archive-0.2/archive_reader.c:40:2: note: in expansion of macro 'ZEND_ABSTRACT_ME'
  ZEND_ABSTRACT_ME(ArchiveReader, extractCurrentEntry,  NULL)
  ^
/tmp/B.cdf76908-70c1-463d-b0aa-aa86eb3926ab/BUILD/php-pecl-archive-0.2/archive_writer.c:52:2: warning: initialization makes integer from pointer without a cast [enabled by default]
/tmp/B.cdf76908-70c1-463d-b0aa-aa86eb3926ab/BUILD/php-pecl-archive-0.2/archive_writer.c:52:2: warning: (near initialization for 'funcs_ArchiveWriter[3]') [enabled by default]
/tmp/B.cdf76908-70c1-463d-b0aa-aa86eb3926ab/BUILD/php-pecl-archive-0.2/archive_writer.c:52:2: warning: excess elements in scalar initializer [enabled by default]
/tmp/B.cdf76908-70c1-463d-b0aa-aa86eb3926ab/BUILD/php-pecl-archive-0.2/archive_writer.c:52:2: warning: (near initialization for 'funcs_ArchiveWriter[3]') [enabled by default]
/tmp/B.cdf76908-70c1-463d-b0aa-aa86eb3926ab/BUILD/php-pecl-archive-0.2/archive_writer.c:52:2: warning: excess elements in scalar initializer [enabled by default]
/tmp/B.cdf76908-70c1-463d-b0aa-aa86eb3926ab/BUILD/php-pecl-archive-0.2/archive_writer.c:52:2: warning: (near initialization for 'funcs_ArchiveWriter[3]') [enabled by default]
/usr/include/php/Zend/zend_API.h:71:129: warning: excess elements in scalar initializer [enabled by default]
 #define ZEND_FENTRY(zend_name, name, arg_info, flags) { #zend_name, name, arg_info, (zend_uint) (sizeof(arg_info)/sizeof(struct _zend_arg_info)-1), flags },
                                                                                                                                 ^
/usr/include/php/Zend/zend_API.h:82:51: note: in expansion of macro 'ZEND_FENTRY'
 #define ZEND_ME(classname, name, arg_info, flags) ZEND_FENTRY(name, ZEND_MN(classname##_##name), arg_info, flags)
                                                   ^
/tmp/B.cdf76908-70c1-463d-b0aa-aa86eb3926ab/BUILD/php-pecl-archive-0.2/archive_entry.c:41:2: note: in expansion of macro 'ZEND_ME'
  ZEND_ME(ArchiveEntry, getGroup,  NULL, 0)
  ^
/usr/include/php/Zend/zend_API.h:71:129: warning: excess elements in scalar initializer [enabled by default]
 #define ZEND_FENTRY(zend_name, name, arg_info, flags) { #zend_name, name, arg_info, (zend_uint) (sizeof(arg_info)/sizeof(struct _zend_arg_info)-1), flags },
                                                                                                                                 ^
/usr/include/php/Zend/zend_API.h:83:53: note: in expansion of macro 'ZEND_FENTRY'
 #define ZEND_ABSTRACT_ME(classname, name, arg_info) ZEND_FENTRY(name, NULL, arg_info, ZEND_ACC_PUBLIC|ZEND_ACC_ABSTRACT)
                                                     ^
/tmp/B.cdf76908-70c1-463d-b0aa-aa86eb3926ab/BUILD/php-pecl-archive-0.2/archive_reader.c:40:2: note: in expansion of macro 'ZEND_ABSTRACT_ME'
  ZEND_ABSTRACT_ME(ArchiveReader, extractCurrentEntry,  NULL)
  ^
/usr/include/php/Zend/zend_API.h:71:129: warning: (near initialization for 'funcs_ArchiveEntry[7]') [enabled by default]
 #define ZEND_FENTRY(zend_name, name, arg_info, flags) { #zend_name, name, arg_info, (zend_uint) (sizeof(arg_info)/sizeof(struct _zend_arg_info)-1), flags },
                                                                                                                                 ^
/usr/include/php/Zend/zend_API.h:82:51: note: in expansion of macro 'ZEND_FENTRY'
 #define ZEND_ME(classname, name, arg_info, flags) ZEND_FENTRY(name, ZEND_MN(classname##_##name), arg_info, flags)
                                                   ^
/tmp/B.cdf76908-70c1-463d-b0aa-aa86eb3926ab/BUILD/php-pecl-archive-0.2/archive_entry.c:41:2: note: in expansion of macro 'ZEND_ME'
  ZEND_ME(ArchiveEntry, getGroup,  NULL, 0)
  ^
/usr/include/php/Zend/zend_API.h:71:129: warning: (near initialization for 'funcs_ArchiveReaderInterface[3]') [enabled by default]
 #define ZEND_FENTRY(zend_name, name, arg_info, flags) { #zend_name, name, arg_info, (zend_uint) (sizeof(arg_info)/sizeof(struct _zend_arg_info)-1), flags },
                                                                                                                                 ^
/usr/include/php/Zend/zend_API.h:83:53: note: in expansion of macro 'ZEND_FENTRY'
 #define ZEND_ABSTRACT_ME(classname, name, arg_info) ZEND_FENTRY(name, NULL, arg_info, ZEND_ACC_PUBLIC|ZEND_ACC_ABSTRACT)
                                                     ^
/tmp/B.cdf76908-70c1-463d-b0aa-aa86eb3926ab/BUILD/php-pecl-archive-0.2/archive_reader.c:40:2: note: in expansion of macro 'ZEND_ABSTRACT_ME'
  ZEND_ABSTRACT_ME(ArchiveReader, extractCurrentEntry,  NULL)
  ^
/tmp/B.cdf76908-70c1-463d-b0aa-aa86eb3926ab/BUILD/php-pecl-archive-0.2/archive_entry.c:42:2: warning: braces around scalar initializer [enabled by default]
  ZEND_ME(ArchiveEntry, getMtime,  NULL, 0)
  ^
/tmp/B.cdf76908-70c1-463d-b0aa-aa86eb3926ab/BUILD/php-pecl-archive-0.2/archive_entry.c:42:2: warning: (near initialization for 'funcs_ArchiveEntry[8]') [enabled by default]
/tmp/B.cdf76908-70c1-463d-b0aa-aa86eb3926ab/BUILD/php-pecl-archive-0.2/archive_reader.c:41:2: warning: braces around scalar initializer [enabled by default]
  ZEND_ABSTRACT_ME(ArchiveReader, close,  NULL)
  ^
/tmp/B.cdf76908-70c1-463d-b0aa-aa86eb3926ab/BUILD/php-pecl-archive-0.2/archive_entry.c:42:2: warning: initialization makes integer from pointer without a cast [enabled by default]
/tmp/B.cdf76908-70c1-463d-b0aa-aa86eb3926ab/BUILD/php-pecl-archive-0.2/archive_reader.c:41:2: warning: (near initialization for 'funcs_ArchiveReaderInterface[4]') [enabled by default]
/tmp/B.cdf76908-70c1-463d-b0aa-aa86eb3926ab/BUILD/php-pecl-archive-0.2/archive_entry.c:42:2: warning: (near initialization for 'funcs_ArchiveEntry[8]') [enabled by default]
/tmp/B.cdf76908-70c1-463d-b0aa-aa86eb3926ab/BUILD/php-pecl-archive-0.2/archive_entry.c:42:2: warning: excess elements in scalar initializer [enabled by default]
/tmp/B.cdf76908-70c1-463d-b0aa-aa86eb3926ab/BUILD/php-pecl-archive-0.2/archive_reader.c:41:2: warning: initialization makes integer from pointer without a cast [enabled by default]
/tmp/B.cdf76908-70c1-463d-b0aa-aa86eb3926ab/BUILD/php-pecl-archive-0.2/archive_entry.c:42:2: warning: (near initialization for 'funcs_ArchiveEntry[8]') [enabled by default]
/tmp/B.cdf76908-70c1-463d-b0aa-aa86eb3926ab/BUILD/php-pecl-archive-0.2/archive_reader.c:41:2: warning: (near initialization for 'funcs_ArchiveReaderInterface[4]') [enabled by default]
/tmp/B.cdf76908-70c1-463d-b0aa-aa86eb3926ab/BUILD/php-pecl-archive-0.2/archive_entry.c:42:2: warning: excess elements in scalar initializer [enabled by default]
/tmp/B.cdf76908-70c1-463d-b0aa-aa86eb3926ab/BUILD/php-pecl-archive-0.2/archive_reader.c:41:2: warning: excess elements in scalar initializer [enabled by default]
/tmp/B.cdf76908-70c1-463d-b0aa-aa86eb3926ab/BUILD/php-pecl-archive-0.2/archive_entry.c:42:2: warning: (near initialization for 'funcs_ArchiveEntry[8]') [enabled by default]
/tmp/B.cdf76908-70c1-463d-b0aa-aa86eb3926ab/BUILD/php-pecl-archive-0.2/archive_reader.c:41:2: warning: (near initialization for 'funcs_ArchiveReaderInterface[4]') [enabled by default]
/tmp/B.cdf76908-70c1-463d-b0aa-aa86eb3926ab/BUILD/php-pecl-archive-0.2/archive_reader.c:41:2: warning: excess elements in scalar initializer [enabled by default]
/tmp/B.cdf76908-70c1-463d-b0aa-aa86eb3926ab/BUILD/php-pecl-archive-0.2/archive_reader.c:41:2: warning: (near initialization for 'funcs_ArchiveReaderInterface[4]') [enabled by default]
In file included from /usr/include/php/main/php.h:38:0,
                 from /tmp/B.cdf76908-70c1-463d-b0aa-aa86eb3926ab/BUILD/php-pecl-archive-0.2/archive_writer.c:25:
/tmp/B.cdf76908-70c1-463d-b0aa-aa86eb3926ab/BUILD/php-pecl-archive-0.2/archive_writer.c: In function 'zm_startup_archive_writer':
In file included from /usr/include/php/main/php.h:38:0,
                 from /tmp/B.cdf76908-70c1-463d-b0aa-aa86eb3926ab/BUILD/php-pecl-archive-0.2/archive_entry.c:27:
/usr/include/php/Zend/zend_API.h:71:129: warning: excess elements in scalar initializer [enabled by default]
 #define ZEND_FENTRY(zend_name, name, arg_info, flags) { #zend_name, name, arg_info, (zend_uint) (sizeof(arg_info)/sizeof(struct _zend_arg_info)-1), flags },
                                                                                                                                 ^
/usr/include/php/Zend/zend_API.h:82:51: note: in expansion of macro 'ZEND_FENTRY'
 #define ZEND_ME(classname, name, arg_info, flags) ZEND_FENTRY(name, ZEND_MN(classname##_##name), arg_info, flags)
                                                   ^
/tmp/B.cdf76908-70c1-463d-b0aa-aa86eb3926ab/BUILD/php-pecl-archive-0.2/archive_entry.c:42:2: note: in expansion of macro 'ZEND_ME'
  ZEND_ME(ArchiveEntry, getMtime,  NULL, 0)
  ^
In file included from /usr/include/php/main/php.h:38:0,
                 from /tmp/B.cdf76908-70c1-463d-b0aa-aa86eb3926ab/BUILD/php-pecl-archive-0.2/archive_reader.c:25:
/usr/include/php/Zend/zend_API.h:71:129: warning: excess elements in scalar initializer [enabled by default]
 #define ZEND_FENTRY(zend_name, name, arg_info, flags) { #zend_name, name, arg_info, (zend_uint) (sizeof(arg_info)/sizeof(struct _zend_arg_info)-1), flags },
                                                                                                                                 ^
/usr/include/php/Zend/zend_API.h:83:53: note: in expansion of macro 'ZEND_FENTRY'
 #define ZEND_ABSTRACT_ME(classname, name, arg_info) ZEND_FENTRY(name, NULL, arg_info, ZEND_ACC_PUBLIC|ZEND_ACC_ABSTRACT)
                                                     ^
/tmp/B.cdf76908-70c1-463d-b0aa-aa86eb3926ab/BUILD/php-pecl-archive-0.2/archive_reader.c:41:2: note: in expansion of macro 'ZEND_ABSTRACT_ME'
  ZEND_ABSTRACT_ME(ArchiveReader, close,  NULL)
  ^
/usr/include/php/Zend/zend_API.h:71:129: warning: (near initialization for 'funcs_ArchiveEntry[8]') [enabled by default]
 #define ZEND_FENTRY(zend_name, name, arg_info, flags) { #zend_name, name, arg_info, (zend_uint) (sizeof(arg_info)/sizeof(struct _zend_arg_info)-1), flags },
                                                                                                                                 ^
/usr/include/php/Zend/zend_API.h:82:51: note: in expansion of macro 'ZEND_FENTRY'
 #define ZEND_ME(classname, name, arg_info, flags) ZEND_FENTRY(name, ZEND_MN(classname##_##name), arg_info, flags)
                                                   ^
/tmp/B.cdf76908-70c1-463d-b0aa-aa86eb3926ab/BUILD/php-pecl-archive-0.2/archive_entry.c:42:2: note: in expansion of macro 'ZEND_ME'
  ZEND_ME(ArchiveEntry, getMtime,  NULL, 0)
  ^
/usr/include/php/Zend/zend_API.h:71:129: warning: (near initialization for 'funcs_ArchiveReaderInterface[4]') [enabled by default]
 #define ZEND_FENTRY(zend_name, name, arg_info, flags) { #zend_name, name, arg_info, (zend_uint) (sizeof(arg_info)/sizeof(struct _zend_arg_info)-1), flags },
                                                                                                                                 ^
/usr/include/php/Zend/zend_API.h:83:53: note: in expansion of macro 'ZEND_FENTRY'
 #define ZEND_ABSTRACT_ME(classname, name, arg_info) ZEND_FENTRY(name, NULL, arg_info, ZEND_ACC_PUBLIC|ZEND_ACC_ABSTRACT)
                                                     ^
/tmp/B.cdf76908-70c1-463d-b0aa-aa86eb3926ab/BUILD/php-pecl-archive-0.2/archive_reader.c:41:2: note: in expansion of macro 'ZEND_ABSTRACT_ME'
  ZEND_ABSTRACT_ME(ArchiveReader, close,  NULL)
  ^
/usr/include/php/Zend/zend_API.h:71:129: warning: excess elements in scalar initializer [enabled by default]
 #define ZEND_FENTRY(zend_name, name, arg_info, flags) { #zend_name, name, arg_info, (zend_uint) (sizeof(arg_info)/sizeof(struct _zend_arg_info)-1), flags },
                                                                                                                                 ^
/usr/include/php/Zend/zend_API.h:82:51: note: in expansion of macro 'ZEND_FENTRY'
 #define ZEND_ME(classname, name, arg_info, flags) ZEND_FENTRY(name, ZEND_MN(classname##_##name), arg_info, flags)
                                                   ^
/tmp/B.cdf76908-70c1-463d-b0aa-aa86eb3926ab/BUILD/php-pecl-archive-0.2/archive_entry.c:42:2: note: in expansion of macro 'ZEND_ME'
  ZEND_ME(ArchiveEntry, getMtime,  NULL, 0)
  ^
/usr/include/php/Zend/zend_API.h:71:129: warning: excess elements in scalar initializer [enabled by default]
 #define ZEND_FENTRY(zend_name, name, arg_info, flags) { #zend_name, name, arg_info, (zend_uint) (sizeof(arg_info)/sizeof(struct _zend_arg_info)-1), flags },
                                                                                                                                 ^
/usr/include/php/Zend/zend_API.h:83:53: note: in expansion of macro 'ZEND_FENTRY'
 #define ZEND_ABSTRACT_ME(classname, name, arg_info) ZEND_FENTRY(name, NULL, arg_info, ZEND_ACC_PUBLIC|ZEND_ACC_ABSTRACT)
                                                     ^
/tmp/B.cdf76908-70c1-463d-b0aa-aa86eb3926ab/BUILD/php-pecl-archive-0.2/archive_reader.c:41:2: note: in expansion of macro 'ZEND_ABSTRACT_ME'
  ZEND_ABSTRACT_ME(ArchiveReader, close,  NULL)
  ^
/usr/include/php/Zend/zend_API.h:212:51: warning: assignment from incompatible pointer type [enabled by default]
   class_container.info.internal.builtin_functions = functions; \
                                                   ^
/usr/include/php/Zend/zend_API.h:178:3: note: in expansion of macro 'INIT_CLASS_ENTRY_INIT_METHODS'
   INIT_CLASS_ENTRY_INIT_METHODS(class_container, functions, handle_fcall, handle_propget, handle_propset, handle_propunset, handle_propisset) \
   ^
/usr/include/php/Zend/zend_API.h:216:2: note: in expansion of macro 'INIT_OVERLOADED_CLASS_ENTRY_EX'
  INIT_OVERLOADED_CLASS_ENTRY_EX(class_container, class_name, sizeof(class_name)-1, functions, handle_fcall, handle_propget, handle_propset, NULL, NULL)
  ^
/usr/include/php/Zend/zend_API.h:164:2: note: in expansion of macro 'INIT_OVERLOADED_CLASS_ENTRY'
  INIT_OVERLOADED_CLASS_ENTRY(class_container, class_name, functions, NULL, NULL, NULL)
  ^
/tmp/B.cdf76908-70c1-463d-b0aa-aa86eb3926ab/BUILD/php-pecl-archive-0.2/archive_writer.c:62:2: note: in expansion of macro 'INIT_CLASS_ENTRY'
  INIT_CLASS_ENTRY(tmp_ce_ArchiveWriterInterface, "ArchiveWriterInterface", funcs_ArchiveWriterInterface);
  ^
/usr/include/php/Zend/zend_API.h:71:129: warning: (near initialization for 'funcs_ArchiveEntry[8]') [enabled by default]
 #define ZEND_FENTRY(zend_name, name, arg_info, flags) { #zend_name, name, arg_info, (zend_uint) (sizeof(arg_info)/sizeof(struct _zend_arg_info)-1), flags },
                                                                                                                                 ^
/usr/include/php/Zend/zend_API.h:82:51: note: in expansion of macro 'ZEND_FENTRY'
 #define ZEND_ME(classname, name, arg_info, flags) ZEND_FENTRY(name, ZEND_MN(classname##_##name), arg_info, flags)
                                                   ^
/tmp/B.cdf76908-70c1-463d-b0aa-aa86eb3926ab/BUILD/php-pecl-archive-0.2/archive_entry.c:42:2: note: in expansion of macro 'ZEND_ME'
  ZEND_ME(ArchiveEntry, getMtime,  NULL, 0)
  ^
/usr/include/php/Zend/zend_API.h:71:129: warning: (near initialization for 'funcs_ArchiveReaderInterface[4]') [enabled by default]
 #define ZEND_FENTRY(zend_name, name, arg_info, flags) { #zend_name, name, arg_info, (zend_uint) (sizeof(arg_info)/sizeof(struct _zend_arg_info)-1), flags },
                                                                                                                                 ^
/usr/include/php/Zend/zend_API.h:83:53: note: in expansion of macro 'ZEND_FENTRY'
 #define ZEND_ABSTRACT_ME(classname, name, arg_info) ZEND_FENTRY(name, NULL, arg_info, ZEND_ACC_PUBLIC|ZEND_ACC_ABSTRACT)
                                                     ^
/tmp/B.cdf76908-70c1-463d-b0aa-aa86eb3926ab/BUILD/php-pecl-archive-0.2/archive_reader.c:41:2: note: in expansion of macro 'ZEND_ABSTRACT_ME'
  ZEND_ABSTRACT_ME(ArchiveReader, close,  NULL)
  ^
/tmp/B.cdf76908-70c1-463d-b0aa-aa86eb3926ab/BUILD/php-pecl-archive-0.2/archive_reader.c:42:2: warning: braces around scalar initializer [enabled by default]
  {NULL, NULL, NULL}
  ^
/tmp/B.cdf76908-70c1-463d-b0aa-aa86eb3926ab/BUILD/php-pecl-archive-0.2/archive_reader.c:42:2: warning: (near initialization for 'funcs_ArchiveReaderInterface[5]') [enabled by default]
/tmp/B.cdf76908-70c1-463d-b0aa-aa86eb3926ab/BUILD/php-pecl-archive-0.2/archive_reader.c:42:2: warning: initialization makes integer from pointer without a cast [enabled by default]
/tmp/B.cdf76908-70c1-463d-b0aa-aa86eb3926ab/BUILD/php-pecl-archive-0.2/archive_reader.c:42:2: warning: (near initialization for 'funcs_ArchiveReaderInterface[5]') [enabled by default]
/tmp/B.cdf76908-70c1-463d-b0aa-aa86eb3926ab/BUILD/php-pecl-archive-0.2/archive_reader.c:42:2: warning: excess elements in scalar initializer [enabled by default]
/tmp/B.cdf76908-70c1-463d-b0aa-aa86eb3926ab/BUILD/php-pecl-archive-0.2/archive_reader.c:42:2: warning: (near initialization for 'funcs_ArchiveReaderInterface[5]') [enabled by default]
/tmp/B.cdf76908-70c1-463d-b0aa-aa86eb3926ab/BUILD/php-pecl-archive-0.2/archive_reader.c:42:2: warning: excess elements in scalar initializer [enabled by default]
/tmp/B.cdf76908-70c1-463d-b0aa-aa86eb3926ab/BUILD/php-pecl-archive-0.2/archive_reader.c:42:2: warning: (near initialization for 'funcs_ArchiveReaderInterface[5]') [enabled by default]
/tmp/B.cdf76908-70c1-463d-b0aa-aa86eb3926ab/BUILD/php-pecl-archive-0.2/archive_reader.c:47:1: error: unknown type name 'function_entry'
 function_entry funcs_ArchiveReader[] = {
 ^
/tmp/B.cdf76908-70c1-463d-b0aa-aa86eb3926ab/BUILD/php-pecl-archive-0.2/archive_reader.c:48:3: warning: braces around scalar initializer [enabled by default]
   ZEND_ME(ArchiveReader, __construct,  NULL, 0)
   ^
/tmp/B.cdf76908-70c1-463d-b0aa-aa86eb3926ab/BUILD/php-pecl-archive-0.2/archive_reader.c:48:3: warning: (near initialization for 'funcs_ArchiveReader[0]') [enabled by default]
/tmp/B.cdf76908-70c1-463d-b0aa-aa86eb3926ab/BUILD/php-pecl-archive-0.2/archive_reader.c:48:3: warning: initialization makes integer from pointer without a cast [enabled by default]
/tmp/B.cdf76908-70c1-463d-b0aa-aa86eb3926ab/BUILD/php-pecl-archive-0.2/archive_reader.c:48:3: warning: (near initialization for 'funcs_ArchiveReader[0]') [enabled by default]
/tmp/B.cdf76908-70c1-463d-b0aa-aa86eb3926ab/BUILD/php-pecl-archive-0.2/archive_reader.c:48:3: warning: excess elements in scalar initializer [enabled by default]
/tmp/B.cdf76908-70c1-463d-b0aa-aa86eb3926ab/BUILD/php-pecl-archive-0.2/archive_reader.c:48:3: warning: (near initialization for 'funcs_ArchiveReader[0]') [enabled by default]
/tmp/B.cdf76908-70c1-463d-b0aa-aa86eb3926ab/BUILD/php-pecl-archive-0.2/archive_reader.c:48:3: warning: excess elements in scalar initializer [enabled by default]
/tmp/B.cdf76908-70c1-463d-b0aa-aa86eb3926ab/BUILD/php-pecl-archive-0.2/archive_reader.c:48:3: warning: (near initialization for 'funcs_ArchiveReader[0]') [enabled by default]
In file included from /usr/include/php/main/php.h:38:0,
                 from /tmp/B.cdf76908-70c1-463d-b0aa-aa86eb3926ab/BUILD/php-pecl-archive-0.2/archive_reader.c:25:
/usr/include/php/Zend/zend_API.h:71:129: warning: excess elements in scalar initializer [enabled by default]
 #define ZEND_FENTRY(zend_name, name, arg_info, flags) { #zend_name, name, arg_info, (zend_uint) (sizeof(arg_info)/sizeof(struct _zend_arg_info)-1), flags },
                                                                                                                                 ^
/usr/include/php/Zend/zend_API.h:82:51: note: in expansion of macro 'ZEND_FENTRY'
 #define ZEND_ME(classname, name, arg_info, flags) ZEND_FENTRY(name, ZEND_MN(classname##_##name), arg_info, flags)
                                                   ^
/tmp/B.cdf76908-70c1-463d-b0aa-aa86eb3926ab/BUILD/php-pecl-archive-0.2/archive_reader.c:48:3: note: in expansion of macro 'ZEND_ME'
   ZEND_ME(ArchiveReader, __construct,  NULL, 0)
   ^
/usr/include/php/Zend/zend_API.h:71:129: warning: (near initialization for 'funcs_ArchiveReader[0]') [enabled by default]
 #define ZEND_FENTRY(zend_name, name, arg_info, flags) { #zend_name, name, arg_info, (zend_uint) (sizeof(arg_info)/sizeof(struct _zend_arg_info)-1), flags },
                                                                                                                                 ^
/usr/include/php/Zend/zend_API.h:82:51: note: in expansion of macro 'ZEND_FENTRY'
 #define ZEND_ME(classname, name, arg_info, flags) ZEND_FENTRY(name, ZEND_MN(classname##_##name), arg_info, flags)
                                                   ^
/tmp/B.cdf76908-70c1-463d-b0aa-aa86eb3926ab/BUILD/php-pecl-archive-0.2/archive_reader.c:48:3: note: in expansion of macro 'ZEND_ME'
   ZEND_ME(ArchiveReader, __construct,  NULL, 0)
   ^
/usr/include/php/Zend/zend_API.h:71:129: warning: excess elements in scalar initializer [enabled by default]
 #define ZEND_FENTRY(zend_name, name, arg_info, flags) { #zend_name, name, arg_info, (zend_uint) (sizeof(arg_info)/sizeof(struct _zend_arg_info)-1), flags },
                                                                                                                                 ^
/usr/include/php/Zend/zend_API.h:82:51: note: in expansion of macro 'ZEND_FENTRY'
 #define ZEND_ME(classname, name, arg_info, flags) ZEND_FENTRY(name, ZEND_MN(classname##_##name), arg_info, flags)
                                                   ^
/tmp/B.cdf76908-70c1-463d-b0aa-aa86eb3926ab/BUILD/php-pecl-archive-0.2/archive_reader.c:48:3: note: in expansion of macro 'ZEND_ME'
   ZEND_ME(ArchiveReader, __construct,  NULL, 0)
   ^
/usr/include/php/Zend/zend_API.h:71:129: warning: (near initialization for 'funcs_ArchiveReader[0]') [enabled by default]
 #define ZEND_FENTRY(zend_name, name, arg_info, flags) { #zend_name, name, arg_info, (zend_uint) (sizeof(arg_info)/sizeof(struct _zend_arg_info)-1), flags },
                                                                                                                                 ^
/usr/include/php/Zend/zend_API.h:82:51: note: in expansion of macro 'ZEND_FENTRY'
 #define ZEND_ME(classname, name, arg_info, flags) ZEND_FENTRY(name, ZEND_MN(classname##_##name), arg_info, flags)
                                                   ^
/tmp/B.cdf76908-70c1-463d-b0aa-aa86eb3926ab/BUILD/php-pecl-archive-0.2/archive_reader.c:48:3: note: in expansion of macro 'ZEND_ME'
   ZEND_ME(ArchiveReader, __construct,  NULL, 0)
   ^
/tmp/B.cdf76908-70c1-463d-b0aa-aa86eb3926ab/BUILD/php-pecl-archive-0.2/archive_reader.c:49:2: warning: braces around scalar initializer [enabled by default]
  ZEND_ME(ArchiveReader, getNextEntry,  NULL, 0)
  ^
/tmp/B.cdf76908-70c1-463d-b0aa-aa86eb3926ab/BUILD/php-pecl-archive-0.2/archive_reader.c:49:2: warning: (near initialization for 'funcs_ArchiveReader[1]') [enabled by default]
/tmp/B.cdf76908-70c1-463d-b0aa-aa86eb3926ab/BUILD/php-pecl-archive-0.2/archive_reader.c:49:2: warning: initialization makes integer from pointer without a cast [enabled by default]
/tmp/B.cdf76908-70c1-463d-b0aa-aa86eb3926ab/BUILD/php-pecl-archive-0.2/archive_reader.c:49:2: warning: (near initialization for 'funcs_ArchiveReader[1]') [enabled by default]
/tmp/B.cdf76908-70c1-463d-b0aa-aa86eb3926ab/BUILD/php-pecl-archive-0.2/archive_reader.c:49:2: warning: excess elements in scalar initializer [enabled by default]
/tmp/B.cdf76908-70c1-463d-b0aa-aa86eb3926ab/BUILD/php-pecl-archive-0.2/archive_reader.c:49:2: warning: (near initialization for 'funcs_ArchiveReader[1]') [enabled by default]
/tmp/B.cdf76908-70c1-463d-b0aa-aa86eb3926ab/BUILD/php-pecl-archive-0.2/archive_reader.c:49:2: warning: excess elements in scalar initializer [enabled by default]
/tmp/B.cdf76908-70c1-463d-b0aa-aa86eb3926ab/BUILD/php-pecl-archive-0.2/archive_reader.c:49:2: warning: (near initialization for 'funcs_ArchiveReader[1]') [enabled by default]
In file included from /usr/include/php/main/php.h:38:0,
                 from /tmp/B.cdf76908-70c1-463d-b0aa-aa86eb3926ab/BUILD/php-pecl-archive-0.2/archive_reader.c:25:
/usr/include/php/Zend/zend_API.h:71:129: warning: excess elements in scalar initializer [enabled by default]
 #define ZEND_FENTRY(zend_name, name, arg_info, flags) { #zend_name, name, arg_info, (zend_uint) (sizeof(arg_info)/sizeof(struct _zend_arg_info)-1), flags },
                                                                                                                                 ^
/usr/include/php/Zend/zend_API.h:82:51: note: in expansion of macro 'ZEND_FENTRY'
 #define ZEND_ME(classname, name, arg_info, flags) ZEND_FENTRY(name, ZEND_MN(classname##_##name), arg_info, flags)
                                                   ^
/tmp/B.cdf76908-70c1-463d-b0aa-aa86eb3926ab/BUILD/php-pecl-archive-0.2/archive_reader.c:49:2: note: in expansion of macro 'ZEND_ME'
  ZEND_ME(ArchiveReader, getNextEntry,  NULL, 0)
  ^
/usr/include/php/Zend/zend_API.h:71:129: warning: (near initialization for 'funcs_ArchiveReader[1]') [enabled by default]
 #define ZEND_FENTRY(zend_name, name, arg_info, flags) { #zend_name, name, arg_info, (zend_uint) (sizeof(arg_info)/sizeof(struct _zend_arg_info)-1), flags },
                                                                                                                                 ^
/usr/include/php/Zend/zend_API.h:82:51: note: in expansion of macro 'ZEND_FENTRY'
 #define ZEND_ME(classname, name, arg_info, flags) ZEND_FENTRY(name, ZEND_MN(classname##_##name), arg_info, flags)
                                                   ^
/tmp/B.cdf76908-70c1-463d-b0aa-aa86eb3926ab/BUILD/php-pecl-archive-0.2/archive_reader.c:49:2: note: in expansion of macro 'ZEND_ME'
  ZEND_ME(ArchiveReader, getNextEntry,  NULL, 0)
  ^
/usr/include/php/Zend/zend_API.h:71:129: warning: excess elements in scalar initializer [enabled by default]
 #define ZEND_FENTRY(zend_name, name, arg_info, flags) { #zend_name, name, arg_info, (zend_uint) (sizeof(arg_info)/sizeof(struct _zend_arg_info)-1), flags },
                                                                                                                                 ^
/usr/include/php/Zend/zend_API.h:82:51: note: in expansion of macro 'ZEND_FENTRY'
 #define ZEND_ME(classname, name, arg_info, flags) ZEND_FENTRY(name, ZEND_MN(classname##_##name), arg_info, flags)
                                                   ^
/tmp/B.cdf76908-70c1-463d-b0aa-aa86eb3926ab/BUILD/php-pecl-archive-0.2/archive_reader.c:49:2: note: in expansion of macro 'ZEND_ME'
  ZEND_ME(ArchiveReader, getNextEntry,  NULL, 0)
  ^
/usr/include/php/Zend/zend_API.h:71:129: warning: (near initialization for 'funcs_ArchiveReader[1]') [enabled by default]
 #define ZEND_FENTRY(zend_name, name, arg_info, flags) { #zend_name, name, arg_info, (zend_uint) (sizeof(arg_info)/sizeof(struct _zend_arg_info)-1), flags },
                                                                                                                                 ^
/usr/include/php/Zend/zend_API.h:82:51: note: in expansion of macro 'ZEND_FENTRY'
 #define ZEND_ME(classname, name, arg_info, flags) ZEND_FENTRY(name, ZEND_MN(classname##_##name), arg_info, flags)
                                                   ^
/tmp/B.cdf76908-70c1-463d-b0aa-aa86eb3926ab/BUILD/php-pecl-archive-0.2/archive_reader.c:49:2: note: in expansion of macro 'ZEND_ME'
  ZEND_ME(ArchiveReader, getNextEntry,  NULL, 0)
  ^
/tmp/B.cdf76908-70c1-463d-b0aa-aa86eb3926ab/BUILD/php-pecl-archive-0.2/archive_reader.c:50:2: warning: braces around scalar initializer [enabled by default]
  ZEND_ME(ArchiveReader, getCurrentEntryData,  NULL, 0)
  ^
/tmp/B.cdf76908-70c1-463d-b0aa-aa86eb3926ab/BUILD/php-pecl-archive-0.2/archive_reader.c:50:2: warning: (near initialization for 'funcs_ArchiveReader[2]') [enabled by default]
/tmp/B.cdf76908-70c1-463d-b0aa-aa86eb3926ab/BUILD/php-pecl-archive-0.2/archive_reader.c:50:2: warning: initialization makes integer from pointer without a cast [enabled by default]
/tmp/B.cdf76908-70c1-463d-b0aa-aa86eb3926ab/BUILD/php-pecl-archive-0.2/archive_reader.c:50:2: warning: (near initialization for 'funcs_ArchiveReader[2]') [enabled by default]
/tmp/B.cdf76908-70c1-463d-b0aa-aa86eb3926ab/BUILD/php-pecl-archive-0.2/archive_reader.c:50:2: warning: excess elements in scalar initializer [enabled by default]
/tmp/B.cdf76908-70c1-463d-b0aa-aa86eb3926ab/BUILD/php-pecl-archive-0.2/archive_reader.c:50:2: warning: (near initialization for 'funcs_ArchiveReader[2]') [enabled by default]
/tmp/B.cdf76908-70c1-463d-b0aa-aa86eb3926ab/BUILD/php-pecl-archive-0.2/archive_reader.c:50:2: warning: excess elements in scalar initializer [enabled by default]
/tmp/B.cdf76908-70c1-463d-b0aa-aa86eb3926ab/BUILD/php-pecl-archive-0.2/archive_reader.c:50:2: warning: (near initialization for 'funcs_ArchiveReader[2]') [enabled by default]
In file included from /usr/include/php/main/php.h:38:0,
                 from /tmp/B.cdf76908-70c1-463d-b0aa-aa86eb3926ab/BUILD/php-pecl-archive-0.2/archive_reader.c:25:
/usr/include/php/Zend/zend_API.h:71:129: warning: excess elements in scalar initializer [enabled by default]
 #define ZEND_FENTRY(zend_name, name, arg_info, flags) { #zend_name, name, arg_info, (zend_uint) (sizeof(arg_info)/sizeof(struct _zend_arg_info)-1), flags },
                                                                                                                                 ^
/usr/include/php/Zend/zend_API.h:82:51: note: in expansion of macro 'ZEND_FENTRY'
 #define ZEND_ME(classname, name, arg_info, flags) ZEND_FENTRY(name, ZEND_MN(classname##_##name), arg_info, flags)
                                                   ^
/tmp/B.cdf76908-70c1-463d-b0aa-aa86eb3926ab/BUILD/php-pecl-archive-0.2/archive_reader.c:50:2: note: in expansion of macro 'ZEND_ME'
  ZEND_ME(ArchiveReader, getCurrentEntryData,  NULL, 0)
  ^
/usr/include/php/Zend/zend_API.h:71:129: warning: (near initialization for 'funcs_ArchiveReader[2]') [enabled by default]
 #define ZEND_FENTRY(zend_name, name, arg_info, flags) { #zend_name, name, arg_info, (zend_uint) (sizeof(arg_info)/sizeof(struct _zend_arg_info)-1), flags },
                                                                                                                                 ^
/usr/include/php/Zend/zend_API.h:82:51: note: in expansion of macro 'ZEND_FENTRY'
 #define ZEND_ME(classname, name, arg_info, flags) ZEND_FENTRY(name, ZEND_MN(classname##_##name), arg_info, flags)
                                                   ^
/tmp/B.cdf76908-70c1-463d-b0aa-aa86eb3926ab/BUILD/php-pecl-archive-0.2/archive_reader.c:50:2: note: in expansion of macro 'ZEND_ME'
  ZEND_ME(ArchiveReader, getCurrentEntryData,  NULL, 0)
  ^
/usr/include/php/Zend/zend_API.h:71:129: warning: excess elements in scalar initializer [enabled by default]
 #define ZEND_FENTRY(zend_name, name, arg_info, flags) { #zend_name, name, arg_info, (zend_uint) (sizeof(arg_info)/sizeof(struct _zend_arg_info)-1), flags },
                                                                                                                                 ^
/usr/include/php/Zend/zend_API.h:82:51: note: in expansion of macro 'ZEND_FENTRY'
 #define ZEND_ME(classname, name, arg_info, flags) ZEND_FENTRY(name, ZEND_MN(classname##_##name), arg_info, flags)
                                                   ^
/tmp/B.cdf76908-70c1-463d-b0aa-aa86eb3926ab/BUILD/php-pecl-archive-0.2/archive_reader.c:50:2: note: in expansion of macro 'ZEND_ME'
  ZEND_ME(ArchiveReader, getCurrentEntryData,  NULL, 0)
  ^
/usr/include/php/Zend/zend_API.h:71:129: warning: (near initialization for 'funcs_ArchiveReader[2]') [enabled by default]
 #define ZEND_FENTRY(zend_name, name, arg_info, flags) { #zend_name, name, arg_info, (zend_uint) (sizeof(arg_info)/sizeof(struct _zend_arg_info)-1), flags },
                                                                                                                                 ^
/usr/include/php/Zend/zend_API.h:82:51: note: in expansion of macro 'ZEND_FENTRY'
 #define ZEND_ME(classname, name, arg_info, flags) ZEND_FENTRY(name, ZEND_MN(classname##_##name), arg_info, flags)
                                                   ^
/tmp/B.cdf76908-70c1-463d-b0aa-aa86eb3926ab/BUILD/php-pecl-archive-0.2/archive_reader.c:50:2: note: in expansion of macro 'ZEND_ME'
  ZEND_ME(ArchiveReader, getCurrentEntryData,  NULL, 0)
  ^
/tmp/B.cdf76908-70c1-463d-b0aa-aa86eb3926ab/BUILD/php-pecl-archive-0.2/archive_reader.c:51:2: warning: braces around scalar initializer [enabled by default]
  ZEND_ME(ArchiveReader, extractCurrentEntry,  NULL, 0)
  ^
/tmp/B.cdf76908-70c1-463d-b0aa-aa86eb3926ab/BUILD/php-pecl-archive-0.2/archive_reader.c:51:2: warning: (near initialization for 'funcs_ArchiveReader[3]') [enabled by default]
/tmp/B.cdf76908-70c1-463d-b0aa-aa86eb3926ab/BUILD/php-pecl-archive-0.2/archive_reader.c:51:2: warning: initialization makes integer from pointer without a cast [enabled by default]
/tmp/B.cdf76908-70c1-463d-b0aa-aa86eb3926ab/BUILD/php-pecl-archive-0.2/archive_reader.c:51:2: warning: (near initialization for 'funcs_ArchiveReader[3]') [enabled by default]
/tmp/B.cdf76908-70c1-463d-b0aa-aa86eb3926ab/BUILD/php-pecl-archive-0.2/archive_reader.c:51:2: warning: excess elements in scalar initializer [enabled by default]
/tmp/B.cdf76908-70c1-463d-b0aa-aa86eb3926ab/BUILD/php-pecl-archive-0.2/archive_reader.c:51:2: warning: (near initialization for 'funcs_ArchiveReader[3]') [enabled by default]
/tmp/B.cdf76908-70c1-463d-b0aa-aa86eb3926ab/BUILD/php-pecl-archive-0.2/archive_reader.c:51:2: warning: excess elements in scalar initializer [enabled by default]
/tmp/B.cdf76908-70c1-463d-b0aa-aa86eb3926ab/BUILD/php-pecl-archive-0.2/archive_reader.c:51:2: warning: (near initialization for 'funcs_ArchiveReader[3]') [enabled by default]
In file included from /usr/include/php/main/php.h:38:0,
                 from /tmp/B.cdf76908-70c1-463d-b0aa-aa86eb3926ab/BUILD/php-pecl-archive-0.2/archive_reader.c:25:
/usr/include/php/Zend/zend_API.h:71:129: warning: excess elements in scalar initializer [enabled by default]
 #define ZEND_FENTRY(zend_name, name, arg_info, flags) { #zend_name, name, arg_info, (zend_uint) (sizeof(arg_info)/sizeof(struct _zend_arg_info)-1), flags },
                                                                                                                                 ^
/usr/include/php/Zend/zend_API.h:82:51: note: in expansion of macro 'ZEND_FENTRY'
 #define ZEND_ME(classname, name, arg_info, flags) ZEND_FENTRY(name, ZEND_MN(classname##_##name), arg_info, flags)
                                                   ^
/tmp/B.cdf76908-70c1-463d-b0aa-aa86eb3926ab/BUILD/php-pecl-archive-0.2/archive_reader.c:51:2: note: in expansion of macro 'ZEND_ME'
  ZEND_ME(ArchiveReader, extractCurrentEntry,  NULL, 0)
  ^
/usr/include/php/Zend/zend_API.h:71:129: warning: (near initialization for 'funcs_ArchiveReader[3]') [enabled by default]
 #define ZEND_FENTRY(zend_name, name, arg_info, flags) { #zend_name, name, arg_info, (zend_uint) (sizeof(arg_info)/sizeof(struct _zend_arg_info)-1), flags },
                                                                                                                                 ^
/usr/include/php/Zend/zend_API.h:82:51: note: in expansion of macro 'ZEND_FENTRY'
 #define ZEND_ME(classname, name, arg_info, flags) ZEND_FENTRY(name, ZEND_MN(classname##_##name), arg_info, flags)
                                                   ^
/tmp/B.cdf76908-70c1-463d-b0aa-aa86eb3926ab/BUILD/php-pecl-archive-0.2/archive_reader.c:51:2: note: in expansion of macro 'ZEND_ME'
  ZEND_ME(ArchiveReader, extractCurrentEntry,  NULL, 0)
  ^
/usr/include/php/Zend/zend_API.h:71:129: warning: excess elements in scalar initializer [enabled by default]
 #define ZEND_FENTRY(zend_name, name, arg_info, flags) { #zend_name, name, arg_info, (zend_uint) (sizeof(arg_info)/sizeof(struct _zend_arg_info)-1), flags },
                                                                                                                                 ^
/usr/include/php/Zend/zend_API.h:82:51: note: in expansion of macro 'ZEND_FENTRY'
 #define ZEND_ME(classname, name, arg_info, flags) ZEND_FENTRY(name, ZEND_MN(classname##_##name), arg_info, flags)
                                                   ^
/tmp/B.cdf76908-70c1-463d-b0aa-aa86eb3926ab/BUILD/php-pecl-archive-0.2/archive_reader.c:51:2: note: in expansion of macro 'ZEND_ME'
  ZEND_ME(ArchiveReader, extractCurrentEntry,  NULL, 0)
  ^
/usr/include/php/Zend/zend_API.h:71:129: warning: (near initialization for 'funcs_ArchiveReader[3]') [enabled by default]
 #define ZEND_FENTRY(zend_name, name, arg_info, flags) { #zend_name, name, arg_info, (zend_uint) (sizeof(arg_info)/sizeof(struct _zend_arg_info)-1), flags },
                                                                                                                                 ^
/usr/include/php/Zend/zend_API.h:82:51: note: in expansion of macro 'ZEND_FENTRY'
 #define ZEND_ME(classname, name, arg_info, flags) ZEND_FENTRY(name, ZEND_MN(classname##_##name), arg_info, flags)
                                                   ^
/tmp/B.cdf76908-70c1-463d-b0aa-aa86eb3926ab/BUILD/php-pecl-archive-0.2/archive_reader.c:51:2: note: in expansion of macro 'ZEND_ME'
  ZEND_ME(ArchiveReader, extractCurrentEntry,  NULL, 0)
  ^
/tmp/B.cdf76908-70c1-463d-b0aa-aa86eb3926ab/BUILD/php-pecl-archive-0.2/archive_reader.c:52:2: warning: braces around scalar initializer [enabled by default]
  ZEND_ME(ArchiveReader, close,  NULL, 0)
  ^
/tmp/B.cdf76908-70c1-463d-b0aa-aa86eb3926ab/BUILD/php-pecl-archive-0.2/archive_reader.c:52:2: warning: (near initialization for 'funcs_ArchiveReader[4]') [enabled by default]
/tmp/B.cdf76908-70c1-463d-b0aa-aa86eb3926ab/BUILD/php-pecl-archive-0.2/archive_reader.c:52:2: warning: initialization makes integer from pointer without a cast [enabled by default]
/tmp/B.cdf76908-70c1-463d-b0aa-aa86eb3926ab/BUILD/php-pecl-archive-0.2/archive_reader.c:52:2: warning: (near initialization for 'funcs_ArchiveReader[4]') [enabled by default]
/tmp/B.cdf76908-70c1-463d-b0aa-aa86eb3926ab/BUILD/php-pecl-archive-0.2/archive_reader.c:52:2: warning: excess elements in scalar initializer [enabled by default]
/tmp/B.cdf76908-70c1-463d-b0aa-aa86eb3926ab/BUILD/php-pecl-archive-0.2/archive_reader.c:52:2: warning: (near initialization for 'funcs_ArchiveReader[4]') [enabled by default]
/tmp/B.cdf76908-70c1-463d-b0aa-aa86eb3926ab/BUILD/php-pecl-archive-0.2/archive_reader.c:52:2: warning: excess elements in scalar initializer [enabled by default]
/tmp/B.cdf76908-70c1-463d-b0aa-aa86eb3926ab/BUILD/php-pecl-archive-0.2/archive_reader.c:52:2: warning: (near initialization for 'funcs_ArchiveReader[4]') [enabled by default]
In file included from /usr/include/php/main/php.h:38:0,
                 from /tmp/B.cdf76908-70c1-463d-b0aa-aa86eb3926ab/BUILD/php-pecl-archive-0.2/archive_reader.c:25:
/usr/include/php/Zend/zend_API.h:71:129: warning: excess elements in scalar initializer [enabled by default]
 #define ZEND_FENTRY(zend_name, name, arg_info, flags) { #zend_name, name, arg_info, (zend_uint) (sizeof(arg_info)/sizeof(struct _zend_arg_info)-1), flags },
                                                                                                                                 ^
/usr/include/php/Zend/zend_API.h:82:51: note: in expansion of macro 'ZEND_FENTRY'
 #define ZEND_ME(classname, name, arg_info, flags) ZEND_FENTRY(name, ZEND_MN(classname##_##name), arg_info, flags)
                                                   ^
/tmp/B.cdf76908-70c1-463d-b0aa-aa86eb3926ab/BUILD/php-pecl-archive-0.2/archive_reader.c:52:2: note: in expansion of macro 'ZEND_ME'
  ZEND_ME(ArchiveReader, close,  NULL, 0)
  ^
/usr/include/php/Zend/zend_API.h:71:129: warning: (near initialization for 'funcs_ArchiveReader[4]') [enabled by default]
 #define ZEND_FENTRY(zend_name, name, arg_info, flags) { #zend_name, name, arg_info, (zend_uint) (sizeof(arg_info)/sizeof(struct _zend_arg_info)-1), flags },
                                                                                                                                 ^
/usr/include/php/Zend/zend_API.h:82:51: note: in expansion of macro 'ZEND_FENTRY'
 #define ZEND_ME(classname, name, arg_info, flags) ZEND_FENTRY(name, ZEND_MN(classname##_##name), arg_info, flags)
                                                   ^
/tmp/B.cdf76908-70c1-463d-b0aa-aa86eb3926ab/BUILD/php-pecl-archive-0.2/archive_reader.c:52:2: note: in expansion of macro 'ZEND_ME'
  ZEND_ME(ArchiveReader, close,  NULL, 0)
  ^
/usr/include/php/Zend/zend_API.h:71:129: warning: excess elements in scalar initializer [enabled by default]
 #define ZEND_FENTRY(zend_name, name, arg_info, flags) { #zend_name, name, arg_info, (zend_uint) (sizeof(arg_info)/sizeof(struct _zend_arg_info)-1), flags },
                                                                                                                                 ^
/usr/include/php/Zend/zend_API.h:82:51: note: in expansion of macro 'ZEND_FENTRY'
 #define ZEND_ME(classname, name, arg_info, flags) ZEND_FENTRY(name, ZEND_MN(classname##_##name), arg_info, flags)
                                                   ^
/tmp/B.cdf76908-70c1-463d-b0aa-aa86eb3926ab/BUILD/php-pecl-archive-0.2/archive_reader.c:52:2: note: in expansion of macro 'ZEND_ME'
  ZEND_ME(ArchiveReader, close,  NULL, 0)
  ^
/usr/include/php/Zend/zend_API.h:71:129: warning: (near initialization for 'funcs_ArchiveReader[4]') [enabled by default]
 #define ZEND_FENTRY(zend_name, name, arg_info, flags) { #zend_name, name, arg_info, (zend_uint) (sizeof(arg_info)/sizeof(struct _zend_arg_info)-1), flags },
                                                                                                                                 ^
/usr/include/php/Zend/zend_API.h:82:51: note: in expansion of macro 'ZEND_FENTRY'
 #define ZEND_ME(classname, name, arg_info, flags) ZEND_FENTRY(name, ZEND_MN(classname##_##name), arg_info, flags)
                                                   ^
/tmp/B.cdf76908-70c1-463d-b0aa-aa86eb3926ab/BUILD/php-pecl-archive-0.2/archive_reader.c:52:2: note: in expansion of macro 'ZEND_ME'
  ZEND_ME(ArchiveReader, close,  NULL, 0)
  ^
/tmp/B.cdf76908-70c1-463d-b0aa-aa86eb3926ab/BUILD/php-pecl-archive-0.2/archive_reader.c:53:2: warning: braces around scalar initializer [enabled by default]
  {NULL, NULL, NULL}
  ^
/tmp/B.cdf76908-70c1-463d-b0aa-aa86eb3926ab/BUILD/php-pecl-archive-0.2/archive_reader.c:53:2: warning: (near initialization for 'funcs_ArchiveReader[5]') [enabled by default]
/tmp/B.cdf76908-70c1-463d-b0aa-aa86eb3926ab/BUILD/php-pecl-archive-0.2/archive_reader.c:53:2: warning: initialization makes integer from pointer without a cast [enabled by default]
/tmp/B.cdf76908-70c1-463d-b0aa-aa86eb3926ab/BUILD/php-pecl-archive-0.2/archive_reader.c:53:2: warning: (near initialization for 'funcs_ArchiveReader[5]') [enabled by default]
/tmp/B.cdf76908-70c1-463d-b0aa-aa86eb3926ab/BUILD/php-pecl-archive-0.2/archive_reader.c:53:2: warning: excess elements in scalar initializer [enabled by default]
/tmp/B.cdf76908-70c1-463d-b0aa-aa86eb3926ab/BUILD/php-pecl-archive-0.2/archive_reader.c:53:2: warning: (near initialization for 'funcs_ArchiveReader[5]') [enabled by default]
/tmp/B.cdf76908-70c1-463d-b0aa-aa86eb3926ab/BUILD/php-pecl-archive-0.2/archive_reader.c:53:2: warning: excess elements in scalar initializer [enabled by default]
/tmp/B.cdf76908-70c1-463d-b0aa-aa86eb3926ab/BUILD/php-pecl-archive-0.2/archive_reader.c:53:2: warning: (near initialization for 'funcs_ArchiveReader[5]') [enabled by default]
In file included from /usr/include/php/main/php.h:38:0,
                 from /tmp/B.cdf76908-70c1-463d-b0aa-aa86eb3926ab/BUILD/php-pecl-archive-0.2/archive_reader.c:25:
/tmp/B.cdf76908-70c1-463d-b0aa-aa86eb3926ab/BUILD/php-pecl-archive-0.2/archive_reader.c: In function 'zm_startup_archive_reader':
/usr/include/php/Zend/zend_API.h:212:51: warning: assignment from incompatible pointer type [enabled by default]
   class_container.info.internal.builtin_functions = functions; \
                                                   ^
/usr/include/php/Zend/zend_API.h:178:3: note: in expansion of macro 'INIT_CLASS_ENTRY_INIT_METHODS'
   INIT_CLASS_ENTRY_INIT_METHODS(class_container, functions, handle_fcall, handle_propget, handle_propset, handle_propunset, handle_propisset) \
   ^
/usr/include/php/Zend/zend_API.h:216:2: note: in expansion of macro 'INIT_OVERLOADED_CLASS_ENTRY_EX'
  INIT_OVERLOADED_CLASS_ENTRY_EX(class_container, class_name, sizeof(class_name)-1, functions, handle_fcall, handle_propget, handle_propset, NULL, NULL)
  ^
/usr/include/php/Zend/zend_API.h:164:2: note: in expansion of macro 'INIT_OVERLOADED_CLASS_ENTRY'
  INIT_OVERLOADED_CLASS_ENTRY(class_container, class_name, functions, NULL, NULL, NULL)
  ^
/tmp/B.cdf76908-70c1-463d-b0aa-aa86eb3926ab/BUILD/php-pecl-archive-0.2/archive_reader.c:63:2: note: in expansion of macro 'INIT_CLASS_ENTRY'
  INIT_CLASS_ENTRY(tmp_ce_ArchiveReaderInterface, "ArchiveReaderInterface", funcs_ArchiveReaderInterface);
  ^
/tmp/B.cdf76908-70c1-463d-b0aa-aa86eb3926ab/BUILD/php-pecl-archive-0.2/archive_entry.c:43:2: warning: braces around scalar initializer [enabled by default]
  ZEND_ME(ArchiveEntry, getSize,  NULL, 0)
  ^
/tmp/B.cdf76908-70c1-463d-b0aa-aa86eb3926ab/BUILD/php-pecl-archive-0.2/archive_entry.c:43:2: warning: (near initialization for 'funcs_ArchiveEntry[9]') [enabled by default]
/tmp/B.cdf76908-70c1-463d-b0aa-aa86eb3926ab/BUILD/php-pecl-archive-0.2/archive_entry.c:43:2: warning: initialization makes integer from pointer without a cast [enabled by default]
/tmp/B.cdf76908-70c1-463d-b0aa-aa86eb3926ab/BUILD/php-pecl-archive-0.2/archive_entry.c:43:2: warning: (near initialization for 'funcs_ArchiveEntry[9]') [enabled by default]
/tmp/B.cdf76908-70c1-463d-b0aa-aa86eb3926ab/BUILD/php-pecl-archive-0.2/archive_entry.c:43:2: warning: excess elements in scalar initializer [enabled by default]
/tmp/B.cdf76908-70c1-463d-b0aa-aa86eb3926ab/BUILD/php-pecl-archive-0.2/archive_entry.c:43:2: warning: (near initialization for 'funcs_ArchiveEntry[9]') [enabled by default]
/tmp/B.cdf76908-70c1-463d-b0aa-aa86eb3926ab/BUILD/php-pecl-archive-0.2/archive_entry.c:43:2: warning: excess elements in scalar initializer [enabled by default]
/tmp/B.cdf76908-70c1-463d-b0aa-aa86eb3926ab/BUILD/php-pecl-archive-0.2/archive_entry.c:43:2: warning: (near initialization for 'funcs_ArchiveEntry[9]') [enabled by default]
In file included from /usr/include/php/main/php.h:38:0,
                 from /tmp/B.cdf76908-70c1-463d-b0aa-aa86eb3926ab/BUILD/php-pecl-archive-0.2/archive_entry.c:27:
/usr/include/php/Zend/zend_API.h:71:129: warning: excess elements in scalar initializer [enabled by default]
 #define ZEND_FENTRY(zend_name, name, arg_info, flags) { #zend_name, name, arg_info, (zend_uint) (sizeof(arg_info)/sizeof(struct _zend_arg_info)-1), flags },
                                                                                                                                 ^
/usr/include/php/Zend/zend_API.h:82:51: note: in expansion of macro 'ZEND_FENTRY'
 #define ZEND_ME(classname, name, arg_info, flags) ZEND_FENTRY(name, ZEND_MN(classname##_##name), arg_info, flags)
                                                   ^
/tmp/B.cdf76908-70c1-463d-b0aa-aa86eb3926ab/BUILD/php-pecl-archive-0.2/archive_entry.c:43:2: note: in expansion of macro 'ZEND_ME'
  ZEND_ME(ArchiveEntry, getSize,  NULL, 0)
  ^
/usr/include/php/Zend/zend_API.h:71:129: warning: (near initialization for 'funcs_ArchiveEntry[9]') [enabled by default]
 #define ZEND_FENTRY(zend_name, name, arg_info, flags) { #zend_name, name, arg_info, (zend_uint) (sizeof(arg_info)/sizeof(struct _zend_arg_info)-1), flags },
                                                                                                                                 ^
/usr/include/php/Zend/zend_API.h:82:51: note: in expansion of macro 'ZEND_FENTRY'
 #define ZEND_ME(classname, name, arg_info, flags) ZEND_FENTRY(name, ZEND_MN(classname##_##name), arg_info, flags)
                                                   ^
/tmp/B.cdf76908-70c1-463d-b0aa-aa86eb3926ab/BUILD/php-pecl-archive-0.2/archive_entry.c:43:2: note: in expansion of macro 'ZEND_ME'
  ZEND_ME(ArchiveEntry, getSize,  NULL, 0)
  ^
/usr/include/php/Zend/zend_API.h:71:129: warning: excess elements in scalar initializer [enabled by default]
 #define ZEND_FENTRY(zend_name, name, arg_info, flags) { #zend_name, name, arg_info, (zend_uint) (sizeof(arg_info)/sizeof(struct _zend_arg_info)-1), flags },
                                                                                                                                 ^
/usr/include/php/Zend/zend_API.h:82:51: note: in expansion of macro 'ZEND_FENTRY'
 #define ZEND_ME(classname, name, arg_info, flags) ZEND_FENTRY(name, ZEND_MN(classname##_##name), arg_info, flags)
                                                   ^
/tmp/B.cdf76908-70c1-463d-b0aa-aa86eb3926ab/BUILD/php-pecl-archive-0.2/archive_entry.c:43:2: note: in expansion of macro 'ZEND_ME'
  ZEND_ME(ArchiveEntry, getSize,  NULL, 0)
  ^
/usr/include/php/Zend/zend_API.h:212:51: warning: assignment from incompatible pointer type [enabled by default]
   class_container.info.internal.builtin_functions = functions; \
                                                   ^
/usr/include/php/Zend/zend_API.h:178:3: note: in expansion of macro 'INIT_CLASS_ENTRY_INIT_METHODS'
   INIT_CLASS_ENTRY_INIT_METHODS(class_container, functions, handle_fcall, handle_propget, handle_propset, handle_propunset, handle_propisset) \
   ^
/usr/include/php/Zend/zend_API.h:216:2: note: in expansion of macro 'INIT_OVERLOADED_CLASS_ENTRY_EX'
  INIT_OVERLOADED_CLASS_ENTRY_EX(class_container, class_name, sizeof(class_name)-1, functions, handle_fcall, handle_propget, handle_propset, NULL, NULL)
  ^
/usr/include/php/Zend/zend_API.h:164:2: note: in expansion of macro 'INIT_OVERLOADED_CLASS_ENTRY'
  INIT_OVERLOADED_CLASS_ENTRY(class_container, class_name, functions, NULL, NULL, NULL)
  ^
/tmp/B.cdf76908-70c1-463d-b0aa-aa86eb3926ab/BUILD/php-pecl-archive-0.2/archive_writer.c:66:2: note: in expansion of macro 'INIT_CLASS_ENTRY'
  INIT_CLASS_ENTRY(tmp_ce_ArchiveWriter, "ArchiveWriter", funcs_ArchiveWriter);
  ^
/usr/include/php/Zend/zend_API.h:71:129: warning: (near initialization for 'funcs_ArchiveEntry[9]') [enabled by default]
 #define ZEND_FENTRY(zend_name, name, arg_info, flags) { #zend_name, name, arg_info, (zend_uint) (sizeof(arg_info)/sizeof(struct _zend_arg_info)-1), flags },
                                                                                                                                 ^
/usr/include/php/Zend/zend_API.h:82:51: note: in expansion of macro 'ZEND_FENTRY'
 #define ZEND_ME(classname, name, arg_info, flags) ZEND_FENTRY(name, ZEND_MN(classname##_##name), arg_info, flags)
                                                   ^
/tmp/B.cdf76908-70c1-463d-b0aa-aa86eb3926ab/BUILD/php-pecl-archive-0.2/archive_entry.c:43:2: note: in expansion of macro 'ZEND_ME'
  ZEND_ME(ArchiveEntry, getSize,  NULL, 0)
  ^
/tmp/B.cdf76908-70c1-463d-b0aa-aa86eb3926ab/BUILD/php-pecl-archive-0.2/archive_writer.c: In function 'zim_ArchiveWriter___construct':
/tmp/B.cdf76908-70c1-463d-b0aa-aa86eb3926ab/BUILD/php-pecl-archive-0.2/archive_entry.c:44:2: warning: braces around scalar initializer [enabled by default]
  ZEND_ME(ArchiveEntry, getPerms,  NULL, 0)
  ^
/tmp/B.cdf76908-70c1-463d-b0aa-aa86eb3926ab/BUILD/php-pecl-archive-0.2/archive_entry.c:44:2: warning: (near initialization for 'funcs_ArchiveEntry[10]') [enabled by default]
/tmp/B.cdf76908-70c1-463d-b0aa-aa86eb3926ab/BUILD/php-pecl-archive-0.2/archive_entry.c:44:2: warning: initialization makes integer from pointer without a cast [enabled by default]
/tmp/B.cdf76908-70c1-463d-b0aa-aa86eb3926ab/BUILD/php-pecl-archive-0.2/archive_entry.c:44:2: warning: (near initialization for 'funcs_ArchiveEntry[10]') [enabled by default]
/tmp/B.cdf76908-70c1-463d-b0aa-aa86eb3926ab/BUILD/php-pecl-archive-0.2/archive_writer.c:87:2: warning: 'php_set_error_handling' is deprecated (declared at /usr/include/php/main/php.h:293) [-Wdeprecated-declarations]
  php_set_error_handling(EH_THROW, ce_ArchiveException TSRMLS_CC);
  ^
/tmp/B.cdf76908-70c1-463d-b0aa-aa86eb3926ab/BUILD/php-pecl-archive-0.2/archive_entry.c:44:2: warning: excess elements in scalar initializer [enabled by default]
/tmp/B.cdf76908-70c1-463d-b0aa-aa86eb3926ab/BUILD/php-pecl-archive-0.2/archive_entry.c:44:2: warning: (near initialization for 'funcs_ArchiveEntry[10]') [enabled by default]
/tmp/B.cdf76908-70c1-463d-b0aa-aa86eb3926ab/BUILD/php-pecl-archive-0.2/archive_entry.c:44:2: warning: excess elements in scalar initializer [enabled by default]
/tmp/B.cdf76908-70c1-463d-b0aa-aa86eb3926ab/BUILD/php-pecl-archive-0.2/archive_entry.c:44:2: warning: (near initialization for 'funcs_ArchiveEntry[10]') [enabled by default]
/tmp/B.cdf76908-70c1-463d-b0aa-aa86eb3926ab/BUILD/php-pecl-archive-0.2/archive_writer.c:90:3: warning: 'php_set_error_handling' is deprecated (declared at /usr/include/php/main/php.h:293) [-Wdeprecated-declarations]
   php_set_error_handling(EH_NORMAL, NULL TSRMLS_CC);
   ^
In file included from /usr/include/php/main/php.h:38:0,
                 from /tmp/B.cdf76908-70c1-463d-b0aa-aa86eb3926ab/BUILD/php-pecl-archive-0.2/archive_entry.c:27:
/usr/include/php/Zend/zend_API.h:71:129: warning: excess elements in scalar initializer [enabled by default]
 #define ZEND_FENTRY(zend_name, name, arg_info, flags) { #zend_name, name, arg_info, (zend_uint) (sizeof(arg_info)/sizeof(struct _zend_arg_info)-1), flags },
                                                                                                                                 ^
/usr/include/php/Zend/zend_API.h:82:51: note: in expansion of macro 'ZEND_FENTRY'
 #define ZEND_ME(classname, name, arg_info, flags) ZEND_FENTRY(name, ZEND_MN(classname##_##name), arg_info, flags)
                                                   ^
/tmp/B.cdf76908-70c1-463d-b0aa-aa86eb3926ab/BUILD/php-pecl-archive-0.2/archive_entry.c:44:2: note: in expansion of macro 'ZEND_ME'
  ZEND_ME(ArchiveEntry, getPerms,  NULL, 0)
  ^
In file included from /usr/include/php/main/fopen_wrappers.h:25:0,
                 from /usr/include/php/main/php.h:397,
                 from /tmp/B.cdf76908-70c1-463d-b0aa-aa86eb3926ab/BUILD/php-pecl-archive-0.2/archive_writer.c:25:
/usr/include/php/main/php_globals.h:32:29: error: 'struct _php_core_globals' has no member named 'safe_mode'
 # define PG(v) (core_globals.v)
                             ^
/tmp/B.cdf76908-70c1-463d-b0aa-aa86eb3926ab/BUILD/php-pecl-archive-0.2/archive_writer.c:94:6: note: in expansion of macro 'PG'
  if (PG(safe_mode) && (!php_checkuid(filename, NULL, CHECKUID_CHECK_FILE_AND_DIR))) {
      ^
/usr/include/php/Zend/zend_API.h:71:129: warning: (near initialization for 'funcs_ArchiveEntry[10]') [enabled by default]
 #define ZEND_FENTRY(zend_name, name, arg_info, flags) { #zend_name, name, arg_info, (zend_uint) (sizeof(arg_info)/sizeof(struct _zend_arg_info)-1), flags },
                                                                                                                                 ^
/usr/include/php/Zend/zend_API.h:82:51: note: in expansion of macro 'ZEND_FENTRY'
 #define ZEND_ME(classname, name, arg_info, flags) ZEND_FENTRY(name, ZEND_MN(classname##_##name), arg_info, flags)
                                                   ^
/tmp/B.cdf76908-70c1-463d-b0aa-aa86eb3926ab/BUILD/php-pecl-archive-0.2/archive_entry.c:44:2: note: in expansion of macro 'ZEND_ME'
  ZEND_ME(ArchiveEntry, getPerms,  NULL, 0)
  ^
/tmp/B.cdf76908-70c1-463d-b0aa-aa86eb3926ab/BUILD/php-pecl-archive-0.2/archive_writer.c:94:54: error: 'CHECKUID_CHECK_FILE_AND_DIR' undeclared (first use in this function)
  if (PG(safe_mode) && (!php_checkuid(filename, NULL, CHECKUID_CHECK_FILE_AND_DIR))) {
                                                      ^
/tmp/B.cdf76908-70c1-463d-b0aa-aa86eb3926ab/BUILD/php-pecl-archive-0.2/archive_writer.c:94:54: note: each undeclared identifier is reported only once for each function it appears in
/tmp/B.cdf76908-70c1-463d-b0aa-aa86eb3926ab/BUILD/php-pecl-archive-0.2/archive_writer.c:95:3: warning: 'php_set_error_handling' is deprecated (declared at /usr/include/php/main/php.h:293) [-Wdeprecated-declarations]
   php_set_error_handling(EH_NORMAL, NULL TSRMLS_CC);
   ^
/usr/include/php/Zend/zend_API.h:71:129: warning: excess elements in scalar initializer [enabled by default]
 #define ZEND_FENTRY(zend_name, name, arg_info, flags) { #zend_name, name, arg_info, (zend_uint) (sizeof(arg_info)/sizeof(struct _zend_arg_info)-1), flags },
                                                                                                                                 ^
/usr/include/php/Zend/zend_API.h:82:51: note: in expansion of macro 'ZEND_FENTRY'
 #define ZEND_ME(classname, name, arg_info, flags) ZEND_FENTRY(name, ZEND_MN(classname##_##name), arg_info, flags)
                                                   ^
/tmp/B.cdf76908-70c1-463d-b0aa-aa86eb3926ab/BUILD/php-pecl-archive-0.2/archive_entry.c:44:2: note: in expansion of macro 'ZEND_ME'
  ZEND_ME(ArchiveEntry, getPerms,  NULL, 0)
  ^
/tmp/B.cdf76908-70c1-463d-b0aa-aa86eb3926ab/BUILD/php-pecl-archive-0.2/archive_writer.c:100:3: warning: 'php_set_error_handling' is deprecated (declared at /usr/include/php/main/php.h:293) [-Wdeprecated-declarations]
   php_set_error_handling(EH_NORMAL, NULL TSRMLS_CC);
   ^
/usr/include/php/Zend/zend_API.h:71:129: warning: (near initialization for 'funcs_ArchiveEntry[10]') [enabled by default]
 #define ZEND_FENTRY(zend_name, name, arg_info, flags) { #zend_name, name, arg_info, (zend_uint) (sizeof(arg_info)/sizeof(struct _zend_arg_info)-1), flags },
                                                                                                                                 ^
/usr/include/php/Zend/zend_API.h:82:51: note: in expansion of macro 'ZEND_FENTRY'
 #define ZEND_ME(classname, name, arg_info, flags) ZEND_FENTRY(name, ZEND_MN(classname##_##name), arg_info, flags)
                                                   ^
/tmp/B.cdf76908-70c1-463d-b0aa-aa86eb3926ab/BUILD/php-pecl-archive-0.2/archive_entry.c:44:2: note: in expansion of macro 'ZEND_ME'
  ZEND_ME(ArchiveEntry, getPerms,  NULL, 0)
  ^
/tmp/B.cdf76908-70c1-463d-b0aa-aa86eb3926ab/BUILD/php-pecl-archive-0.2/archive_entry.c:45:2: warning: braces around scalar initializer [enabled by default]
  ZEND_ME(ArchiveEntry, getData,  NULL, 0)
  ^
/tmp/B.cdf76908-70c1-463d-b0aa-aa86eb3926ab/BUILD/php-pecl-archive-0.2/archive_entry.c:45:2: warning: (near initialization for 'funcs_ArchiveEntry[11]') [enabled by default]
/tmp/B.cdf76908-70c1-463d-b0aa-aa86eb3926ab/BUILD/php-pecl-archive-0.2/archive_entry.c:45:2: warning: initialization makes integer from pointer without a cast [enabled by default]
/tmp/B.cdf76908-70c1-463d-b0aa-aa86eb3926ab/BUILD/php-pecl-archive-0.2/archive_entry.c:45:2: warning: (near initialization for 'funcs_ArchiveEntry[11]') [enabled by default]
/tmp/B.cdf76908-70c1-463d-b0aa-aa86eb3926ab/BUILD/php-pecl-archive-0.2/archive_entry.c:45:2: warning: excess elements in scalar initializer [enabled by default]
/tmp/B.cdf76908-70c1-463d-b0aa-aa86eb3926ab/BUILD/php-pecl-archive-0.2/archive_entry.c:45:2: warning: (near initialization for 'funcs_ArchiveEntry[11]') [enabled by default]
/tmp/B.cdf76908-70c1-463d-b0aa-aa86eb3926ab/BUILD/php-pecl-archive-0.2/archive_entry.c:45:2: warning: excess elements in scalar initializer [enabled by default]
/tmp/B.cdf76908-70c1-463d-b0aa-aa86eb3926ab/BUILD/php-pecl-archive-0.2/archive_entry.c:45:2: warning: (near initialization for 'funcs_ArchiveEntry[11]') [enabled by default]
/tmp/B.cdf76908-70c1-463d-b0aa-aa86eb3926ab/BUILD/php-pecl-archive-0.2/archive_writer.c:119:4: warning: 'archive_write_set_compression_gzip' is deprecated (declared at /usr/include/archive.h:622) [-Wdeprecated-declarations]
    archive_write_set_compression_gzip(arch->arch);
    ^
/tmp/B.cdf76908-70c1-463d-b0aa-aa86eb3926ab/BUILD/php-pecl-archive-0.2/archive_writer.c:131:4: warning: 'archive_write_set_compression_bzip2' is deprecated (declared at /usr/include/archive.h:618) [-Wdeprecated-declarations]
    archive_write_set_compression_bzip2(arch->arch);
    ^
In file included from /usr/include/php/main/php.h:38:0,
                 from /tmp/B.cdf76908-70c1-463d-b0aa-aa86eb3926ab/BUILD/php-pecl-archive-0.2/archive_entry.c:27:
/usr/include/php/Zend/zend_API.h:71:129: warning: excess elements in scalar initializer [enabled by default]
 #define ZEND_FENTRY(zend_name, name, arg_info, flags) { #zend_name, name, arg_info, (zend_uint) (sizeof(arg_info)/sizeof(struct _zend_arg_info)-1), flags },
                                                                                                                                 ^
/usr/include/php/Zend/zend_API.h:82:51: note: in expansion of macro 'ZEND_FENTRY'
 #define ZEND_ME(classname, name, arg_info, flags) ZEND_FENTRY(name, ZEND_MN(classname##_##name), arg_info, flags)
                                                   ^
/tmp/B.cdf76908-70c1-463d-b0aa-aa86eb3926ab/BUILD/php-pecl-archive-0.2/archive_entry.c:45:2: note: in expansion of macro 'ZEND_ME'
  ZEND_ME(ArchiveEntry, getData,  NULL, 0)
  ^
/tmp/B.cdf76908-70c1-463d-b0aa-aa86eb3926ab/BUILD/php-pecl-archive-0.2/archive_writer.c:146:4: warning: 'php_set_error_handling' is deprecated (declared at /usr/include/php/main/php.h:293) [-Wdeprecated-declarations]
    php_set_error_handling(EH_NORMAL, NULL TSRMLS_CC);
    ^
/usr/include/php/Zend/zend_API.h:71:129: warning: (near initialization for 'funcs_ArchiveEntry[11]') [enabled by default]
 #define ZEND_FENTRY(zend_name, name, arg_info, flags) { #zend_name, name, arg_info, (zend_uint) (sizeof(arg_info)/sizeof(struct _zend_arg_info)-1), flags },
                                                                                                                                 ^
/usr/include/php/Zend/zend_API.h:82:51: note: in expansion of macro 'ZEND_FENTRY'
 #define ZEND_ME(classname, name, arg_info, flags) ZEND_FENTRY(name, ZEND_MN(classname##_##name), arg_info, flags)
                                                   ^
/tmp/B.cdf76908-70c1-463d-b0aa-aa86eb3926ab/BUILD/php-pecl-archive-0.2/archive_entry.c:45:2: note: in expansion of macro 'ZEND_ME'
  ZEND_ME(ArchiveEntry, getData,  NULL, 0)
  ^
/usr/include/php/Zend/zend_API.h:71:129: warning: excess elements in scalar initializer [enabled by default]
 #define ZEND_FENTRY(zend_name, name, arg_info, flags) { #zend_name, name, arg_info, (zend_uint) (sizeof(arg_info)/sizeof(struct _zend_arg_info)-1), flags },
                                                                                                                                 ^
/usr/include/php/Zend/zend_API.h:82:51: note: in expansion of macro 'ZEND_FENTRY'
 #define ZEND_ME(classname, name, arg_info, flags) ZEND_FENTRY(name, ZEND_MN(classname##_##name), arg_info, flags)
                                                   ^
/tmp/B.cdf76908-70c1-463d-b0aa-aa86eb3926ab/BUILD/php-pecl-archive-0.2/archive_entry.c:45:2: note: in expansion of macro 'ZEND_ME'
  ZEND_ME(ArchiveEntry, getData,  NULL, 0)
  ^
/tmp/B.cdf76908-70c1-463d-b0aa-aa86eb3926ab/BUILD/php-pecl-archive-0.2/archive_writer.c:171:4: warning: 'php_set_error_handling' is deprecated (declared at /usr/include/php/main/php.h:293) [-Wdeprecated-declarations]
    php_set_error_handling(EH_NORMAL, NULL TSRMLS_CC);
    ^
/usr/include/php/Zend/zend_API.h:71:129: warning: (near initialization for 'funcs_ArchiveEntry[11]') [enabled by default]
 #define ZEND_FENTRY(zend_name, name, arg_info, flags) { #zend_name, name, arg_info, (zend_uint) (sizeof(arg_info)/sizeof(struct _zend_arg_info)-1), flags },
                                                                                                                                 ^
/usr/include/php/Zend/zend_API.h:82:51: note: in expansion of macro 'ZEND_FENTRY'
 #define ZEND_ME(classname, name, arg_info, flags) ZEND_FENTRY(name, ZEND_MN(classname##_##name), arg_info, flags)
                                                   ^
/tmp/B.cdf76908-70c1-463d-b0aa-aa86eb3926ab/BUILD/php-pecl-archive-0.2/archive_entry.c:45:2: note: in expansion of macro 'ZEND_ME'
  ZEND_ME(ArchiveEntry, getData,  NULL, 0)
  ^
/tmp/B.cdf76908-70c1-463d-b0aa-aa86eb3926ab/BUILD/php-pecl-archive-0.2/archive_entry.c:46:2: warning: braces around scalar initializer [enabled by default]
  {NULL, NULL, NULL}
  ^
/tmp/B.cdf76908-70c1-463d-b0aa-aa86eb3926ab/BUILD/php-pecl-archive-0.2/archive_writer.c:177:2: warning: passing argument 4 of 'archive_write_open' from incompatible pointer type [enabled by default]
  result = archive_write_open(arch->arch, arch, _archive_open_clbk, _archive_write_clbk, _archive_close_clbk);
  ^
/tmp/B.cdf76908-70c1-463d-b0aa-aa86eb3926ab/BUILD/php-pecl-archive-0.2/archive_entry.c:46:2: warning: (near initialization for 'funcs_ArchiveEntry[12]') [enabled by default]
/tmp/B.cdf76908-70c1-463d-b0aa-aa86eb3926ab/BUILD/php-pecl-archive-0.2/archive_entry.c:46:2: warning: initialization makes integer from pointer without a cast [enabled by default]
/tmp/B.cdf76908-70c1-463d-b0aa-aa86eb3926ab/BUILD/php-pecl-archive-0.2/archive_entry.c:46:2: warning: (near initialization for 'funcs_ArchiveEntry[12]') [enabled by default]
/tmp/B.cdf76908-70c1-463d-b0aa-aa86eb3926ab/BUILD/php-pecl-archive-0.2/archive_entry.c:46:2: warning: excess elements in scalar initializer [enabled by default]
/tmp/B.cdf76908-70c1-463d-b0aa-aa86eb3926ab/BUILD/php-pecl-archive-0.2/archive_entry.c:46:2: warning: (near initialization for 'funcs_ArchiveEntry[12]') [enabled by default]
/tmp/B.cdf76908-70c1-463d-b0aa-aa86eb3926ab/BUILD/php-pecl-archive-0.2/archive_entry.c:46:2: warning: excess elements in scalar initializer [enabled by default]
/tmp/B.cdf76908-70c1-463d-b0aa-aa86eb3926ab/BUILD/php-pecl-archive-0.2/archive_entry.c:46:2: warning: (near initialization for 'funcs_ArchiveEntry[12]') [enabled by default]
In file included from /tmp/B.cdf76908-70c1-463d-b0aa-aa86eb3926ab/BUILD/php-pecl-archive-0.2/php_archive.h:24:0,
                 from /tmp/B.cdf76908-70c1-463d-b0aa-aa86eb3926ab/BUILD/php-pecl-archive-0.2/archive_writer.c:27:
/usr/include/archive.h:681:15: note: expected 'ssize_t (*)(struct archive *, void *, const void *, size_t)' but argument is of type 'ssize_t (*)(struct archive *, void *, void *, size_t)'
 __LA_DECL int archive_write_open(struct archive *, void *,
               ^
/tmp/B.cdf76908-70c1-463d-b0aa-aa86eb3926ab/BUILD/php-pecl-archive-0.2/archive_writer.c:193:3: warning: 'php_set_error_handling' is deprecated (declared at /usr/include/php/main/php.h:293) [-Wdeprecated-declarations]
   php_set_error_handling(EH_NORMAL, NULL TSRMLS_CC);
   ^
/tmp/B.cdf76908-70c1-463d-b0aa-aa86eb3926ab/BUILD/php-pecl-archive-0.2/archive_writer.c:200:2: warning: 'php_set_error_handling' is deprecated (declared at /usr/include/php/main/php.h:293) [-Wdeprecated-declarations]
  php_set_error_handling(EH_NORMAL, NULL TSRMLS_CC);
  ^
/tmp/B.cdf76908-70c1-463d-b0aa-aa86eb3926ab/BUILD/php-pecl-archive-0.2/archive_writer.c: In function 'zim_ArchiveWriter_addEntry':
/tmp/B.cdf76908-70c1-463d-b0aa-aa86eb3926ab/BUILD/php-pecl-archive-0.2/archive_writer.c:218:2: warning: 'php_set_error_handling' is deprecated (declared at /usr/include/php/main/php.h:293) [-Wdeprecated-declarations]
  php_set_error_handling(EH_THROW, ce_ArchiveException TSRMLS_CC);
  ^
/tmp/B.cdf76908-70c1-463d-b0aa-aa86eb3926ab/BUILD/php-pecl-archive-0.2/archive_writer.c:221:3: warning: 'php_set_error_handling' is deprecated (declared at /usr/include/php/main/php.h:293) [-Wdeprecated-declarations]
   php_set_error_handling(EH_NORMAL, NULL TSRMLS_CC);
   ^
In file included from /usr/include/php/main/php.h:38:0,
                 from /tmp/B.cdf76908-70c1-463d-b0aa-aa86eb3926ab/BUILD/php-pecl-archive-0.2/archive_entry.c:27:
/tmp/B.cdf76908-70c1-463d-b0aa-aa86eb3926ab/BUILD/php-pecl-archive-0.2/archive_entry.c: In function 'zm_startup_archive_entry':
/tmp/B.cdf76908-70c1-463d-b0aa-aa86eb3926ab/BUILD/php-pecl-archive-0.2/archive_writer.c:226:3: warning: 'php_set_error_handling' is deprecated (declared at /usr/include/php/main/php.h:293) [-Wdeprecated-declarations]
   php_set_error_handling(EH_NORMAL, NULL TSRMLS_CC);
   ^
/tmp/B.cdf76908-70c1-463d-b0aa-aa86eb3926ab/BUILD/php-pecl-archive-0.2/archive_writer.c:232:3: warning: 'php_set_error_handling' is deprecated (declared at /usr/include/php/main/php.h:293) [-Wdeprecated-declarations]
   php_set_error_handling(EH_NORMAL, NULL TSRMLS_CC);
   ^
/tmp/B.cdf76908-70c1-463d-b0aa-aa86eb3926ab/BUILD/php-pecl-archive-0.2/archive_writer.c:237:3: warning: 'php_set_error_handling' is deprecated (declared at /usr/include/php/main/php.h:293) [-Wdeprecated-declarations]
   php_set_error_handling(EH_NORMAL, NULL TSRMLS_CC);
   ^
/usr/include/php/Zend/zend_API.h:212:51: warning: assignment from incompatible pointer type [enabled by default]
   class_container.info.internal.builtin_functions = functions; \
                                                   ^
/usr/include/php/Zend/zend_API.h:178:3: note: in expansion of macro 'INIT_CLASS_ENTRY_INIT_METHODS'
   INIT_CLASS_ENTRY_INIT_METHODS(class_container, functions, handle_fcall, handle_propget, handle_propset, handle_propunset, handle_propisset) \
   ^
/usr/include/php/Zend/zend_API.h:216:2: note: in expansion of macro 'INIT_OVERLOADED_CLASS_ENTRY_EX'
  INIT_OVERLOADED_CLASS_ENTRY_EX(class_container, class_name, sizeof(class_name)-1, functions, handle_fcall, handle_propget, handle_propset, NULL, NULL)
  ^
/usr/include/php/Zend/zend_API.h:164:2: note: in expansion of macro 'INIT_OVERLOADED_CLASS_ENTRY'
  INIT_OVERLOADED_CLASS_ENTRY(class_container, class_name, functions, NULL, NULL, NULL)
  ^
/tmp/B.cdf76908-70c1-463d-b0aa-aa86eb3926ab/BUILD/php-pecl-archive-0.2/archive_entry.c:134:2: note: in expansion of macro 'INIT_CLASS_ENTRY'
  INIT_CLASS_ENTRY(ce, "ArchiveEntry", funcs_ArchiveEntry);
  ^
/tmp/B.cdf76908-70c1-463d-b0aa-aa86eb3926ab/BUILD/php-pecl-archive-0.2/archive_writer.c:248:3: warning: 'php_set_error_handling' is deprecated (declared at /usr/include/php/main/php.h:293) [-Wdeprecated-declarations]
   php_set_error_handling(EH_NORMAL, NULL TSRMLS_CC);
   ^
/tmp/B.cdf76908-70c1-463d-b0aa-aa86eb3926ab/BUILD/php-pecl-archive-0.2/archive_entry.c: In function 'zim_ArchiveEntry___construct':
/tmp/B.cdf76908-70c1-463d-b0aa-aa86eb3926ab/BUILD/php-pecl-archive-0.2/archive_entry.c:153:2: warning: 'php_set_error_handling' is deprecated (declared at /usr/include/php/main/php.h:293) [-Wdeprecated-declarations]
  php_set_error_handling(EH_THROW, ce_ArchiveException TSRMLS_CC);
  ^
/tmp/B.cdf76908-70c1-463d-b0aa-aa86eb3926ab/BUILD/php-pecl-archive-0.2/archive_writer.c:268:2: warning: 'php_set_error_handling' is deprecated (declared at /usr/include/php/main/php.h:293) [-Wdeprecated-declarations]
  php_set_error_handling(EH_NORMAL, NULL TSRMLS_CC);
  ^
/tmp/B.cdf76908-70c1-463d-b0aa-aa86eb3926ab/BUILD/php-pecl-archive-0.2/archive_entry.c:156:3: warning: 'php_set_error_handling' is deprecated (declared at /usr/include/php/main/php.h:293) [-Wdeprecated-declarations]
   php_set_error_handling(EH_NORMAL, NULL TSRMLS_CC);
   ^
/tmp/B.cdf76908-70c1-463d-b0aa-aa86eb3926ab/BUILD/php-pecl-archive-0.2/archive_writer.c: In function 'zim_ArchiveWriter_finish':
In file included from /usr/include/php/main/fopen_wrappers.h:25:0,
                 from /usr/include/php/main/php.h:397,
                 from /tmp/B.cdf76908-70c1-463d-b0aa-aa86eb3926ab/BUILD/php-pecl-archive-0.2/archive_entry.c:27:
/usr/include/php/main/php_globals.h:32:29: error: 'struct _php_core_globals' has no member named 'safe_mode'
 # define PG(v) (core_globals.v)
                             ^
/tmp/B.cdf76908-70c1-463d-b0aa-aa86eb3926ab/BUILD/php-pecl-archive-0.2/archive_entry.c:160:6: note: in expansion of macro 'PG'
  if (PG(safe_mode) && (!php_checkuid(filename, NULL, CHECKUID_CHECK_FILE_AND_DIR))) {
      ^
/tmp/B.cdf76908-70c1-463d-b0aa-aa86eb3926ab/BUILD/php-pecl-archive-0.2/archive_entry.c:160:54: error: 'CHECKUID_CHECK_FILE_AND_DIR' undeclared (first use in this function)
  if (PG(safe_mode) && (!php_checkuid(filename, NULL, CHECKUID_CHECK_FILE_AND_DIR))) {
                                                      ^
/tmp/B.cdf76908-70c1-463d-b0aa-aa86eb3926ab/BUILD/php-pecl-archive-0.2/archive_writer.c:288:2: warning: 'php_set_error_handling' is deprecated (declared at /usr/include/php/main/php.h:293) [-Wdeprecated-declarations]
  php_set_error_handling(EH_THROW, ce_ArchiveException TSRMLS_CC);
  ^
/tmp/B.cdf76908-70c1-463d-b0aa-aa86eb3926ab/BUILD/php-pecl-archive-0.2/archive_entry.c:160:54: note: each undeclared identifier is reported only once for each function it appears in
/tmp/B.cdf76908-70c1-463d-b0aa-aa86eb3926ab/BUILD/php-pecl-archive-0.2/archive_entry.c:161:3: warning: 'php_set_error_handling' is deprecated (declared at /usr/include/php/main/php.h:293) [-Wdeprecated-declarations]
   php_set_error_handling(EH_NORMAL, NULL TSRMLS_CC);
   ^
/tmp/B.cdf76908-70c1-463d-b0aa-aa86eb3926ab/BUILD/php-pecl-archive-0.2/archive_writer.c:291:3: warning: 'php_set_error_handling' is deprecated (declared at /usr/include/php/main/php.h:293) [-Wdeprecated-declarations]
   php_set_error_handling(EH_NORMAL, NULL TSRMLS_CC);
   ^
/tmp/B.cdf76908-70c1-463d-b0aa-aa86eb3926ab/BUILD/php-pecl-archive-0.2/archive_entry.c:166:3: warning: 'php_set_error_handling' is deprecated (declared at /usr/include/php/main/php.h:293) [-Wdeprecated-declarations]
   php_set_error_handling(EH_NORMAL, NULL TSRMLS_CC);
   ^
/tmp/B.cdf76908-70c1-463d-b0aa-aa86eb3926ab/BUILD/php-pecl-archive-0.2/archive_entry.c:172:3: warning: 'php_set_error_handling' is deprecated (declared at /usr/include/php/main/php.h:293) [-Wdeprecated-declarations]
   php_set_error_handling(EH_NORMAL, NULL TSRMLS_CC);
   ^
/tmp/B.cdf76908-70c1-463d-b0aa-aa86eb3926ab/BUILD/php-pecl-archive-0.2/archive_writer.c:316:8: warning: 'php_set_error_handling' is deprecated (declared at /usr/include/php/main/php.h:293) [-Wdeprecated-declarations]
        php_set_error_handling(EH_NORMAL, NULL TSRMLS_CC); 
        ^
/tmp/B.cdf76908-70c1-463d-b0aa-aa86eb3926ab/BUILD/php-pecl-archive-0.2/archive_writer.c:334:7: warning: 'php_set_error_handling' is deprecated (declared at /usr/include/php/main/php.h:293) [-Wdeprecated-declarations]
       php_set_error_handling(EH_NORMAL, NULL TSRMLS_CC); 
       ^
/tmp/B.cdf76908-70c1-463d-b0aa-aa86eb3926ab/BUILD/php-pecl-archive-0.2/archive_entry.c:214:2: warning: 'php_set_error_handling' is deprecated (declared at /usr/include/php/main/php.h:293) [-Wdeprecated-declarations]
  php_set_error_handling(EH_NORMAL, NULL TSRMLS_CC);
  ^
/tmp/B.cdf76908-70c1-463d-b0aa-aa86eb3926ab/BUILD/php-pecl-archive-0.2/archive_entry.c: In function 'zim_ArchiveEntry_isDir':
/tmp/B.cdf76908-70c1-463d-b0aa-aa86eb3926ab/BUILD/php-pecl-archive-0.2/archive_entry.c:228:2: warning: 'php_set_error_handling' is deprecated (declared at /usr/include/php/main/php.h:293) [-Wdeprecated-declarations]
  PHP_ENTRY_GET_STRUCT;
  ^
/tmp/B.cdf76908-70c1-463d-b0aa-aa86eb3926ab/BUILD/php-pecl-archive-0.2/archive_entry.c:228:2: warning: 'php_set_error_handling' is deprecated (declared at /usr/include/php/main/php.h:293) [-Wdeprecated-declarations]
/tmp/B.cdf76908-70c1-463d-b0aa-aa86eb3926ab/BUILD/php-pecl-archive-0.2/archive_entry.c:228:2: warning: 'php_set_error_handling' is deprecated (declared at /usr/include/php/main/php.h:293) [-Wdeprecated-declarations]
/tmp/B.cdf76908-70c1-463d-b0aa-aa86eb3926ab/BUILD/php-pecl-archive-0.2/archive_writer.c:345:5: warning: 'php_set_error_handling' is deprecated (declared at /usr/include/php/main/php.h:293) [-Wdeprecated-declarations]
     php_set_error_handling(EH_NORMAL, NULL TSRMLS_CC); 
     ^
/tmp/B.cdf76908-70c1-463d-b0aa-aa86eb3926ab/BUILD/php-pecl-archive-0.2/archive_entry.c: In function 'zim_ArchiveEntry_isFile':
/tmp/B.cdf76908-70c1-463d-b0aa-aa86eb3926ab/BUILD/php-pecl-archive-0.2/archive_writer.c:355:3: warning: 'php_set_error_handling' is deprecated (declared at /usr/include/php/main/php.h:293) [-Wdeprecated-declarations]
   php_set_error_handling(EH_NORMAL, NULL TSRMLS_CC);
   ^
/tmp/B.cdf76908-70c1-463d-b0aa-aa86eb3926ab/BUILD/php-pecl-archive-0.2/archive_entry.c:245:2: warning: 'php_set_error_handling' is deprecated (declared at /usr/include/php/main/php.h:293) [-Wdeprecated-declarations]
  PHP_ENTRY_GET_STRUCT;
  ^
/tmp/B.cdf76908-70c1-463d-b0aa-aa86eb3926ab/BUILD/php-pecl-archive-0.2/archive_entry.c:245:2: warning: 'php_set_error_handling' is deprecated (declared at /usr/include/php/main/php.h:293) [-Wdeprecated-declarations]
/tmp/B.cdf76908-70c1-463d-b0aa-aa86eb3926ab/BUILD/php-pecl-archive-0.2/archive_entry.c:245:2: warning: 'php_set_error_handling' is deprecated (declared at /usr/include/php/main/php.h:293) [-Wdeprecated-declarations]
/tmp/B.cdf76908-70c1-463d-b0aa-aa86eb3926ab/BUILD/php-pecl-archive-0.2/archive_writer.c:360:2: warning: 'php_set_error_handling' is deprecated (declared at /usr/include/php/main/php.h:293) [-Wdeprecated-declarations]
  php_set_error_handling(EH_NORMAL, NULL TSRMLS_CC);
  ^
/tmp/B.cdf76908-70c1-463d-b0aa-aa86eb3926ab/BUILD/php-pecl-archive-0.2/archive_entry.c: In function 'zim_ArchiveEntry_isLink':
/tmp/B.cdf76908-70c1-463d-b0aa-aa86eb3926ab/BUILD/php-pecl-archive-0.2/archive_entry.c:262:2: warning: 'php_set_error_handling' is deprecated (declared at /usr/include/php/main/php.h:293) [-Wdeprecated-declarations]
  PHP_ENTRY_GET_STRUCT;
  ^
/tmp/B.cdf76908-70c1-463d-b0aa-aa86eb3926ab/BUILD/php-pecl-archive-0.2/archive_entry.c:262:2: warning: 'php_set_error_handling' is deprecated (declared at /usr/include/php/main/php.h:293) [-Wdeprecated-declarations]
/tmp/B.cdf76908-70c1-463d-b0aa-aa86eb3926ab/BUILD/php-pecl-archive-0.2/archive_entry.c:262:2: warning: 'php_set_error_handling' is deprecated (declared at /usr/include/php/main/php.h:293) [-Wdeprecated-declarations]
/tmp/B.cdf76908-70c1-463d-b0aa-aa86eb3926ab/BUILD/php-pecl-archive-0.2/archive_entry.c: In function 'zim_ArchiveEntry_getPathname':
/tmp/B.cdf76908-70c1-463d-b0aa-aa86eb3926ab/BUILD/php-pecl-archive-0.2/archive_entry.c:279:2: warning: 'php_set_error_handling' is deprecated (declared at /usr/include/php/main/php.h:293) [-Wdeprecated-declarations]
  PHP_ENTRY_GET_STRUCT;
  ^
/tmp/B.cdf76908-70c1-463d-b0aa-aa86eb3926ab/BUILD/php-pecl-archive-0.2/archive_entry.c:279:2: warning: 'php_set_error_handling' is deprecated (declared at /usr/include/php/main/php.h:293) [-Wdeprecated-declarations]
/tmp/B.cdf76908-70c1-463d-b0aa-aa86eb3926ab/BUILD/php-pecl-archive-0.2/archive_entry.c:279:2: warning: 'php_set_error_handling' is deprecated (declared at /usr/include/php/main/php.h:293) [-Wdeprecated-declarations]
/tmp/B.cdf76908-70c1-463d-b0aa-aa86eb3926ab/BUILD/php-pecl-archive-0.2/archive_entry.c: In function 'zim_ArchiveEntry_getResolvedPathname':
/tmp/B.cdf76908-70c1-463d-b0aa-aa86eb3926ab/BUILD/php-pecl-archive-0.2/archive_entry.c:301:2: warning: 'php_set_error_handling' is deprecated (declared at /usr/include/php/main/php.h:293) [-Wdeprecated-declarations]
  PHP_ENTRY_GET_STRUCT;
  ^
/tmp/B.cdf76908-70c1-463d-b0aa-aa86eb3926ab/BUILD/php-pecl-archive-0.2/archive_entry.c:301:2: warning: 'php_set_error_handling' is deprecated (declared at /usr/include/php/main/php.h:293) [-Wdeprecated-declarations]
/tmp/B.cdf76908-70c1-463d-b0aa-aa86eb3926ab/BUILD/php-pecl-archive-0.2/archive_entry.c:301:2: warning: 'php_set_error_handling' is deprecated (declared at /usr/include/php/main/php.h:293) [-Wdeprecated-declarations]
/tmp/B.cdf76908-70c1-463d-b0aa-aa86eb3926ab/BUILD/php-pecl-archive-0.2/archive_entry.c: In function 'zim_ArchiveEntry_getUser':
/tmp/B.cdf76908-70c1-463d-b0aa-aa86eb3926ab/BUILD/php-pecl-archive-0.2/archive_entry.c:324:2: warning: 'php_set_error_handling' is deprecated (declared at /usr/include/php/main/php.h:293) [-Wdeprecated-declarations]
  PHP_ENTRY_GET_STRUCT;
  ^
/tmp/B.cdf76908-70c1-463d-b0aa-aa86eb3926ab/BUILD/php-pecl-archive-0.2/archive_entry.c:324:2: warning: 'php_set_error_handling' is deprecated (declared at /usr/include/php/main/php.h:293) [-Wdeprecated-declarations]
/tmp/B.cdf76908-70c1-463d-b0aa-aa86eb3926ab/BUILD/php-pecl-archive-0.2/archive_entry.c:324:2: warning: 'php_set_error_handling' is deprecated (declared at /usr/include/php/main/php.h:293) [-Wdeprecated-declarations]
/tmp/B.cdf76908-70c1-463d-b0aa-aa86eb3926ab/BUILD/php-pecl-archive-0.2/archive_entry.c: In function 'zim_ArchiveEntry_getGroup':
/tmp/B.cdf76908-70c1-463d-b0aa-aa86eb3926ab/BUILD/php-pecl-archive-0.2/archive_entry.c:342:2: warning: 'php_set_error_handling' is deprecated (declared at /usr/include/php/main/php.h:293) [-Wdeprecated-declarations]
  PHP_ENTRY_GET_STRUCT;
  ^
/tmp/B.cdf76908-70c1-463d-b0aa-aa86eb3926ab/BUILD/php-pecl-archive-0.2/archive_entry.c:342:2: warning: 'php_set_error_handling' is deprecated (declared at /usr/include/php/main/php.h:293) [-Wdeprecated-declarations]
/tmp/B.cdf76908-70c1-463d-b0aa-aa86eb3926ab/BUILD/php-pecl-archive-0.2/archive_entry.c:342:2: warning: 'php_set_error_handling' is deprecated (declared at /usr/include/php/main/php.h:293) [-Wdeprecated-declarations]
/tmp/B.cdf76908-70c1-463d-b0aa-aa86eb3926ab/BUILD/php-pecl-archive-0.2/archive_entry.c: In function 'zim_ArchiveEntry_getMtime':
/tmp/B.cdf76908-70c1-463d-b0aa-aa86eb3926ab/BUILD/php-pecl-archive-0.2/archive_entry.c:360:2: warning: 'php_set_error_handling' is deprecated (declared at /usr/include/php/main/php.h:293) [-Wdeprecated-declarations]
  PHP_ENTRY_GET_STRUCT;
  ^
/tmp/B.cdf76908-70c1-463d-b0aa-aa86eb3926ab/BUILD/php-pecl-archive-0.2/archive_entry.c:360:2: warning: 'php_set_error_handling' is deprecated (declared at /usr/include/php/main/php.h:293) [-Wdeprecated-declarations]
/tmp/B.cdf76908-70c1-463d-b0aa-aa86eb3926ab/BUILD/php-pecl-archive-0.2/archive_entry.c:360:2: warning: 'php_set_error_handling' is deprecated (declared at /usr/include/php/main/php.h:293) [-Wdeprecated-declarations]
/tmp/B.cdf76908-70c1-463d-b0aa-aa86eb3926ab/BUILD/php-pecl-archive-0.2/archive_entry.c: In function 'zim_ArchiveEntry_getSize':
/tmp/B.cdf76908-70c1-463d-b0aa-aa86eb3926ab/BUILD/php-pecl-archive-0.2/archive_entry.c:377:2: warning: 'php_set_error_handling' is deprecated (declared at /usr/include/php/main/php.h:293) [-Wdeprecated-declarations]
  PHP_ENTRY_GET_STRUCT;
  ^
/tmp/B.cdf76908-70c1-463d-b0aa-aa86eb3926ab/BUILD/php-pecl-archive-0.2/archive_entry.c:377:2: warning: 'php_set_error_handling' is deprecated (declared at /usr/include/php/main/php.h:293) [-Wdeprecated-declarations]
/tmp/B.cdf76908-70c1-463d-b0aa-aa86eb3926ab/BUILD/php-pecl-archive-0.2/archive_entry.c:377:2: warning: 'php_set_error_handling' is deprecated (declared at /usr/include/php/main/php.h:293) [-Wdeprecated-declarations]
/tmp/B.cdf76908-70c1-463d-b0aa-aa86eb3926ab/BUILD/php-pecl-archive-0.2/archive_entry.c: In function 'zim_ArchiveEntry_getPerms':
/tmp/B.cdf76908-70c1-463d-b0aa-aa86eb3926ab/BUILD/php-pecl-archive-0.2/archive_entry.c:394:2: warning: 'php_set_error_handling' is deprecated (declared at /usr/include/php/main/php.h:293) [-Wdeprecated-declarations]
  PHP_ENTRY_GET_STRUCT;
  ^
/tmp/B.cdf76908-70c1-463d-b0aa-aa86eb3926ab/BUILD/php-pecl-archive-0.2/archive_entry.c:394:2: warning: 'php_set_error_handling' is deprecated (declared at /usr/include/php/main/php.h:293) [-Wdeprecated-declarations]
/tmp/B.cdf76908-70c1-463d-b0aa-aa86eb3926ab/BUILD/php-pecl-archive-0.2/archive_entry.c:394:2: warning: 'php_set_error_handling' is deprecated (declared at /usr/include/php/main/php.h:293) [-Wdeprecated-declarations]
/tmp/B.cdf76908-70c1-463d-b0aa-aa86eb3926ab/BUILD/php-pecl-archive-0.2/archive_entry.c: In function 'zim_ArchiveEntry_getData':
/tmp/B.cdf76908-70c1-463d-b0aa-aa86eb3926ab/BUILD/php-pecl-archive-0.2/archive_entry.c:410:2: warning: 'php_set_error_handling' is deprecated (declared at /usr/include/php/main/php.h:293) [-Wdeprecated-declarations]
  PHP_ENTRY_GET_STRUCT;
  ^
/tmp/B.cdf76908-70c1-463d-b0aa-aa86eb3926ab/BUILD/php-pecl-archive-0.2/archive_entry.c:410:2: warning: 'php_set_error_handling' is deprecated (declared at /usr/include/php/main/php.h:293) [-Wdeprecated-declarations]
/tmp/B.cdf76908-70c1-463d-b0aa-aa86eb3926ab/BUILD/php-pecl-archive-0.2/archive_entry.c:410:2: warning: 'php_set_error_handling' is deprecated (declared at /usr/include/php/main/php.h:293) [-Wdeprecated-declarations]
/usr/include/php/Zend/zend_API.h:212:51: warning: assignment from incompatible pointer type [enabled by default]
   class_container.info.internal.builtin_functions = functions; \
                                                   ^
/usr/include/php/Zend/zend_API.h:178:3: note: in expansion of macro 'INIT_CLASS_ENTRY_INIT_METHODS'
   INIT_CLASS_ENTRY_INIT_METHODS(class_container, functions, handle_fcall, handle_propget, handle_propset, handle_propunset, handle_propisset) \
   ^
/usr/include/php/Zend/zend_API.h:216:2: note: in expansion of macro 'INIT_OVERLOADED_CLASS_ENTRY_EX'
  INIT_OVERLOADED_CLASS_ENTRY_EX(class_container, class_name, sizeof(class_name)-1, functions, handle_fcall, handle_propget, handle_propset, NULL, NULL)
  ^
/usr/include/php/Zend/zend_API.h:164:2: note: in expansion of macro 'INIT_OVERLOADED_CLASS_ENTRY'
  INIT_OVERLOADED_CLASS_ENTRY(class_container, class_name, functions, NULL, NULL, NULL)
  ^
/tmp/B.cdf76908-70c1-463d-b0aa-aa86eb3926ab/BUILD/php-pecl-archive-0.2/archive_reader.c:67:2: note: in expansion of macro 'INIT_CLASS_ENTRY'
  INIT_CLASS_ENTRY(tmp_ce_ArchiveReader, "ArchiveReader", funcs_ArchiveReader);
  ^
Makefile:202: recipe for target 'archive.lo' failed
make: *** [archive.lo] Error 1
make: *** Waiting for unfinished jobs....
/tmp/B.cdf76908-70c1-463d-b0aa-aa86eb3926ab/BUILD/php-pecl-archive-0.2/archive_reader.c: In function 'zim_ArchiveReader___construct':
/tmp/B.cdf76908-70c1-463d-b0aa-aa86eb3926ab/BUILD/php-pecl-archive-0.2/archive_reader.c:88:2: warning: 'php_set_error_handling' is deprecated (declared at /usr/include/php/main/php.h:293) [-Wdeprecated-declarations]
  php_set_error_handling(EH_THROW, ce_ArchiveException TSRMLS_CC);
  ^
/tmp/B.cdf76908-70c1-463d-b0aa-aa86eb3926ab/BUILD/php-pecl-archive-0.2/archive_reader.c:91:3: warning: 'php_set_error_handling' is deprecated (declared at /usr/include/php/main/php.h:293) [-Wdeprecated-declarations]
   php_set_error_handling(EH_NORMAL, NULL TSRMLS_CC);
   ^
In file included from /usr/include/php/main/fopen_wrappers.h:25:0,
                 from /usr/include/php/main/php.h:397,
                 from /tmp/B.cdf76908-70c1-463d-b0aa-aa86eb3926ab/BUILD/php-pecl-archive-0.2/archive_reader.c:25:
/usr/include/php/main/php_globals.h:32:29: error: 'struct _php_core_globals' has no member named 'safe_mode'
 # define PG(v) (core_globals.v)
                             ^
/tmp/B.cdf76908-70c1-463d-b0aa-aa86eb3926ab/BUILD/php-pecl-archive-0.2/archive_reader.c:95:6: note: in expansion of macro 'PG'
  if (PG(safe_mode) && (!php_checkuid(filename, NULL, CHECKUID_CHECK_FILE_AND_DIR))) {
      ^
/tmp/B.cdf76908-70c1-463d-b0aa-aa86eb3926ab/BUILD/php-pecl-archive-0.2/archive_reader.c:95:54: error: 'CHECKUID_CHECK_FILE_AND_DIR' undeclared (first use in this function)
  if (PG(safe_mode) && (!php_checkuid(filename, NULL, CHECKUID_CHECK_FILE_AND_DIR))) {
                                                      ^
/tmp/B.cdf76908-70c1-463d-b0aa-aa86eb3926ab/BUILD/php-pecl-archive-0.2/archive_reader.c:95:54: note: each undeclared identifier is reported only once for each function it appears in
/tmp/B.cdf76908-70c1-463d-b0aa-aa86eb3926ab/BUILD/php-pecl-archive-0.2/archive_reader.c:96:3: warning: 'php_set_error_handling' is deprecated (declared at /usr/include/php/main/php.h:293) [-Wdeprecated-declarations]
   php_set_error_handling(EH_NORMAL, NULL TSRMLS_CC);
   ^
/tmp/B.cdf76908-70c1-463d-b0aa-aa86eb3926ab/BUILD/php-pecl-archive-0.2/archive_reader.c:101:3: warning: 'php_set_error_handling' is deprecated (declared at /usr/include/php/main/php.h:293) [-Wdeprecated-declarations]
   php_set_error_handling(EH_NORMAL, NULL TSRMLS_CC);
   ^
/tmp/B.cdf76908-70c1-463d-b0aa-aa86eb3926ab/BUILD/php-pecl-archive-0.2/archive_reader.c:117:2: warning: 'archive_read_support_compression_bzip2' is deprecated (declared at /usr/include/archive.h:313) [-Wdeprecated-declarations]
  _php_archive_read_support_compression_all(arch->arch);
  ^
/tmp/B.cdf76908-70c1-463d-b0aa-aa86eb3926ab/BUILD/php-pecl-archive-0.2/archive_reader.c:117:2: warning: 'archive_read_support_compression_gzip' is deprecated (declared at /usr/include/archive.h:317) [-Wdeprecated-declarations]
/tmp/B.cdf76908-70c1-463d-b0aa-aa86eb3926ab/BUILD/php-pecl-archive-0.2/archive_reader.c:117:2: warning: 'archive_read_support_compression_compress' is deprecated (declared at /usr/include/archive.h:315) [-Wdeprecated-declarations]
/tmp/B.cdf76908-70c1-463d-b0aa-aa86eb3926ab/BUILD/php-pecl-archive-0.2/archive_reader.c:135:3: warning: 'archive_read_support_compression_bzip2' is deprecated (declared at /usr/include/archive.h:313) [-Wdeprecated-declarations]
   _php_archive_read_support_compression_all(arch->arch);
   ^
/tmp/B.cdf76908-70c1-463d-b0aa-aa86eb3926ab/BUILD/php-pecl-archive-0.2/archive_reader.c:135:3: warning: 'archive_read_support_compression_gzip' is deprecated (declared at /usr/include/archive.h:317) [-Wdeprecated-declarations]
/tmp/B.cdf76908-70c1-463d-b0aa-aa86eb3926ab/BUILD/php-pecl-archive-0.2/archive_reader.c:135:3: warning: 'archive_read_support_compression_compress' is deprecated (declared at /usr/include/archive.h:315) [-Wdeprecated-declarations]
/tmp/B.cdf76908-70c1-463d-b0aa-aa86eb3926ab/BUILD/php-pecl-archive-0.2/archive_reader.c:144:5: warning: 'archive_read_support_compression_gzip' is deprecated (declared at /usr/include/archive.h:317) [-Wdeprecated-declarations]
     archive_read_support_compression_gzip(arch->arch);
     ^
/tmp/B.cdf76908-70c1-463d-b0aa-aa86eb3926ab/BUILD/php-pecl-archive-0.2/archive_reader.c:157:5: warning: 'archive_read_support_compression_bzip2' is deprecated (declared at /usr/include/archive.h:313) [-Wdeprecated-declarations]
     archive_read_support_compression_bzip2(arch->arch);
     ^
/tmp/B.cdf76908-70c1-463d-b0aa-aa86eb3926ab/BUILD/php-pecl-archive-0.2/archive_reader.c:170:5: warning: 'archive_read_support_compression_compress' is deprecated (declared at /usr/include/archive.h:315) [-Wdeprecated-declarations]
     archive_read_support_compression_compress(arch->arch);
     ^
/tmp/B.cdf76908-70c1-463d-b0aa-aa86eb3926ab/BUILD/php-pecl-archive-0.2/archive_reader.c:191:3: warning: 'php_set_error_handling' is deprecated (declared at /usr/include/php/main/php.h:293) [-Wdeprecated-declarations]
   php_set_error_handling(EH_NORMAL, NULL TSRMLS_CC);
   ^
/tmp/B.cdf76908-70c1-463d-b0aa-aa86eb3926ab/BUILD/php-pecl-archive-0.2/archive_reader.c:198:2: warning: 'php_set_error_handling' is deprecated (declared at /usr/include/php/main/php.h:293) [-Wdeprecated-declarations]
  php_set_error_handling(EH_NORMAL, NULL TSRMLS_CC);
  ^
/tmp/B.cdf76908-70c1-463d-b0aa-aa86eb3926ab/BUILD/php-pecl-archive-0.2/archive_reader.c: In function 'zim_ArchiveReader_getNextEntry':
/tmp/B.cdf76908-70c1-463d-b0aa-aa86eb3926ab/BUILD/php-pecl-archive-0.2/archive_reader.c:219:2: warning: 'php_set_error_handling' is deprecated (declared at /usr/include/php/main/php.h:293) [-Wdeprecated-declarations]
  php_set_error_handling(EH_THROW, ce_ArchiveException TSRMLS_CC);
  ^
/tmp/B.cdf76908-70c1-463d-b0aa-aa86eb3926ab/BUILD/php-pecl-archive-0.2/archive_reader.c:222:3: warning: 'php_set_error_handling' is deprecated (declared at /usr/include/php/main/php.h:293) [-Wdeprecated-declarations]
   php_set_error_handling(EH_NORMAL, NULL TSRMLS_CC);
   ^
/tmp/B.cdf76908-70c1-463d-b0aa-aa86eb3926ab/BUILD/php-pecl-archive-0.2/archive_reader.c:227:3: warning: 'php_set_error_handling' is deprecated (declared at /usr/include/php/main/php.h:293) [-Wdeprecated-declarations]
   php_set_error_handling(EH_NORMAL, NULL TSRMLS_CC);
   ^
/tmp/B.cdf76908-70c1-463d-b0aa-aa86eb3926ab/BUILD/php-pecl-archive-0.2/archive_reader.c:243:3: warning: 'php_set_error_handling' is deprecated (declared at /usr/include/php/main/php.h:293) [-Wdeprecated-declarations]
   php_set_error_handling(EH_NORMAL, NULL TSRMLS_CC);
   ^
/tmp/B.cdf76908-70c1-463d-b0aa-aa86eb3926ab/BUILD/php-pecl-archive-0.2/archive_reader.c:259:3: warning: 'php_set_error_handling' is deprecated (declared at /usr/include/php/main/php.h:293) [-Wdeprecated-declarations]
   php_set_error_handling(EH_NORMAL, NULL TSRMLS_CC); 
   ^
/tmp/B.cdf76908-70c1-463d-b0aa-aa86eb3926ab/BUILD/php-pecl-archive-0.2/archive_reader.c:266:3: warning: 'php_set_error_handling' is deprecated (declared at /usr/include/php/main/php.h:293) [-Wdeprecated-declarations]
   php_set_error_handling(EH_NORMAL, NULL TSRMLS_CC);
   ^
/tmp/B.cdf76908-70c1-463d-b0aa-aa86eb3926ab/BUILD/php-pecl-archive-0.2/archive_reader.c:273:3: warning: passing argument 4 of 'archive_read_data_block' from incompatible pointer type [enabled by default]
   while ((result = archive_read_data_block(arch->arch, (const void **)&buf, &len, &offset)) == ARCHIVE_OK) {
   ^
In file included from /tmp/B.cdf76908-70c1-463d-b0aa-aa86eb3926ab/BUILD/php-pecl-archive-0.2/php_archive.h:24:0,
                 from /tmp/B.cdf76908-70c1-463d-b0aa-aa86eb3926ab/BUILD/php-pecl-archive-0.2/archive_reader.c:27:
/usr/include/archive.h:482:15: note: expected 'int64_t *' but argument is of type 'off_t *'
 __LA_DECL int archive_read_data_block(struct archive *a,
               ^
/tmp/B.cdf76908-70c1-463d-b0aa-aa86eb3926ab/BUILD/php-pecl-archive-0.2/archive_reader.c:290:4: warning: 'php_set_error_handling' is deprecated (declared at /usr/include/php/main/php.h:293) [-Wdeprecated-declarations]
    php_set_error_handling(EH_NORMAL, NULL TSRMLS_CC); 
    ^
/tmp/B.cdf76908-70c1-463d-b0aa-aa86eb3926ab/BUILD/php-pecl-archive-0.2/archive_reader.c:300:2: warning: 'php_set_error_handling' is deprecated (declared at /usr/include/php/main/php.h:293) [-Wdeprecated-declarations]
  php_set_error_handling(EH_NORMAL, NULL TSRMLS_CC);
  ^
/tmp/B.cdf76908-70c1-463d-b0aa-aa86eb3926ab/BUILD/php-pecl-archive-0.2/archive_reader.c: In function 'zim_ArchiveReader_getCurrentEntryData':
/tmp/B.cdf76908-70c1-463d-b0aa-aa86eb3926ab/BUILD/php-pecl-archive-0.2/archive_reader.c:317:2: warning: 'php_set_error_handling' is deprecated (declared at /usr/include/php/main/php.h:293) [-Wdeprecated-declarations]
  php_set_error_handling(EH_THROW, ce_ArchiveException TSRMLS_CC);
  ^
/tmp/B.cdf76908-70c1-463d-b0aa-aa86eb3926ab/BUILD/php-pecl-archive-0.2/archive_reader.c:320:3: warning: 'php_set_error_handling' is deprecated (declared at /usr/include/php/main/php.h:293) [-Wdeprecated-declarations]
   php_set_error_handling(EH_NORMAL, NULL TSRMLS_CC);
   ^
/tmp/B.cdf76908-70c1-463d-b0aa-aa86eb3926ab/BUILD/php-pecl-archive-0.2/archive_reader.c:326:3: warning: 'php_set_error_handling' is deprecated (declared at /usr/include/php/main/php.h:293) [-Wdeprecated-declarations]
   php_set_error_handling(EH_NORMAL, NULL TSRMLS_CC); 
   ^
/tmp/B.cdf76908-70c1-463d-b0aa-aa86eb3926ab/BUILD/php-pecl-archive-0.2/archive_reader.c:331:3: warning: 'php_set_error_handling' is deprecated (declared at /usr/include/php/main/php.h:293) [-Wdeprecated-declarations]
   php_set_error_handling(EH_NORMAL, NULL TSRMLS_CC);
   ^
/tmp/B.cdf76908-70c1-463d-b0aa-aa86eb3926ab/BUILD/php-pecl-archive-0.2/archive_reader.c:335:2: warning: passing argument 4 of 'archive_read_data_block' from incompatible pointer type [enabled by default]
  while ((result = archive_read_data_block(arch->arch, (const void **)&buf, &len, &offset)) == ARCHIVE_OK) {
  ^
In file included from /tmp/B.cdf76908-70c1-463d-b0aa-aa86eb3926ab/BUILD/php-pecl-archive-0.2/php_archive.h:24:0,
                 from /tmp/B.cdf76908-70c1-463d-b0aa-aa86eb3926ab/BUILD/php-pecl-archive-0.2/archive_reader.c:27:
/usr/include/archive.h:482:15: note: expected 'int64_t *' but argument is of type 'off_t *'
 __LA_DECL int archive_read_data_block(struct archive *a,
               ^
/tmp/B.cdf76908-70c1-463d-b0aa-aa86eb3926ab/BUILD/php-pecl-archive-0.2/archive_reader.c:351:3: warning: 'php_set_error_handling' is deprecated (declared at /usr/include/php/main/php.h:293) [-Wdeprecated-declarations]
   php_set_error_handling(EH_NORMAL, NULL TSRMLS_CC); 
   ^
/tmp/B.cdf76908-70c1-463d-b0aa-aa86eb3926ab/BUILD/php-pecl-archive-0.2/archive_reader.c:355:2: warning: 'php_set_error_handling' is deprecated (declared at /usr/include/php/main/php.h:293) [-Wdeprecated-declarations]
  php_set_error_handling(EH_NORMAL, NULL TSRMLS_CC);
  ^
/tmp/B.cdf76908-70c1-463d-b0aa-aa86eb3926ab/BUILD/php-pecl-archive-0.2/archive_reader.c: In function 'zim_ArchiveReader_extractCurrentEntry':
/tmp/B.cdf76908-70c1-463d-b0aa-aa86eb3926ab/BUILD/php-pecl-archive-0.2/archive_reader.c:370:2: warning: 'php_set_error_handling' is deprecated (declared at /usr/include/php/main/php.h:293) [-Wdeprecated-declarations]
  php_set_error_handling(EH_THROW, ce_ArchiveException TSRMLS_CC);
  ^
/tmp/B.cdf76908-70c1-463d-b0aa-aa86eb3926ab/BUILD/php-pecl-archive-0.2/archive_reader.c:373:3: warning: 'php_set_error_handling' is deprecated (declared at /usr/include/php/main/php.h:293) [-Wdeprecated-declarations]
   php_set_error_handling(EH_NORMAL, NULL TSRMLS_CC);
   ^
/tmp/B.cdf76908-70c1-463d-b0aa-aa86eb3926ab/BUILD/php-pecl-archive-0.2/archive_reader.c:378:3: warning: 'php_set_error_handling' is deprecated (declared at /usr/include/php/main/php.h:293) [-Wdeprecated-declarations]
   php_set_error_handling(EH_NORMAL, NULL TSRMLS_CC);
   ^
/tmp/B.cdf76908-70c1-463d-b0aa-aa86eb3926ab/BUILD/php-pecl-archive-0.2/archive_reader.c:384:3: warning: 'php_set_error_handling' is deprecated (declared at /usr/include/php/main/php.h:293) [-Wdeprecated-declarations]
   php_set_error_handling(EH_NORMAL, NULL TSRMLS_CC);
   ^
/tmp/B.cdf76908-70c1-463d-b0aa-aa86eb3926ab/BUILD/php-pecl-archive-0.2/archive_reader.c:392:3: warning: 'php_set_error_handling' is deprecated (declared at /usr/include/php/main/php.h:293) [-Wdeprecated-declarations]
   php_set_error_handling(EH_NORMAL, NULL TSRMLS_CC);
   ^
/tmp/B.cdf76908-70c1-463d-b0aa-aa86eb3926ab/BUILD/php-pecl-archive-0.2/archive_reader.c:409:3: warning: 'php_set_error_handling' is deprecated (declared at /usr/include/php/main/php.h:293) [-Wdeprecated-declarations]
   php_set_error_handling(EH_NORMAL, NULL TSRMLS_CC);
   ^
/tmp/B.cdf76908-70c1-463d-b0aa-aa86eb3926ab/BUILD/php-pecl-archive-0.2/archive_reader.c:412:2: warning: 'php_set_error_handling' is deprecated (declared at /usr/include/php/main/php.h:293) [-Wdeprecated-declarations]
  php_set_error_handling(EH_NORMAL, NULL TSRMLS_CC);
  ^
/tmp/B.cdf76908-70c1-463d-b0aa-aa86eb3926ab/BUILD/php-pecl-archive-0.2/archive_reader.c: In function 'zim_ArchiveReader_close':
/tmp/B.cdf76908-70c1-463d-b0aa-aa86eb3926ab/BUILD/php-pecl-archive-0.2/archive_reader.c:425:2: warning: 'php_set_error_handling' is deprecated (declared at /usr/include/php/main/php.h:293) [-Wdeprecated-declarations]
  php_set_error_handling(EH_THROW, ce_ArchiveException TSRMLS_CC);
  ^
/tmp/B.cdf76908-70c1-463d-b0aa-aa86eb3926ab/BUILD/php-pecl-archive-0.2/archive_reader.c:430:3: warning: 'php_set_error_handling' is deprecated (declared at /usr/include/php/main/php.h:293) [-Wdeprecated-declarations]
   php_set_error_handling(EH_NORMAL, NULL TSRMLS_CC);
   ^
/tmp/B.cdf76908-70c1-463d-b0aa-aa86eb3926ab/BUILD/php-pecl-archive-0.2/archive_reader.c:435:2: warning: 'php_set_error_handling' is deprecated (declared at /usr/include/php/main/php.h:293) [-Wdeprecated-declarations]
  php_set_error_handling(EH_NORMAL, NULL TSRMLS_CC);
  ^
Makefile:206: recipe for target 'archive_writer.lo' failed
make: *** [archive_writer.lo] Error 1
Makefile:210: recipe for target 'archive_entry.lo' failed
make: *** [archive_entry.lo] Error 1
Makefile:204: recipe for target 'archive_reader.lo' failed
make: *** [archive_reader.lo] Error 1
error: Bad exit status from /tmp/B.cdf76908-70c1-463d-b0aa-aa86eb3926ab/BUILD/tmp/rpm-tmp.65931 (%build)


RPM build errors:
    Bad exit status from /tmp/B.cdf76908-70c1-463d-b0aa-aa86eb3926ab/BUILD/tmp/rpm-tmp.65931 (%build)
ended at: Mon Apr 28 14:13:29 2014, done in 0:00:07.510204
error: No files produced.
+ chmod -R u+rwX /tmp/B.cdf76908-70c1-463d-b0aa-aa86eb3926ab/BUILD
+ rm -rf /tmp/B.cdf76908-70c1-463d-b0aa-aa86eb3926ab/tmp /tmp/B.cdf76908-70c1-463d-b0aa-aa86eb3926ab/BUILD
+ rm -rf /tmp/B.cdf76908-70c1-463d-b0aa-aa86eb3926ab
Begin-PLD-Builder-Info
Build-Time: user:8.11s sys:1.08s real:12.80s (faults io:0 non-io:750367)

End-PLD-Builder-Info
[Back to list of logs] [View rpm -qa of builder]