FailedOk

th/SRPMS[OK]
th/x32[OK]
th/i686[OK]
th/x86_64[OK]

ac/SRPMS[OK]
ac/i386[OK]
ac/i586[OK]
ac/i686[OK]
ac/alpha[OK]
ac/amd64[OK]
ac/athlon[OK]
ac/ppc[OK]
ac/sparc[OK]
ac/sparc64[OK]

Advanced Search
main()
Powered by PLD Linux
(c) 2002-2024 PLD Team
$Revision: 1.37 $
Powered by Przewodniczacego Lepper-a.
Your IP: 35.174.62.162

php-pecl-jsonc 18cec9e2-bf6e-45c8-9fe0-688e86123486

Status:Failed
Source URL:https://buildlogs.pld-linux.org/pld/th/i486/FAIL/php-pecl-jsonc,18cec9e2-bf6e-45c8-9fe0-688e86123486.bz2
text/plain URL:View!
full text:View!
rpm -qa of builder:View!
Date:2015/02/10 16:59:51
Runtime:0:00:09.408990

Toc:

  • error 1
  • rpm: error: Failed build dependencies:
  • error 2
  • rpm: error: Failed build dependencies:
  • prep
  • Executing(%prep): /bin/sh -e /tmp/B.69b27b0c-f270-4e78-9153-f7ea1122824e/BUILD/tmp/rpm-tmp.28749
  • build
  • Executing(%build): /bin/sh -e /tmp/B.69b27b0c-f270-4e78-9153-f7ea1122824e/BUILD/tmp/rpm-tmp.28749
  • error 3
  • Makefile:147: recipe for target 'test' failed
  • error 4
  • error: Bad exit status from /tmp/B.69b27b0c-f270-4e78-9153-f7ea1122824e/BUILD/tmp/rpm-tmp.28749 (%build)
  • error 5
  • RPM build errors:
  • error 6
  • error: No files produced.

Content:

checking if we should skip the build
started at: Tue Feb 10 16:59:27 2015
fetching https://srcbuilder.pld-linux.org/th//srpms/18cec9e2-bf6e-45c8-9fe0-688e86123486/php53-pecl-jsonc-1.3.6-1.src.rpm
fetched 80766 bytes, 370.4 K/s
installing srpm: php53-pecl-jsonc-1.3.6-1.src.rpm
+ install -d /tmp/B.69b27b0c-f270-4e78-9153-f7ea1122824e/BUILD /tmp/B.69b27b0c-f270-4e78-9153-f7ea1122824e/RPMS
+ LC_ALL=en_US.UTF-8
+ rpm -qp --changelog php53-pecl-jsonc-1.3.6-1.src.rpm
* Tue Feb 10 2015 PLD Linux Team <feedback@pld-linux.org>
- For complete changelog see: http://git.pld-linux.org/?p=packages/php-pecl-jsonc.git;a=log;h=master
* Tue Feb 10 2015 Elan Ruusamäe <glen@delfi.ee> 5b15e38
- correct test BR * Mon Feb 09 2015 Elan Ruusamäe <glen@delfi.ee> 0f91121
- up to 1.3.6 * Fri May 30 2014 Elan Ruusamäe <glen@delfi.ee> df72a1d
- up to 1.3.5 + rpm -Uhv --nodeps --define '_topdir /tmp/B.69b27b0c-f270-4e78-9153-f7ea1122824e' --define '_specdir %{_topdir}' --define '_sourcedir %{_specdir}' --define '_rpmdir %{_topdir}/RPMS' --define '_builddir %{_topdir}/BUILD' --define 'php_suffix 53' php53-pecl-jsonc-1.3.6-1.src.rpm Preparing... ################################################## php53-pecl-jsonc ################################################## + rm -f php53-pecl-jsonc-1.3.6-1.src.rpm + install -m 700 -d /tmp/B.69b27b0c-f270-4e78-9153-f7ea1122824e/BUILD/tmp + TMPDIR=/tmp/B.69b27b0c-f270-4e78-9153-f7ea1122824e/BUILD/tmp + exec nice -n 0 rpmbuild -bp --short-circuit --nodeps --define '_topdir /tmp/B.69b27b0c-f270-4e78-9153-f7ea1122824e' --define '_specdir %{_topdir}' --define '_sourcedir %{_specdir}' --define '_rpmdir %{_topdir}/RPMS' --define '_builddir %{_topdir}/BUILD' --target i486-pld-linux --define 'php_suffix 53' --define 'prep exit 0' /tmp/B.69b27b0c-f270-4e78-9153-f7ea1122824e/php-pecl-jsonc.spec Building target platforms: i486-pld-linux checking BuildConflict-ing packages no BuildConflicts found checking BR rpm: error: Failed build dependencies: rpm: php53-devel is needed by php53-pecl-jsonc-1.3.6-1.src rpm: Building target platforms: i486-pld-linux updating poldek cache... ready is up to date Retrieving th::packages.ndir.md... th is up to date Retrieving th::packages.ndir.md... th is up to date Retrieving th-ready::packages.ndir.md... th-ready is up to date Retrieving th-ready::packages.ndir.md... th-ready is up to date Retrieving th-test::packages.ndir.md... Retrieving th-test::packages.ndir.diff.toc.gz... Retrieving diff::packages.ndir.2015.02.09-22.09.01.gz... ..............................done Retrieving diff::packages.ndir.dscr.2015.02.09-22.09.01.gz... ..............................done Loading [pndir]th-test... Applying packages.ndir.2015.02.09-22.09.01.gz... Writing /root/tmp/poldek-cache-root/[...]/packages.ndir.gz... Retrieving th-test::packages.ndir.md... th-test is up to date checking conflicting packages in BRed packages poldek: Loading [pndir]ready... poldek: Loading [pndir]th-test... poldek: Loading [pndir]th-test... poldek: Loading [pndir]th-ready... poldek: Loading [pndir]th-ready... poldek: Loading [pndir]th... poldek: Loading [pndir]th... poldek: 25512 packages read poldek: Removed 1801 duplicate packages from available set poldek: Processing dependencies... poldek: php55-devel-5.5.21-2.i486 obsoleted by php53-devel-5.3.29-10.i486 poldek: There are 1 package to install, 1 to remove: poldek: I php53-devel-5.3.29-10.i486 poldek: R php55-devel-5.5.21-2.i486 poldek: This operation will free 821.3KB of disk space. poldek: Need to get 349.3KB of archives. poldek: Executing rpm --upgrade -vh --test --root / --define _check_dirname_deps 1... poldek: Preparing... ################################################## no conflicts found checking BR rpm: error: Failed build dependencies: rpm: php53-devel is needed by php53-pecl-jsonc-1.3.6-1.src rpm: Building target platforms: i486-pld-linux installing BR: php53\-devel Loading [pndir]ready... Loading [pndir]th-test... Loading [pndir]th-test... Loading [pndir]th-ready... Loading [pndir]th-ready... Loading [pndir]th... Loading [pndir]th... 25512 packages read Removed 1801 duplicate packages from available set Processing dependencies... php55-devel-5.5.21-2.i486 obsoleted by php53-devel-5.3.29-10.i486 There are 1 package to install, 1 to remove: I php53-devel-5.3.29-10.i486 R php55-devel-5.5.21-2.i486 This operation will free 821.3KB of disk space. Need to get 349.3KB of archives. Executing rpm --upgrade -vh --root / --define _check_dirname_deps 1... Preparing... ################################################## php53-devel ################################################## building RPM using: set -ex; : build-id: 18cec9e2-bf6e-45c8-9fe0-688e86123486; TMPDIR=/tmp/B.69b27b0c-f270-4e78-9153-f7ea1122824e/BUILD/tmp exec nice -n 0 rpmbuild -bb --define '_smp_mflags -j9' --define '_make_opts -Otarget' --define '_pld_builder 1' --define '_topdir /tmp/B.69b27b0c-f270-4e78-9153-f7ea1122824e' --define '_specdir %{_topdir}' --define '_sourcedir %{_specdir}' --define '_rpmdir %{_topdir}/RPMS' --define '_builddir %{_topdir}/BUILD' --target i486-pld-linux --define 'php_suffix 53' /tmp/B.69b27b0c-f270-4e78-9153-f7ea1122824e/php-pecl-jsonc.spec + : build-id: 18cec9e2-bf6e-45c8-9fe0-688e86123486 + TMPDIR=/tmp/B.69b27b0c-f270-4e78-9153-f7ea1122824e/BUILD/tmp + exec nice -n 0 rpmbuild -bb --define '_smp_mflags -j9' --define '_make_opts -Otarget' --define '_pld_builder 1' --define '_topdir /tmp/B.69b27b0c-f270-4e78-9153-f7ea1122824e' --define '_specdir %{_topdir}' --define '_sourcedir %{_specdir}' --define '_rpmdir %{_topdir}/RPMS' --define '_builddir %{_topdir}/BUILD' --target i486-pld-linux --define 'php_suffix 53' /tmp/B.69b27b0c-f270-4e78-9153-f7ea1122824e/php-pecl-jsonc.spec Building target platforms: i486-pld-linux Executing(%prep): /bin/sh -e /tmp/B.69b27b0c-f270-4e78-9153-f7ea1122824e/BUILD/tmp/rpm-tmp.28749 + umask 022 + cd /tmp/B.69b27b0c-f270-4e78-9153-f7ea1122824e/BUILD + cd /tmp/B.69b27b0c-f270-4e78-9153-f7ea1122824e/BUILD + rm -rf php53-pecl-jsonc-1.3.6 + /bin/mkdir -p php53-pecl-jsonc-1.3.6 + cd php53-pecl-jsonc-1.3.6 + /usr/bin/gzip -dc /tmp/B.69b27b0c-f270-4e78-9153-f7ea1122824e/jsonc-1.3.6.tgz + /bin/tar -xf - + STATUS=0 + '[' 0 -ne 0 ']' + /bin/id -u + '[' 2001 '=' 0 ']' + /bin/id -u + '[' 2001 '=' 0 ']' + /bin/chmod -Rf a+rX,u+w,g-w,o-w . + mv jsonc-1.3.6/CREDITS jsonc-1.3.6/INSTALL jsonc-1.3.6/LICENSE jsonc-1.3.6/README.md jsonc-1.3.6/config.m4 jsonc-1.3.6/json-c jsonc-1.3.6/json.c jsonc-1.3.6/php_json.h jsonc-1.3.6/tests . + exit 0 Executing(%build): /bin/sh -e /tmp/B.69b27b0c-f270-4e78-9153-f7ea1122824e/BUILD/tmp/rpm-tmp.28749 TMP=/home/users/builder/tmp HOME=/home/users/builder PATH=/home/users/builder/GNUstep/Tools:/usr/local/bin:/usr/bin:/bin:/home/users/builder/bin TMPDIR=/tmp/B.69b27b0c-f270-4e78-9153-f7ea1122824e/BUILD/tmp + umask 022 + cd /tmp/B.69b27b0c-f270-4e78-9153-f7ea1122824e/BUILD + cd php53-pecl-jsonc-1.3.6 + phpize Configuring for: PHP Api Version: 20090626 Zend Module Api No: 20090626 Zend Extension Api No: 220090626 configure.in:3: warning: prefer named diversions configure.in:3: warning: prefer named diversions + ./configure 'LDFLAGS=-Wl,--as-needed -Wl,--no-copy-dt-needed-entries -Wl,-z,relro -Wl,-z,combreloc ' 'CFLAGS=-O2 -fwrapv -pipe -Wformat -Werror=format-security -gdwarf-4 -fno-debug-types-section -fvar-tracking-assignments -g2 -Wp,-D_FORTIFY_SOURCE=2 -fstack-protector --param=ssp-buffer-size=4 -fomit-frame-pointer -march=i486 -fasynchronous-unwind-tables -gdwarf-4 -fno-debug-types-section -fvar-tracking-assignments -g2 ' 'CXXFLAGS=-O2 -fwrapv -pipe -Wformat -Werror=format-security -gdwarf-4 -fno-debug-types-section -fvar-tracking-assignments -g2 -Wp,-D_FORTIFY_SOURCE=2 -fstack-protector --param=ssp-buffer-size=4 -fomit-frame-pointer -march=i486 -fasynchronous-unwind-tables -gdwarf-4 -fno-debug-types-section -fvar-tracking-assignments -g2 ' 'FFLAGS=-O2 -fwrapv -pipe -Wformat -Werror=format-security -gdwarf-4 -fno-debug-types-section -fvar-tracking-assignments -g2 -Wp,-D_FORTIFY_SOURCE=2 -fstack-protector --param=ssp-buffer-size=4 -fomit-frame-pointer -march=i486 -fasynchronous-unwind-tables -gdwarf-4 -fno-debug-types-section -fvar-tracking-assignments -g2 ' 'FCFLAGS=-O2 -fwrapv -pipe -Wformat -Werror=format-security -gdwarf-4 -fno-debug-types-section -fvar-tracking-assignments -g2 -Wp,-D_FORTIFY_SOURCE=2 -fstack-protector --param=ssp-buffer-size=4 -fomit-frame-pointer -march=i486 -fasynchronous-unwind-tables -gdwarf-4 -fno-debug-types-section -fvar-tracking-assignments -g2 ' 'CPPFLAGS=' 'CC=i486-pld-linux-gcc' 'CXX=i486-pld-linux-g++' '--host=i486-pld-linux' '--build=i486-pld-linux' '--prefix=/usr' '--exec-prefix=/usr' '--bindir=/usr/bin' '--sbindir=/usr/sbin' '--sysconfdir=/etc' '--datadir=/usr/share' '--includedir=/usr/include' '--libdir=/usr/lib' '--libexecdir=/usr/lib' '--localstatedir=/var' '--sharedstatedir=/var/lib' '--mandir=/usr/share/man' '--infodir=/usr/share/info' '--x-libraries=/usr/lib' checking for grep that handles long lines and -e... /bin/grep checking for egrep... /bin/grep -E checking for a sed that does not truncate output... /bin/sed checking for i486-pld-linux-cc... i486-pld-linux-gcc checking whether the C compiler works... yes checking for C compiler default output file name... a.out checking for suffix of executables... checking whether we are cross compiling... no checking for suffix of object files... o checking whether we are using the GNU C compiler... yes checking whether i486-pld-linux-gcc accepts -g... yes checking for i486-pld-linux-gcc option to accept ISO C89... none needed checking how to run the C preprocessor... i486-pld-linux-gcc -E checking for icc... no checking for suncc... no checking whether i486-pld-linux-gcc and cc understand -c and -o together... yes checking for system library directory... lib checking if compiler supports -R... no checking if compiler supports -Wl,-rpath,... yes checking build system type... i486-pld-linux-gnu checking host system type... i486-pld-linux-gnu checking target system type... i486-pld-linux-gnu checking for PHP prefix... /usr checking for PHP includes... -I/usr/include/php -I/usr/include/php/main -I/usr/include/php/TSRM -I/usr/include/php/Zend -I/usr/include/php/ext -I/usr/include/php/ext/date/lib checking for PHP extension directory... /usr/lib/php53 checking for PHP installed headers prefix... /usr/include/php checking if debug is enabled... no checking if zts is enabled... no checking for re2c... re2c checking for re2c version... 0.13.5 (ok) checking for gawk... gawk checking whether to enable JavaScript Object Serialization support... yes, shared checking whether to rename module file to jsonc... no checking libjson... no checking whether to enable RDRAND Hardware RNG Hash Seed generation on supported x86/x64 platforms... yes checking for ANSI C header files... yes checking for sys/types.h... yes checking for sys/stat.h... yes checking for stdlib.h... yes checking for string.h... yes checking for memory.h... yes checking for strings.h... yes checking for inttypes.h... yes checking for stdint.h... yes checking for unistd.h... yes checking minix/config.h usability... no checking minix/config.h presence... no checking for minix/config.h... no checking whether it is safe to define __EXTENSIONS__... yes checking for ANSI C header files... (cached) yes checking for working sscanf... no, not working checking fcntl.h usability... yes checking fcntl.h presence... yes checking for fcntl.h... yes checking limits.h usability... yes checking limits.h presence... yes checking for limits.h... yes checking for strings.h... (cached) yes checking syslog.h usability... yes checking syslog.h presence... yes checking for syslog.h... yes checking for unistd.h... (cached) yes checking sys/param.h usability... yes checking sys/param.h presence... yes checking for sys/param.h... yes checking stdarg.h usability... yes checking stdarg.h presence... yes checking for stdarg.h... yes checking for inttypes.h... (cached) yes checking locale.h usability... yes checking locale.h presence... yes checking for locale.h... yes checking endian.h usability... yes checking endian.h presence... yes checking for endian.h... yes checking for strcasecmp... yes checking for strdup... yes checking for strndup... yes checking for strerror... yes checking for snprintf... yes checking for vsnprintf... yes checking for vasprintf... yes checking for open... yes checking for vsyslog... yes checking for strncasecmp... yes checking for setlocale... yes checking JSON extension name:... json checking how to print strings... print -r checking for a sed that does not truncate output... (cached) /bin/sed checking for fgrep... /bin/grep -F checking for ld used by i486-pld-linux-gcc... /usr/bin/ld checking if the linker (/usr/bin/ld) is GNU ld... yes checking for BSD- or MS-compatible name lister (nm)... /usr/bin/nm -B checking the name lister (/usr/bin/nm -B) interface... BSD nm checking whether ln -s works... yes checking the maximum length of command line arguments... 1572864 checking how to convert i486-pld-linux-gnu file names to i486-pld-linux-gnu format... func_convert_file_noop checking how to convert i486-pld-linux-gnu file names to toolchain format... func_convert_file_noop checking for /usr/bin/ld option to reload object files... -r checking for i486-pld-linux-objdump... no checking for objdump... objdump checking how to recognize dependent libraries... pass_all checking for i486-pld-linux-dlltool... no checking for dlltool... no checking how to associate runtime and link libraries... print -r -- checking for i486-pld-linux-ar... no checking for ar... ar checking for archiver @FILE support... @ checking for i486-pld-linux-strip... no checking for strip... strip checking for i486-pld-linux-ranlib... no checking for ranlib... ranlib checking for mawk... (cached) gawk checking command to parse /usr/bin/nm -B output from i486-pld-linux-gcc object... ok checking for sysroot... no checking for a working dd... /bin/dd checking how to truncate binary pipes... /bin/dd bs=4096 count=1 checking for i486-pld-linux-mt... no checking for mt... no checking if : is a manifest tool... no checking for dlfcn.h... yes checking for objdir... .libs checking if i486-pld-linux-gcc supports -fno-rtti -fno-exceptions... no checking for i486-pld-linux-gcc option to produce PIC... -fPIC -DPIC checking if i486-pld-linux-gcc PIC flag -fPIC -DPIC works... yes checking if i486-pld-linux-gcc static flag -static works... yes checking if i486-pld-linux-gcc supports -c -o file.o... yes checking if i486-pld-linux-gcc supports -c -o file.o... (cached) yes checking whether the i486-pld-linux-gcc linker (/usr/bin/ld) supports shared libraries... yes checking whether -lc should be explicitly linked in... no checking dynamic linker characteristics... GNU/Linux ld.so checking how to hardcode library paths into programs... immediate checking whether stripping libraries is possible... yes checking if libtool supports shared libraries... yes checking whether to build shared libraries... yes checking whether to build static libraries... no configure: creating ./config.status config.status: creating config.h config.status: executing libtool commands + /usr/bin/make -Otarget -j9 /bin/sh /tmp/B.69b27b0c-f270-4e78-9153-f7ea1122824e/BUILD/php53-pecl-jsonc-1.3.6/libtool --mode=compile i486-pld-linux-gcc -I. -I/tmp/B.69b27b0c-f270-4e78-9153-f7ea1122824e/BUILD/php53-pecl-jsonc-1.3.6 -DPHP_ATOM_INC -I/tmp/B.69b27b0c-f270-4e78-9153-f7ea1122824e/BUILD/php53-pecl-jsonc-1.3.6/include -I/tmp/B.69b27b0c-f270-4e78-9153-f7ea1122824e/BUILD/php53-pecl-jsonc-1.3.6/main -I/tmp/B.69b27b0c-f270-4e78-9153-f7ea1122824e/BUILD/php53-pecl-jsonc-1.3.6 -I/usr/include/php -I/usr/include/php/main -I/usr/include/php/TSRM -I/usr/include/php/Zend -I/usr/include/php/ext -I/usr/include/php/ext/date/lib -DHAVE_CONFIG_H -O2 -fwrapv -pipe -Wformat -Werror=format-security -gdwarf-4 -fno-debug-types-section -fvar-tracking-assignments -g2 -Wp,-D_FORTIFY_SOURCE=2 -fstack-protector --param=ssp-buffer-size=4 -fomit-frame-pointer -march=i486 -fasynchronous-unwind-tables -gdwarf-4 -fno-debug-types-section -fvar-tracking-assignments -g2 -c /tmp/B.69b27b0c-f270-4e78-9153-f7ea1122824e/BUILD/php53-pecl-jsonc-1.3.6/json-c/json_c_version.c -o json-c/json_c_version.lo libtool: compile: i486-pld-linux-gcc -I. -I/tmp/B.69b27b0c-f270-4e78-9153-f7ea1122824e/BUILD/php53-pecl-jsonc-1.3.6 -DPHP_ATOM_INC -I/tmp/B.69b27b0c-f270-4e78-9153-f7ea1122824e/BUILD/php53-pecl-jsonc-1.3.6/include -I/tmp/B.69b27b0c-f270-4e78-9153-f7ea1122824e/BUILD/php53-pecl-jsonc-1.3.6/main -I/tmp/B.69b27b0c-f270-4e78-9153-f7ea1122824e/BUILD/php53-pecl-jsonc-1.3.6 -I/usr/include/php -I/usr/include/php/main -I/usr/include/php/TSRM -I/usr/include/php/Zend -I/usr/include/php/ext -I/usr/include/php/ext/date/lib -DHAVE_CONFIG_H -O2 -fwrapv -pipe -Wformat -Werror=format-security -gdwarf-4 -fno-debug-types-section -fvar-tracking-assignments -g2 -Wp,-D_FORTIFY_SOURCE=2 -fstack-protector --param=ssp-buffer-size=4 -fomit-frame-pointer -march=i486 -fasynchronous-unwind-tables -gdwarf-4 -fno-debug-types-section -fvar-tracking-assignments -g2 -c /tmp/B.69b27b0c-f270-4e78-9153-f7ea1122824e/BUILD/php53-pecl-jsonc-1.3.6/json-c/json_c_version.c -fPIC -DPIC -o json-c/.libs/json_c_version.o /bin/sh /tmp/B.69b27b0c-f270-4e78-9153-f7ea1122824e/BUILD/php53-pecl-jsonc-1.3.6/libtool --mode=compile i486-pld-linux-gcc -I. -I/tmp/B.69b27b0c-f270-4e78-9153-f7ea1122824e/BUILD/php53-pecl-jsonc-1.3.6 -DPHP_ATOM_INC -I/tmp/B.69b27b0c-f270-4e78-9153-f7ea1122824e/BUILD/php53-pecl-jsonc-1.3.6/include -I/tmp/B.69b27b0c-f270-4e78-9153-f7ea1122824e/BUILD/php53-pecl-jsonc-1.3.6/main -I/tmp/B.69b27b0c-f270-4e78-9153-f7ea1122824e/BUILD/php53-pecl-jsonc-1.3.6 -I/usr/include/php -I/usr/include/php/main -I/usr/include/php/TSRM -I/usr/include/php/Zend -I/usr/include/php/ext -I/usr/include/php/ext/date/lib -DHAVE_CONFIG_H -O2 -fwrapv -pipe -Wformat -Werror=format-security -gdwarf-4 -fno-debug-types-section -fvar-tracking-assignments -g2 -Wp,-D_FORTIFY_SOURCE=2 -fstack-protector --param=ssp-buffer-size=4 -fomit-frame-pointer -march=i486 -fasynchronous-unwind-tables -gdwarf-4 -fno-debug-types-section -fvar-tracking-assignments -g2 -c /tmp/B.69b27b0c-f270-4e78-9153-f7ea1122824e/BUILD/php53-pecl-jsonc-1.3.6/json-c/json_object_iterator.c -o json-c/json_object_iterator.lo libtool: compile: i486-pld-linux-gcc -I. -I/tmp/B.69b27b0c-f270-4e78-9153-f7ea1122824e/BUILD/php53-pecl-jsonc-1.3.6 -DPHP_ATOM_INC -I/tmp/B.69b27b0c-f270-4e78-9153-f7ea1122824e/BUILD/php53-pecl-jsonc-1.3.6/include -I/tmp/B.69b27b0c-f270-4e78-9153-f7ea1122824e/BUILD/php53-pecl-jsonc-1.3.6/main -I/tmp/B.69b27b0c-f270-4e78-9153-f7ea1122824e/BUILD/php53-pecl-jsonc-1.3.6 -I/usr/include/php -I/usr/include/php/main -I/usr/include/php/TSRM -I/usr/include/php/Zend -I/usr/include/php/ext -I/usr/include/php/ext/date/lib -DHAVE_CONFIG_H -O2 -fwrapv -pipe -Wformat -Werror=format-security -gdwarf-4 -fno-debug-types-section -fvar-tracking-assignments -g2 -Wp,-D_FORTIFY_SOURCE=2 -fstack-protector --param=ssp-buffer-size=4 -fomit-frame-pointer -march=i486 -fasynchronous-unwind-tables -gdwarf-4 -fno-debug-types-section -fvar-tracking-assignments -g2 -c /tmp/B.69b27b0c-f270-4e78-9153-f7ea1122824e/BUILD/php53-pecl-jsonc-1.3.6/json-c/json_object_iterator.c -fPIC -DPIC -o json-c/.libs/json_object_iterator.o /bin/sh /tmp/B.69b27b0c-f270-4e78-9153-f7ea1122824e/BUILD/php53-pecl-jsonc-1.3.6/libtool --mode=compile i486-pld-linux-gcc -I. -I/tmp/B.69b27b0c-f270-4e78-9153-f7ea1122824e/BUILD/php53-pecl-jsonc-1.3.6 -DPHP_ATOM_INC -I/tmp/B.69b27b0c-f270-4e78-9153-f7ea1122824e/BUILD/php53-pecl-jsonc-1.3.6/include -I/tmp/B.69b27b0c-f270-4e78-9153-f7ea1122824e/BUILD/php53-pecl-jsonc-1.3.6/main -I/tmp/B.69b27b0c-f270-4e78-9153-f7ea1122824e/BUILD/php53-pecl-jsonc-1.3.6 -I/usr/include/php -I/usr/include/php/main -I/usr/include/php/TSRM -I/usr/include/php/Zend -I/usr/include/php/ext -I/usr/include/php/ext/date/lib -DHAVE_CONFIG_H -O2 -fwrapv -pipe -Wformat -Werror=format-security -gdwarf-4 -fno-debug-types-section -fvar-tracking-assignments -g2 -Wp,-D_FORTIFY_SOURCE=2 -fstack-protector --param=ssp-buffer-size=4 -fomit-frame-pointer -march=i486 -fasynchronous-unwind-tables -gdwarf-4 -fno-debug-types-section -fvar-tracking-assignments -g2 -c /tmp/B.69b27b0c-f270-4e78-9153-f7ea1122824e/BUILD/php53-pecl-jsonc-1.3.6/json-c/arraylist.c -o json-c/arraylist.lo libtool: compile: i486-pld-linux-gcc -I. -I/tmp/B.69b27b0c-f270-4e78-9153-f7ea1122824e/BUILD/php53-pecl-jsonc-1.3.6 -DPHP_ATOM_INC -I/tmp/B.69b27b0c-f270-4e78-9153-f7ea1122824e/BUILD/php53-pecl-jsonc-1.3.6/include -I/tmp/B.69b27b0c-f270-4e78-9153-f7ea1122824e/BUILD/php53-pecl-jsonc-1.3.6/main -I/tmp/B.69b27b0c-f270-4e78-9153-f7ea1122824e/BUILD/php53-pecl-jsonc-1.3.6 -I/usr/include/php -I/usr/include/php/main -I/usr/include/php/TSRM -I/usr/include/php/Zend -I/usr/include/php/ext -I/usr/include/php/ext/date/lib -DHAVE_CONFIG_H -O2 -fwrapv -pipe -Wformat -Werror=format-security -gdwarf-4 -fno-debug-types-section -fvar-tracking-assignments -g2 -Wp,-D_FORTIFY_SOURCE=2 -fstack-protector --param=ssp-buffer-size=4 -fomit-frame-pointer -march=i486 -fasynchronous-unwind-tables -gdwarf-4 -fno-debug-types-section -fvar-tracking-assignments -g2 -c /tmp/B.69b27b0c-f270-4e78-9153-f7ea1122824e/BUILD/php53-pecl-jsonc-1.3.6/json-c/arraylist.c -fPIC -DPIC -o json-c/.libs/arraylist.o /bin/sh /tmp/B.69b27b0c-f270-4e78-9153-f7ea1122824e/BUILD/php53-pecl-jsonc-1.3.6/libtool --mode=compile i486-pld-linux-gcc -I. -I/tmp/B.69b27b0c-f270-4e78-9153-f7ea1122824e/BUILD/php53-pecl-jsonc-1.3.6 -DPHP_ATOM_INC -I/tmp/B.69b27b0c-f270-4e78-9153-f7ea1122824e/BUILD/php53-pecl-jsonc-1.3.6/include -I/tmp/B.69b27b0c-f270-4e78-9153-f7ea1122824e/BUILD/php53-pecl-jsonc-1.3.6/main -I/tmp/B.69b27b0c-f270-4e78-9153-f7ea1122824e/BUILD/php53-pecl-jsonc-1.3.6 -I/usr/include/php -I/usr/include/php/main -I/usr/include/php/TSRM -I/usr/include/php/Zend -I/usr/include/php/ext -I/usr/include/php/ext/date/lib -DHAVE_CONFIG_H -O2 -fwrapv -pipe -Wformat -Werror=format-security -gdwarf-4 -fno-debug-types-section -fvar-tracking-assignments -g2 -Wp,-D_FORTIFY_SOURCE=2 -fstack-protector --param=ssp-buffer-size=4 -fomit-frame-pointer -march=i486 -fasynchronous-unwind-tables -gdwarf-4 -fno-debug-types-section -fvar-tracking-assignments -g2 -c /tmp/B.69b27b0c-f270-4e78-9153-f7ea1122824e/BUILD/php53-pecl-jsonc-1.3.6/json-c/debug.c -o json-c/debug.lo libtool: compile: i486-pld-linux-gcc -I. -I/tmp/B.69b27b0c-f270-4e78-9153-f7ea1122824e/BUILD/php53-pecl-jsonc-1.3.6 -DPHP_ATOM_INC -I/tmp/B.69b27b0c-f270-4e78-9153-f7ea1122824e/BUILD/php53-pecl-jsonc-1.3.6/include -I/tmp/B.69b27b0c-f270-4e78-9153-f7ea1122824e/BUILD/php53-pecl-jsonc-1.3.6/main -I/tmp/B.69b27b0c-f270-4e78-9153-f7ea1122824e/BUILD/php53-pecl-jsonc-1.3.6 -I/usr/include/php -I/usr/include/php/main -I/usr/include/php/TSRM -I/usr/include/php/Zend -I/usr/include/php/ext -I/usr/include/php/ext/date/lib -DHAVE_CONFIG_H -O2 -fwrapv -pipe -Wformat -Werror=format-security -gdwarf-4 -fno-debug-types-section -fvar-tracking-assignments -g2 -Wp,-D_FORTIFY_SOURCE=2 -fstack-protector --param=ssp-buffer-size=4 -fomit-frame-pointer -march=i486 -fasynchronous-unwind-tables -gdwarf-4 -fno-debug-types-section -fvar-tracking-assignments -g2 -c /tmp/B.69b27b0c-f270-4e78-9153-f7ea1122824e/BUILD/php53-pecl-jsonc-1.3.6/json-c/debug.c -fPIC -DPIC -o json-c/.libs/debug.o /bin/sh /tmp/B.69b27b0c-f270-4e78-9153-f7ea1122824e/BUILD/php53-pecl-jsonc-1.3.6/libtool --mode=compile i486-pld-linux-gcc -I. -I/tmp/B.69b27b0c-f270-4e78-9153-f7ea1122824e/BUILD/php53-pecl-jsonc-1.3.6 -DPHP_ATOM_INC -I/tmp/B.69b27b0c-f270-4e78-9153-f7ea1122824e/BUILD/php53-pecl-jsonc-1.3.6/include -I/tmp/B.69b27b0c-f270-4e78-9153-f7ea1122824e/BUILD/php53-pecl-jsonc-1.3.6/main -I/tmp/B.69b27b0c-f270-4e78-9153-f7ea1122824e/BUILD/php53-pecl-jsonc-1.3.6 -I/usr/include/php -I/usr/include/php/main -I/usr/include/php/TSRM -I/usr/include/php/Zend -I/usr/include/php/ext -I/usr/include/php/ext/date/lib -DHAVE_CONFIG_H -O2 -fwrapv -pipe -Wformat -Werror=format-security -gdwarf-4 -fno-debug-types-section -fvar-tracking-assignments -g2 -Wp,-D_FORTIFY_SOURCE=2 -fstack-protector --param=ssp-buffer-size=4 -fomit-frame-pointer -march=i486 -fasynchronous-unwind-tables -gdwarf-4 -fno-debug-types-section -fvar-tracking-assignments -g2 -c /tmp/B.69b27b0c-f270-4e78-9153-f7ea1122824e/BUILD/php53-pecl-jsonc-1.3.6/json-c/json_util.c -o json-c/json_util.lo libtool: compile: i486-pld-linux-gcc -I. -I/tmp/B.69b27b0c-f270-4e78-9153-f7ea1122824e/BUILD/php53-pecl-jsonc-1.3.6 -DPHP_ATOM_INC -I/tmp/B.69b27b0c-f270-4e78-9153-f7ea1122824e/BUILD/php53-pecl-jsonc-1.3.6/include -I/tmp/B.69b27b0c-f270-4e78-9153-f7ea1122824e/BUILD/php53-pecl-jsonc-1.3.6/main -I/tmp/B.69b27b0c-f270-4e78-9153-f7ea1122824e/BUILD/php53-pecl-jsonc-1.3.6 -I/usr/include/php -I/usr/include/php/main -I/usr/include/php/TSRM -I/usr/include/php/Zend -I/usr/include/php/ext -I/usr/include/php/ext/date/lib -DHAVE_CONFIG_H -O2 -fwrapv -pipe -Wformat -Werror=format-security -gdwarf-4 -fno-debug-types-section -fvar-tracking-assignments -g2 -Wp,-D_FORTIFY_SOURCE=2 -fstack-protector --param=ssp-buffer-size=4 -fomit-frame-pointer -march=i486 -fasynchronous-unwind-tables -gdwarf-4 -fno-debug-types-section -fvar-tracking-assignments -g2 -c /tmp/B.69b27b0c-f270-4e78-9153-f7ea1122824e/BUILD/php53-pecl-jsonc-1.3.6/json-c/json_util.c -fPIC -DPIC -o json-c/.libs/json_util.o /bin/sh /tmp/B.69b27b0c-f270-4e78-9153-f7ea1122824e/BUILD/php53-pecl-jsonc-1.3.6/libtool --mode=compile i486-pld-linux-gcc -I. -I/tmp/B.69b27b0c-f270-4e78-9153-f7ea1122824e/BUILD/php53-pecl-jsonc-1.3.6 -DPHP_ATOM_INC -I/tmp/B.69b27b0c-f270-4e78-9153-f7ea1122824e/BUILD/php53-pecl-jsonc-1.3.6/include -I/tmp/B.69b27b0c-f270-4e78-9153-f7ea1122824e/BUILD/php53-pecl-jsonc-1.3.6/main -I/tmp/B.69b27b0c-f270-4e78-9153-f7ea1122824e/BUILD/php53-pecl-jsonc-1.3.6 -I/usr/include/php -I/usr/include/php/main -I/usr/include/php/TSRM -I/usr/include/php/Zend -I/usr/include/php/ext -I/usr/include/php/ext/date/lib -DHAVE_CONFIG_H -O2 -fwrapv -pipe -Wformat -Werror=format-security -gdwarf-4 -fno-debug-types-section -fvar-tracking-assignments -g2 -Wp,-D_FORTIFY_SOURCE=2 -fstack-protector --param=ssp-buffer-size=4 -fomit-frame-pointer -march=i486 -fasynchronous-unwind-tables -gdwarf-4 -fno-debug-types-section -fvar-tracking-assignments -g2 -c /tmp/B.69b27b0c-f270-4e78-9153-f7ea1122824e/BUILD/php53-pecl-jsonc-1.3.6/json-c/linkhash.c -o json-c/linkhash.lo libtool: compile: i486-pld-linux-gcc -I. -I/tmp/B.69b27b0c-f270-4e78-9153-f7ea1122824e/BUILD/php53-pecl-jsonc-1.3.6 -DPHP_ATOM_INC -I/tmp/B.69b27b0c-f270-4e78-9153-f7ea1122824e/BUILD/php53-pecl-jsonc-1.3.6/include -I/tmp/B.69b27b0c-f270-4e78-9153-f7ea1122824e/BUILD/php53-pecl-jsonc-1.3.6/main -I/tmp/B.69b27b0c-f270-4e78-9153-f7ea1122824e/BUILD/php53-pecl-jsonc-1.3.6 -I/usr/include/php -I/usr/include/php/main -I/usr/include/php/TSRM -I/usr/include/php/Zend -I/usr/include/php/ext -I/usr/include/php/ext/date/lib -DHAVE_CONFIG_H -O2 -fwrapv -pipe -Wformat -Werror=format-security -gdwarf-4 -fno-debug-types-section -fvar-tracking-assignments -g2 -Wp,-D_FORTIFY_SOURCE=2 -fstack-protector --param=ssp-buffer-size=4 -fomit-frame-pointer -march=i486 -fasynchronous-unwind-tables -gdwarf-4 -fno-debug-types-section -fvar-tracking-assignments -g2 -c /tmp/B.69b27b0c-f270-4e78-9153-f7ea1122824e/BUILD/php53-pecl-jsonc-1.3.6/json-c/linkhash.c -fPIC -DPIC -o json-c/.libs/linkhash.o /bin/sh /tmp/B.69b27b0c-f270-4e78-9153-f7ea1122824e/BUILD/php53-pecl-jsonc-1.3.6/libtool --mode=compile i486-pld-linux-gcc -I. -I/tmp/B.69b27b0c-f270-4e78-9153-f7ea1122824e/BUILD/php53-pecl-jsonc-1.3.6 -DPHP_ATOM_INC -I/tmp/B.69b27b0c-f270-4e78-9153-f7ea1122824e/BUILD/php53-pecl-jsonc-1.3.6/include -I/tmp/B.69b27b0c-f270-4e78-9153-f7ea1122824e/BUILD/php53-pecl-jsonc-1.3.6/main -I/tmp/B.69b27b0c-f270-4e78-9153-f7ea1122824e/BUILD/php53-pecl-jsonc-1.3.6 -I/usr/include/php -I/usr/include/php/main -I/usr/include/php/TSRM -I/usr/include/php/Zend -I/usr/include/php/ext -I/usr/include/php/ext/date/lib -DHAVE_CONFIG_H -O2 -fwrapv -pipe -Wformat -Werror=format-security -gdwarf-4 -fno-debug-types-section -fvar-tracking-assignments -g2 -Wp,-D_FORTIFY_SOURCE=2 -fstack-protector --param=ssp-buffer-size=4 -fomit-frame-pointer -march=i486 -fasynchronous-unwind-tables -gdwarf-4 -fno-debug-types-section -fvar-tracking-assignments -g2 -c /tmp/B.69b27b0c-f270-4e78-9153-f7ea1122824e/BUILD/php53-pecl-jsonc-1.3.6/json-c/json_object.c -o json-c/json_object.lo libtool: compile: i486-pld-linux-gcc -I. -I/tmp/B.69b27b0c-f270-4e78-9153-f7ea1122824e/BUILD/php53-pecl-jsonc-1.3.6 -DPHP_ATOM_INC -I/tmp/B.69b27b0c-f270-4e78-9153-f7ea1122824e/BUILD/php53-pecl-jsonc-1.3.6/include -I/tmp/B.69b27b0c-f270-4e78-9153-f7ea1122824e/BUILD/php53-pecl-jsonc-1.3.6/main -I/tmp/B.69b27b0c-f270-4e78-9153-f7ea1122824e/BUILD/php53-pecl-jsonc-1.3.6 -I/usr/include/php -I/usr/include/php/main -I/usr/include/php/TSRM -I/usr/include/php/Zend -I/usr/include/php/ext -I/usr/include/php/ext/date/lib -DHAVE_CONFIG_H -O2 -fwrapv -pipe -Wformat -Werror=format-security -gdwarf-4 -fno-debug-types-section -fvar-tracking-assignments -g2 -Wp,-D_FORTIFY_SOURCE=2 -fstack-protector --param=ssp-buffer-size=4 -fomit-frame-pointer -march=i486 -fasynchronous-unwind-tables -gdwarf-4 -fno-debug-types-section -fvar-tracking-assignments -g2 -c /tmp/B.69b27b0c-f270-4e78-9153-f7ea1122824e/BUILD/php53-pecl-jsonc-1.3.6/json-c/json_object.c -fPIC -DPIC -o json-c/.libs/json_object.o /bin/sh /tmp/B.69b27b0c-f270-4e78-9153-f7ea1122824e/BUILD/php53-pecl-jsonc-1.3.6/libtool --mode=compile i486-pld-linux-gcc -I. -I/tmp/B.69b27b0c-f270-4e78-9153-f7ea1122824e/BUILD/php53-pecl-jsonc-1.3.6 -DPHP_ATOM_INC -I/tmp/B.69b27b0c-f270-4e78-9153-f7ea1122824e/BUILD/php53-pecl-jsonc-1.3.6/include -I/tmp/B.69b27b0c-f270-4e78-9153-f7ea1122824e/BUILD/php53-pecl-jsonc-1.3.6/main -I/tmp/B.69b27b0c-f270-4e78-9153-f7ea1122824e/BUILD/php53-pecl-jsonc-1.3.6 -I/usr/include/php -I/usr/include/php/main -I/usr/include/php/TSRM -I/usr/include/php/Zend -I/usr/include/php/ext -I/usr/include/php/ext/date/lib -DHAVE_CONFIG_H -O2 -fwrapv -pipe -Wformat -Werror=format-security -gdwarf-4 -fno-debug-types-section -fvar-tracking-assignments -g2 -Wp,-D_FORTIFY_SOURCE=2 -fstack-protector --param=ssp-buffer-size=4 -fomit-frame-pointer -march=i486 -fasynchronous-unwind-tables -gdwarf-4 -fno-debug-types-section -fvar-tracking-assignments -g2 -c /tmp/B.69b27b0c-f270-4e78-9153-f7ea1122824e/BUILD/php53-pecl-jsonc-1.3.6/json-c/random_seed.c -o json-c/random_seed.lo libtool: compile: i486-pld-linux-gcc -I. -I/tmp/B.69b27b0c-f270-4e78-9153-f7ea1122824e/BUILD/php53-pecl-jsonc-1.3.6 -DPHP_ATOM_INC -I/tmp/B.69b27b0c-f270-4e78-9153-f7ea1122824e/BUILD/php53-pecl-jsonc-1.3.6/include -I/tmp/B.69b27b0c-f270-4e78-9153-f7ea1122824e/BUILD/php53-pecl-jsonc-1.3.6/main -I/tmp/B.69b27b0c-f270-4e78-9153-f7ea1122824e/BUILD/php53-pecl-jsonc-1.3.6 -I/usr/include/php -I/usr/include/php/main -I/usr/include/php/TSRM -I/usr/include/php/Zend -I/usr/include/php/ext -I/usr/include/php/ext/date/lib -DHAVE_CONFIG_H -O2 -fwrapv -pipe -Wformat -Werror=format-security -gdwarf-4 -fno-debug-types-section -fvar-tracking-assignments -g2 -Wp,-D_FORTIFY_SOURCE=2 -fstack-protector --param=ssp-buffer-size=4 -fomit-frame-pointer -march=i486 -fasynchronous-unwind-tables -gdwarf-4 -fno-debug-types-section -fvar-tracking-assignments -g2 -c /tmp/B.69b27b0c-f270-4e78-9153-f7ea1122824e/BUILD/php53-pecl-jsonc-1.3.6/json-c/random_seed.c -fPIC -DPIC -o json-c/.libs/random_seed.o /bin/sh /tmp/B.69b27b0c-f270-4e78-9153-f7ea1122824e/BUILD/php53-pecl-jsonc-1.3.6/libtool --mode=compile i486-pld-linux-gcc -I. -I/tmp/B.69b27b0c-f270-4e78-9153-f7ea1122824e/BUILD/php53-pecl-jsonc-1.3.6 -DPHP_ATOM_INC -I/tmp/B.69b27b0c-f270-4e78-9153-f7ea1122824e/BUILD/php53-pecl-jsonc-1.3.6/include -I/tmp/B.69b27b0c-f270-4e78-9153-f7ea1122824e/BUILD/php53-pecl-jsonc-1.3.6/main -I/tmp/B.69b27b0c-f270-4e78-9153-f7ea1122824e/BUILD/php53-pecl-jsonc-1.3.6 -I/usr/include/php -I/usr/include/php/main -I/usr/include/php/TSRM -I/usr/include/php/Zend -I/usr/include/php/ext -I/usr/include/php/ext/date/lib -DHAVE_CONFIG_H -O2 -fwrapv -pipe -Wformat -Werror=format-security -gdwarf-4 -fno-debug-types-section -fvar-tracking-assignments -g2 -Wp,-D_FORTIFY_SOURCE=2 -fstack-protector --param=ssp-buffer-size=4 -fomit-frame-pointer -march=i486 -fasynchronous-unwind-tables -gdwarf-4 -fno-debug-types-section -fvar-tracking-assignments -g2 -c /tmp/B.69b27b0c-f270-4e78-9153-f7ea1122824e/BUILD/php53-pecl-jsonc-1.3.6/json-c/printbuf.c -o json-c/printbuf.lo libtool: compile: i486-pld-linux-gcc -I. -I/tmp/B.69b27b0c-f270-4e78-9153-f7ea1122824e/BUILD/php53-pecl-jsonc-1.3.6 -DPHP_ATOM_INC -I/tmp/B.69b27b0c-f270-4e78-9153-f7ea1122824e/BUILD/php53-pecl-jsonc-1.3.6/include -I/tmp/B.69b27b0c-f270-4e78-9153-f7ea1122824e/BUILD/php53-pecl-jsonc-1.3.6/main -I/tmp/B.69b27b0c-f270-4e78-9153-f7ea1122824e/BUILD/php53-pecl-jsonc-1.3.6 -I/usr/include/php -I/usr/include/php/main -I/usr/include/php/TSRM -I/usr/include/php/Zend -I/usr/include/php/ext -I/usr/include/php/ext/date/lib -DHAVE_CONFIG_H -O2 -fwrapv -pipe -Wformat -Werror=format-security -gdwarf-4 -fno-debug-types-section -fvar-tracking-assignments -g2 -Wp,-D_FORTIFY_SOURCE=2 -fstack-protector --param=ssp-buffer-size=4 -fomit-frame-pointer -march=i486 -fasynchronous-unwind-tables -gdwarf-4 -fno-debug-types-section -fvar-tracking-assignments -g2 -c /tmp/B.69b27b0c-f270-4e78-9153-f7ea1122824e/BUILD/php53-pecl-jsonc-1.3.6/json-c/printbuf.c -fPIC -DPIC -o json-c/.libs/printbuf.o /bin/sh /tmp/B.69b27b0c-f270-4e78-9153-f7ea1122824e/BUILD/php53-pecl-jsonc-1.3.6/libtool --mode=compile i486-pld-linux-gcc -I. -I/tmp/B.69b27b0c-f270-4e78-9153-f7ea1122824e/BUILD/php53-pecl-jsonc-1.3.6 -DPHP_ATOM_INC -I/tmp/B.69b27b0c-f270-4e78-9153-f7ea1122824e/BUILD/php53-pecl-jsonc-1.3.6/include -I/tmp/B.69b27b0c-f270-4e78-9153-f7ea1122824e/BUILD/php53-pecl-jsonc-1.3.6/main -I/tmp/B.69b27b0c-f270-4e78-9153-f7ea1122824e/BUILD/php53-pecl-jsonc-1.3.6 -I/usr/include/php -I/usr/include/php/main -I/usr/include/php/TSRM -I/usr/include/php/Zend -I/usr/include/php/ext -I/usr/include/php/ext/date/lib -DHAVE_CONFIG_H -O2 -fwrapv -pipe -Wformat -Werror=format-security -gdwarf-4 -fno-debug-types-section -fvar-tracking-assignments -g2 -Wp,-D_FORTIFY_SOURCE=2 -fstack-protector --param=ssp-buffer-size=4 -fomit-frame-pointer -march=i486 -fasynchronous-unwind-tables -gdwarf-4 -fno-debug-types-section -fvar-tracking-assignments -g2 -c /tmp/B.69b27b0c-f270-4e78-9153-f7ea1122824e/BUILD/php53-pecl-jsonc-1.3.6/json-c/json_tokener.c -o json-c/json_tokener.lo libtool: compile: i486-pld-linux-gcc -I. -I/tmp/B.69b27b0c-f270-4e78-9153-f7ea1122824e/BUILD/php53-pecl-jsonc-1.3.6 -DPHP_ATOM_INC -I/tmp/B.69b27b0c-f270-4e78-9153-f7ea1122824e/BUILD/php53-pecl-jsonc-1.3.6/include -I/tmp/B.69b27b0c-f270-4e78-9153-f7ea1122824e/BUILD/php53-pecl-jsonc-1.3.6/main -I/tmp/B.69b27b0c-f270-4e78-9153-f7ea1122824e/BUILD/php53-pecl-jsonc-1.3.6 -I/usr/include/php -I/usr/include/php/main -I/usr/include/php/TSRM -I/usr/include/php/Zend -I/usr/include/php/ext -I/usr/include/php/ext/date/lib -DHAVE_CONFIG_H -O2 -fwrapv -pipe -Wformat -Werror=format-security -gdwarf-4 -fno-debug-types-section -fvar-tracking-assignments -g2 -Wp,-D_FORTIFY_SOURCE=2 -fstack-protector --param=ssp-buffer-size=4 -fomit-frame-pointer -march=i486 -fasynchronous-unwind-tables -gdwarf-4 -fno-debug-types-section -fvar-tracking-assignments -g2 -c /tmp/B.69b27b0c-f270-4e78-9153-f7ea1122824e/BUILD/php53-pecl-jsonc-1.3.6/json-c/json_tokener.c -fPIC -DPIC -o json-c/.libs/json_tokener.o /bin/sh /tmp/B.69b27b0c-f270-4e78-9153-f7ea1122824e/BUILD/php53-pecl-jsonc-1.3.6/libtool --mode=compile i486-pld-linux-gcc -I. -I/tmp/B.69b27b0c-f270-4e78-9153-f7ea1122824e/BUILD/php53-pecl-jsonc-1.3.6 -DPHP_ATOM_INC -I/tmp/B.69b27b0c-f270-4e78-9153-f7ea1122824e/BUILD/php53-pecl-jsonc-1.3.6/include -I/tmp/B.69b27b0c-f270-4e78-9153-f7ea1122824e/BUILD/php53-pecl-jsonc-1.3.6/main -I/tmp/B.69b27b0c-f270-4e78-9153-f7ea1122824e/BUILD/php53-pecl-jsonc-1.3.6 -I/usr/include/php -I/usr/include/php/main -I/usr/include/php/TSRM -I/usr/include/php/Zend -I/usr/include/php/ext -I/usr/include/php/ext/date/lib -DHAVE_CONFIG_H -O2 -fwrapv -pipe -Wformat -Werror=format-security -gdwarf-4 -fno-debug-types-section -fvar-tracking-assignments -g2 -Wp,-D_FORTIFY_SOURCE=2 -fstack-protector --param=ssp-buffer-size=4 -fomit-frame-pointer -march=i486 -fasynchronous-unwind-tables -gdwarf-4 -fno-debug-types-section -fvar-tracking-assignments -g2 -c /tmp/B.69b27b0c-f270-4e78-9153-f7ea1122824e/BUILD/php53-pecl-jsonc-1.3.6/json.c -o json.lo libtool: compile: i486-pld-linux-gcc -I. -I/tmp/B.69b27b0c-f270-4e78-9153-f7ea1122824e/BUILD/php53-pecl-jsonc-1.3.6 -DPHP_ATOM_INC -I/tmp/B.69b27b0c-f270-4e78-9153-f7ea1122824e/BUILD/php53-pecl-jsonc-1.3.6/include -I/tmp/B.69b27b0c-f270-4e78-9153-f7ea1122824e/BUILD/php53-pecl-jsonc-1.3.6/main -I/tmp/B.69b27b0c-f270-4e78-9153-f7ea1122824e/BUILD/php53-pecl-jsonc-1.3.6 -I/usr/include/php -I/usr/include/php/main -I/usr/include/php/TSRM -I/usr/include/php/Zend -I/usr/include/php/ext -I/usr/include/php/ext/date/lib -DHAVE_CONFIG_H -O2 -fwrapv -pipe -Wformat -Werror=format-security -gdwarf-4 -fno-debug-types-section -fvar-tracking-assignments -g2 -Wp,-D_FORTIFY_SOURCE=2 -fstack-protector --param=ssp-buffer-size=4 -fomit-frame-pointer -march=i486 -fasynchronous-unwind-tables -gdwarf-4 -fno-debug-types-section -fvar-tracking-assignments -g2 -c /tmp/B.69b27b0c-f270-4e78-9153-f7ea1122824e/BUILD/php53-pecl-jsonc-1.3.6/json.c -fPIC -DPIC -o .libs/json.o /bin/sh /tmp/B.69b27b0c-f270-4e78-9153-f7ea1122824e/BUILD/php53-pecl-jsonc-1.3.6/libtool --mode=link i486-pld-linux-gcc -DPHP_ATOM_INC -I/tmp/B.69b27b0c-f270-4e78-9153-f7ea1122824e/BUILD/php53-pecl-jsonc-1.3.6/include -I/tmp/B.69b27b0c-f270-4e78-9153-f7ea1122824e/BUILD/php53-pecl-jsonc-1.3.6/main -I/tmp/B.69b27b0c-f270-4e78-9153-f7ea1122824e/BUILD/php53-pecl-jsonc-1.3.6 -I/usr/include/php -I/usr/include/php/main -I/usr/include/php/TSRM -I/usr/include/php/Zend -I/usr/include/php/ext -I/usr/include/php/ext/date/lib -DHAVE_CONFIG_H -O2 -fwrapv -pipe -Wformat -Werror=format-security -gdwarf-4 -fno-debug-types-section -fvar-tracking-assignments -g2 -Wp,-D_FORTIFY_SOURCE=2 -fstack-protector --param=ssp-buffer-size=4 -fomit-frame-pointer -march=i486 -fasynchronous-unwind-tables -gdwarf-4 -fno-debug-types-section -fvar-tracking-assignments -g2 -Wl,--as-needed -Wl,--no-copy-dt-needed-entries -Wl,-z,relro -Wl,-z,combreloc -o json.la -export-dynamic -avoid-version -prefer-pic -module -rpath /tmp/B.69b27b0c-f270-4e78-9153-f7ea1122824e/BUILD/php53-pecl-jsonc-1.3.6/modules json.lo json-c/arraylist.lo json-c/debug.lo json-c/json_c_version.lo json-c/json_object.lo json-c/json_object_iterator.lo json-c/json_tokener.lo json-c/json_util.lo json-c/linkhash.lo json-c/random_seed.lo json-c/printbuf.lo libtool: link: i486-pld-linux-gcc -shared -fPIC -DPIC -O2 -gdwarf-4 -g2 -fstack-protector -march=i486 -gdwarf-4 -g2 -Wl,--as-needed -Wl,--no-copy-dt-needed-entries -Wl,-z -Wl,relro -Wl,-z -Wl,combreloc .libs/json.o json-c/.libs/arraylist.o json-c/.libs/debug.o json-c/.libs/json_c_version.o json-c/.libs/json_object.o json-c/.libs/json_object_iterator.o json-c/.libs/json_tokener.o json-c/.libs/json_util.o json-c/.libs/linkhash.o json-c/.libs/random_seed.o json-c/.libs/printbuf.o -Wl,-soname -Wl,json.so -o .libs/json.so libtool: link: ( cd ".libs" && rm -f "json.la" && ln -s "../json.la" "json.la" ) /bin/sh /tmp/B.69b27b0c-f270-4e78-9153-f7ea1122824e/BUILD/php53-pecl-jsonc-1.3.6/libtool --mode=install cp ./json.la /tmp/B.69b27b0c-f270-4e78-9153-f7ea1122824e/BUILD/php53-pecl-jsonc-1.3.6/modules libtool: install: cp ./.libs/json.so /tmp/B.69b27b0c-f270-4e78-9153-f7ea1122824e/BUILD/php53-pecl-jsonc-1.3.6/modules/json.so libtool: install: cp ./.libs/json.lai /tmp/B.69b27b0c-f270-4e78-9153-f7ea1122824e/BUILD/php53-pecl-jsonc-1.3.6/modules/json.la libtool: finish: PATH="/home/users/builder/GNUstep/Tools:/usr/local/bin:/usr/bin:/bin:/home/users/builder/bin:/sbin" ldconfig -n /tmp/B.69b27b0c-f270-4e78-9153-f7ea1122824e/BUILD/php53-pecl-jsonc-1.3.6/modules ---------------------------------------------------------------------- Libraries have been installed in: /tmp/B.69b27b0c-f270-4e78-9153-f7ea1122824e/BUILD/php53-pecl-jsonc-1.3.6/modules If you ever happen to want to link against installed libraries in a given directory, LIBDIR, you must either use libtool, and specify the full pathname of the library, or use the '-LLIBDIR' flag during linking and do at least one of the following: - add LIBDIR to the 'LD_LIBRARY_PATH' environment variable during execution - add LIBDIR to the 'LD_RUN_PATH' environment variable during linking - use the '-Wl,-rpath -Wl,LIBDIR' linker flag - have your system administrator add LIBDIR to '/etc/ld.so.conf' See any operating system documentation about shared libraries for more information, such as the ld(1) and ld.so(8) manual pages. ---------------------------------------------------------------------- Build complete. Don't forget to run 'make test'. + >modules.log + /usr/bin/php53 -n -q -d 'extension_dir=modules' -d 'extension=json.so' -m + grep json modules.log json + export 'NO_INTERACTION=1' 'REPORT_EXIT_STATUS=1' 'MALLOC_CHECK_=2' + /usr/bin/make -Otarget -j9 test 'PHP_EXECUTABLE=/usr/bin/php53' Build complete. Don't forget to run 'make test'. ===================================================================== PHP : /usr/bin/php53 PHP_SAPI : cli PHP_VERSION : 5.3.29 ZEND_VERSION: 2.3.0 PHP_OS : Linux - Linux naiad-pld 3.14.22-1 #1 SMP Sun Oct 19 10:16:35 CEST 2014 i686 INI actual : /tmp/B.69b27b0c-f270-4e78-9153-f7ea1122824e/BUILD/php53-pecl-jsonc-1.3.6/tmp-php.ini More .INIs : CWD : /tmp/B.69b27b0c-f270-4e78-9153-f7ea1122824e/BUILD/php53-pecl-jsonc-1.3.6 Extra dirs : VALGRIND : Not used ===================================================================== TIME START 2015-02-10 15:59:50 ===================================================================== TEST 1/54 [tests/001.phpt] PASS json_decode() tests [tests/001.phpt] TEST 2/54 [tests/002.phpt] FAIL json_encode() tests [tests/002.phpt] TEST 3/54 [tests/003.phpt] PASS json_encode() & endless loop - 1 [tests/003.phpt] TEST 4/54 [tests/004.phpt] FAIL json_encode() & endless loop - 2 [tests/004.phpt] TEST 5/54 [tests/005.phpt] PASS json_encode() & endless loop - 3 [tests/005.phpt] TEST 6/54 [tests/006.phpt] FAIL json_encode() & extended encoding [tests/006.phpt] TEST 7/54 [tests/007-jsonc.phpt] PASS json_last_error() tests [tests/007-jsonc.phpt] TEST 8/54 [tests/007.phpt] XFAIL json_last_error() tests [tests/007.phpt] XFAIL REASON: Different parser, so different error codes. TEST 9/54 [tests/008-jsonc.phpt] SKIP json_decode() with large integers [tests/008-jsonc.phpt] reason: this test is for 64bit platform only TEST 10/54 [tests/008.phpt] XFAIL json_decode() with large integers [tests/008.phpt] XFAIL REASON: Large number always treat as integer. TEST 11/54 [tests/009-incrementalparser.phpt] FAIL JsonIncremantalParser::parse() simple test [tests/009-incrementalparser.phpt] TEST 12/54 [tests/010-incrementalparserfile.phpt] FAIL JsonIncremantalParser::parseFile() test [tests/010-incrementalparserfile.phpt] TEST 13/54 [tests/011-comments.phpt] PASS JsonIncremantalParser::parseFile() test [tests/011-comments.phpt] TEST 14/54 [tests/012-null-byte.phpt] PASS Decode value with null-byte (key not yet properly decode) [tests/012-null-byte.phpt] TEST 15/54 [tests/bug40503.phpt] PASS Bug #40503 (json_encode() value corruption on 32bit systems with overflown values) [tests/bug40503.phpt] TEST 16/54 [tests/bug41034.phpt] FAIL Bug #41034 (json_encode() ignores null byte started keys in arrays) [tests/bug41034.phpt] TEST 17/54 [tests/bug41067.phpt] FAIL Bug #41067 (json_encode() problem with UTF-16 input) [tests/bug41067.phpt] TEST 18/54 [tests/bug41403.phpt] PASS Bug #41403 (json_decode cannot decode floats if localeconv decimal_point is not '.') [tests/bug41403.phpt] TEST 19/54 [tests/bug41504.phpt] PASS Bug #41504 (json_decode() converts empty array keys to "_empty_") [tests/bug41504.phpt] TEST 20/54 [tests/bug41567.phpt] PASS Bug #41567 (json_encode() double conversion is inconsistent with PHP) [tests/bug41567.phpt] TEST 21/54 [tests/bug42090.phpt] FAIL Bug #42090 (json_decode causes segmentation fault) [tests/bug42090.phpt] TEST 22/54 [tests/bug42785.phpt] FAIL Bug #42785 (Incorrect formatting of double values with non-english locales) [tests/bug42785.phpt] TEST 23/54 [tests/bug43941.phpt] FAIL Bug #43941 (json_encode() invalid UTF-8) [tests/bug43941.phpt] TEST 24/54 [tests/bug45791.phpt] PASS Bug #45791 (json_decode() does not handle number 0e0) [tests/bug45791.phpt] TEST 25/54 [tests/bug46215.phpt] PASS Bug #46215 (json_encode mutates its parameter and has some class-specific state) [tests/bug46215.phpt] TEST 26/54 [tests/bug46944.phpt] FAIL Bug #46944 (json_encode() doesn't handle 3 byte utf8 correctly) [tests/bug46944.phpt] TEST 27/54 [tests/bug47644.phpt] SKIP Bug #47644 (valid large integers are truncated) [tests/bug47644.phpt] reason: this test is for 64bit platform only TEST 28/54 [tests/bug53946.phpt] FAIL bug #53946 (json_encode() with JSON_UNESCAPED_UNICODE) [tests/bug53946.phpt] TEST 29/54 [tests/bug54058.phpt] FAIL Bug #54058 (json_last_error() invalid UTF-8 produces wrong error) [tests/bug54058.phpt] TEST 30/54 [tests/bug54484.phpt] PASS Bug #54484 (Empty string in json_decode doesn't reset json_last_error) [tests/bug54484.phpt] TEST 31/54 [tests/bug55543.phpt] FAIL Bug #55543 (json_encode() with JSON_NUMERIC_CHECK & numeric string properties) [tests/bug55543.phpt] TEST 32/54 [tests/bug61537.phpt] FAIL Bug #61537 (json_encode() incorrectly truncates/discards information) [tests/bug61537.phpt] TEST 33/54 [tests/bug61978.phpt] FAIL Bug #61978 (Object recursion not detected for classes that implement JsonSerializable) [tests/bug61978.phpt] TEST 34/54 [tests/bug62369.phpt] PASS FR #62369 (Segfault on json_encode(deeply_nested_array) [tests/bug62369.phpt] TEST 35/54 [tests/bug66021.phpt] FAIL Bug #66021 (Blank line inside empty array/object when JSON_PRETTY_PRINT is set) [tests/bug66021.phpt] TEST 36/54 [tests/depth.phpt] PASS json_decode() with max recursion depth [tests/depth.phpt] TEST 37/54 [tests/fail001.phpt] PASS JSON (http://www.crockford.com/JSON/JSON_checker/test/fail*.json) [tests/fail001.phpt] TEST 38/54 [tests/inf_nan_error.phpt] PASS An error is thrown when INF or NaN are encoded [tests/inf_nan_error.phpt] TEST 39/54 [tests/json_decode_basic.phpt] PASS Test json_decode() function : basic functionality [tests/json_decode_basic.phpt] TEST 40/54 [tests/json_decode_error.phpt] PASS Test json_decode() function : error conditions [tests/json_decode_error.phpt] TEST 41/54 [tests/json_encode_basic.phpt] FAIL Test json_encode() function : basic functionality [tests/json_encode_basic.phpt] TEST 42/54 [tests/json_encode_basic_utf8.phpt] FAIL Test json_encode() function : basic functionality with UTF8 string input [tests/json_encode_basic_utf8.phpt] TEST 43/54 [tests/json_encode_error.phpt] FAIL Test json_encode() function : error conditions [tests/json_encode_error.phpt] TEST 44/54 [tests/json_encode_numeric.phpt] FAIL Test json_encode() function with numeric flag [tests/json_encode_numeric.phpt] TEST 45/54 [tests/json_encode_pretty_print.phpt] FAIL json_encode() with JSON_PRETTY_PRINT [tests/json_encode_pretty_print.phpt] TEST 46/54 [tests/json_encode_unescaped_slashes.phpt] FAIL json_decode() tests [tests/json_encode_unescaped_slashes.phpt] TEST 47/54 [tests/jsonp.phpt] PASS json_decode() with comments [tests/jsonp.phpt] TEST 48/54 [tests/pass001.1.phpt] FAIL JSON (http://www.crockford.com/JSON/JSON_checker/test/pass1.json) [tests/pass001.1.phpt] TEST 49/54 [tests/pass001.1_64bit.phpt] SKIP JSON (http://www.crockford.com/JSON/JSON_checker/test/pass1.json) [tests/pass001.1_64bit.phpt] reason: this test is for 64bit platform only TEST 50/54 [tests/pass001.phpt] FAIL JSON (http://www.crockford.com/JSON/JSON_checker/test/pass1.json) [tests/pass001.phpt] TEST 51/54 [tests/pass002.phpt] FAIL JSON (http://www.crockford.com/JSON/JSON_checker/test/pass2.json) [tests/pass002.phpt] TEST 52/54 [tests/pass003.phpt] FAIL JSON (http://www.crockford.com/JSON/JSON_checker/test/pass3.json) [tests/pass003.phpt] TEST 53/54 [tests/serialize.phpt] FAIL json_encode() Serialization tests [tests/serialize.phpt] TEST 54/54 [tests/unsupported_type_error.phpt] PASS An error is thrown when an unsupported type is encoded [tests/unsupported_type_error.phpt] ===================================================================== TIME END 2015-02-10 15:59:51 ===================================================================== TEST RESULT SUMMARY --------------------------------------------------------------------- Exts skipped : 0 Exts tested : 7 --------------------------------------------------------------------- Number of tests : 54 51 Tests skipped : 3 ( 5.6%) -------- Tests warned : 0 ( 0.0%) ( 0.0%) Tests failed : 28 ( 51.9%) ( 54.9%) Expected fail : 2 ( 3.7%) ( 3.9%) Tests passed : 21 ( 38.9%) ( 41.2%) --------------------------------------------------------------------- Time taken : 1 seconds ===================================================================== ===================================================================== EXPECTED FAILED TEST SUMMARY --------------------------------------------------------------------- json_last_error() tests [tests/007.phpt] XFAIL REASON: Different parser, so different error codes. json_decode() with large integers [tests/008.phpt] XFAIL REASON: Large number always treat as integer. ===================================================================== ===================================================================== FAILED TEST SUMMARY --------------------------------------------------------------------- json_encode() tests [tests/002.phpt] json_encode() & endless loop - 2 [tests/004.phpt] json_encode() & extended encoding [tests/006.phpt] JsonIncremantalParser::parse() simple test [tests/009-incrementalparser.phpt] JsonIncremantalParser::parseFile() test [tests/010-incrementalparserfile.phpt] Bug #41034 (json_encode() ignores null byte started keys in arrays) [tests/bug41034.phpt] Bug #41067 (json_encode() problem with UTF-16 input) [tests/bug41067.phpt] Bug #42090 (json_decode causes segmentation fault) [tests/bug42090.phpt] Bug #42785 (Incorrect formatting of double values with non-english locales) [tests/bug42785.phpt] Bug #43941 (json_encode() invalid UTF-8) [tests/bug43941.phpt] Bug #46944 (json_encode() doesn't handle 3 byte utf8 correctly) [tests/bug46944.phpt] bug #53946 (json_encode() with JSON_UNESCAPED_UNICODE) [tests/bug53946.phpt] Bug #54058 (json_last_error() invalid UTF-8 produces wrong error) [tests/bug54058.phpt] Bug #55543 (json_encode() with JSON_NUMERIC_CHECK & numeric string properties) [tests/bug55543.phpt] Bug #61537 (json_encode() incorrectly truncates/discards information) [tests/bug61537.phpt] Bug #61978 (Object recursion not detected for classes that implement JsonSerializable) [tests/bug61978.phpt] Bug #66021 (Blank line inside empty array/object when JSON_PRETTY_PRINT is set) [tests/bug66021.phpt] Test json_encode() function : basic functionality [tests/json_encode_basic.phpt] Test json_encode() function : basic functionality with UTF8 string input [tests/json_encode_basic_utf8.phpt] Test json_encode() function : error conditions [tests/json_encode_error.phpt] Test json_encode() function with numeric flag [tests/json_encode_numeric.phpt] json_encode() with JSON_PRETTY_PRINT [tests/json_encode_pretty_print.phpt] json_decode() tests [tests/json_encode_unescaped_slashes.phpt] JSON (http://www.crockford.com/JSON/JSON_checker/test/pass1.json) [tests/pass001.1.phpt] JSON (http://www.crockford.com/JSON/JSON_checker/test/pass1.json) [tests/pass001.phpt] JSON (http://www.crockford.com/JSON/JSON_checker/test/pass2.json) [tests/pass002.phpt] JSON (http://www.crockford.com/JSON/JSON_checker/test/pass3.json) [tests/pass003.phpt] json_encode() Serialization tests [tests/serialize.phpt] ===================================================================== Makefile:147: recipe for target 'test' failed make: *** [test] Error 1 error: Bad exit status from /tmp/B.69b27b0c-f270-4e78-9153-f7ea1122824e/BUILD/tmp/rpm-tmp.28749 (%build) RPM build errors: Bad exit status from /tmp/B.69b27b0c-f270-4e78-9153-f7ea1122824e/BUILD/tmp/rpm-tmp.28749 (%build) ended at: Tue Feb 10 16:59:51 2015, done in 0:00:09.408990 error: No files produced. + chmod -R u+rwX /tmp/B.69b27b0c-f270-4e78-9153-f7ea1122824e/BUILD + rm -rf /tmp/B.69b27b0c-f270-4e78-9153-f7ea1122824e/tmp /tmp/B.69b27b0c-f270-4e78-9153-f7ea1122824e/BUILD + rm -rf /tmp/B.69b27b0c-f270-4e78-9153-f7ea1122824e Begin-PLD-Builder-Info Build-Time: user:19.96s sys:4.54s real:24.46s (faults io:0 non-io:1606688) End-PLD-Builder-Info
[Back to list of logs] [View rpm -qa of builder]