FailedOk

th/SRPMS[OK]
th/x32[OK]
th/i686[OK]
th/x86_64[OK]

ac/SRPMS[OK]
ac/i386[OK]
ac/i586[OK]
ac/i686[OK]
ac/alpha[OK]
ac/amd64[OK]
ac/athlon[OK]
ac/ppc[OK]
ac/sparc[OK]
ac/sparc64[OK]

Advanced Search
main()
Powered by PLD Linux
(c) 2002-2024 PLD Team
$Revision: 1.37 $
Powered by foobarbaz.
Your IP: 35.174.62.162

php-pecl-jsonc d7bb6cb9-23cd-4cc7-8cbd-588120b9c8c6

Status:Failed
Source URL:https://buildlogs.pld-linux.org/pld/th/i486/FAIL/php-pecl-jsonc,d7bb6cb9-23cd-4cc7-8cbd-588120b9c8c6.bz2
text/plain URL:View!
full text:View!
rpm -qa of builder:View!
Date:2015/02/10 14:37:40
Runtime:0:00:06.274302

Toc:

  • error 1
  • rpm: error: Failed build dependencies:
  • error 2
  • rpm: error: Failed build dependencies:
  • prep
  • Executing(%prep): /bin/sh -e /tmp/B.d6b853e3-1df1-4161-9593-4b43c6dd2477/BUILD/tmp/rpm-tmp.45097
  • build
  • Executing(%build): /bin/sh -e /tmp/B.d6b853e3-1df1-4161-9593-4b43c6dd2477/BUILD/tmp/rpm-tmp.45097
  • error 3
  • Makefile:201: recipe for target 'json.lo' failed
  • error 4
  • Makefile:203: recipe for target 'json-c/arraylist.lo' failed
  • error 5
  • Makefile:205: recipe for target 'json-c/debug.lo' failed
  • error 6
  • error: Bad exit status from /tmp/B.d6b853e3-1df1-4161-9593-4b43c6dd2477/BUILD/tmp/rpm-tmp.45097 (%build)
  • error 7
  • RPM build errors:
  • error 8
  • error: No files produced.

Content:

checking if we should skip the build
started at: Tue Feb 10 14:37:22 2015
fetching https://srcbuilder.pld-linux.org/th//srpms/d7bb6cb9-23cd-4cc7-8cbd-588120b9c8c6/php55-pecl-jsonc-1.3.6-1.src.rpm
fetched 80673 bytes, 371.1 K/s
installing srpm: php55-pecl-jsonc-1.3.6-1.src.rpm
+ install -d /tmp/B.d6b853e3-1df1-4161-9593-4b43c6dd2477/BUILD /tmp/B.d6b853e3-1df1-4161-9593-4b43c6dd2477/RPMS
+ LC_ALL=en_US.UTF-8
+ rpm -qp --changelog php55-pecl-jsonc-1.3.6-1.src.rpm
* Tue Feb 10 2015 PLD Linux Team <feedback@pld-linux.org>
- For complete changelog see: http://git.pld-linux.org/?p=packages/php-pecl-jsonc.git;a=log;h=master
* Mon Feb 09 2015 Elan Ruusamäe <glen@delfi.ee> 0f91121
- up to 1.3.6 * Fri May 30 2014 Elan Ruusamäe <glen@delfi.ee> df72a1d
- up to 1.3.5 + rpm -Uhv --nodeps --define '_topdir /tmp/B.d6b853e3-1df1-4161-9593-4b43c6dd2477' --define '_specdir %{_topdir}' --define '_sourcedir %{_specdir}' --define '_rpmdir %{_topdir}/RPMS' --define '_builddir %{_topdir}/BUILD' --define 'php_suffix 55' php55-pecl-jsonc-1.3.6-1.src.rpm Preparing... ################################################## php55-pecl-jsonc ################################################## + rm -f php55-pecl-jsonc-1.3.6-1.src.rpm + install -m 700 -d /tmp/B.d6b853e3-1df1-4161-9593-4b43c6dd2477/BUILD/tmp + TMPDIR=/tmp/B.d6b853e3-1df1-4161-9593-4b43c6dd2477/BUILD/tmp + exec nice -n 0 rpmbuild -bp --short-circuit --nodeps --define '_topdir /tmp/B.d6b853e3-1df1-4161-9593-4b43c6dd2477' --define '_specdir %{_topdir}' --define '_sourcedir %{_specdir}' --define '_rpmdir %{_topdir}/RPMS' --define '_builddir %{_topdir}/BUILD' --target i486-pld-linux --define 'php_suffix 55' --define 'prep exit 0' /tmp/B.d6b853e3-1df1-4161-9593-4b43c6dd2477/php-pecl-jsonc.spec Building target platforms: i486-pld-linux checking BuildConflict-ing packages no BuildConflicts found checking BR rpm: error: Failed build dependencies: rpm: php55-devel is needed by php55-pecl-jsonc-1.3.6-1.src rpm: Building target platforms: i486-pld-linux updating poldek cache... ready is up to date Retrieving th::packages.ndir.md... th is up to date Retrieving th::packages.ndir.md... th is up to date Retrieving th-ready::packages.ndir.md... th-ready is up to date Retrieving th-ready::packages.ndir.md... th-ready is up to date Retrieving th-test::packages.ndir.md... th-test is up to date Retrieving th-test::packages.ndir.md... th-test is up to date checking conflicting packages in BRed packages poldek: Loading [pndir]ready... poldek: Loading [pndir]th-test... poldek: Loading [pndir]th-test... poldek: Loading [pndir]th-ready... poldek: Loading [pndir]th-ready... poldek: Loading [pndir]th... poldek: Loading [pndir]th... poldek: 25403 packages read poldek: Removed 1684 duplicate packages from available set poldek: Processing dependencies... poldek: php53-devel-5.3.29-10.i486 obsoleted by php55-devel-5.5.21-1.i486 poldek: There are 1 package to install, 1 to remove: poldek: I php55-devel-5.5.21-1.i486 poldek: R php53-devel-5.3.29-10.i486 poldek: This operation will use 821.3KB of disk space. poldek: Need to get 405.8KB of archives. poldek: Executing rpm --upgrade -vh --test --root / --define _check_dirname_deps 1... poldek: Preparing... ################################################## no conflicts found checking BR rpm: error: Failed build dependencies: rpm: php55-devel is needed by php55-pecl-jsonc-1.3.6-1.src rpm: Building target platforms: i486-pld-linux installing BR: php55\-devel Loading [pndir]ready... Loading [pndir]th-test... Loading [pndir]th-test... Loading [pndir]th-ready... Loading [pndir]th-ready... Loading [pndir]th... Loading [pndir]th... 25403 packages read Removed 1684 duplicate packages from available set Processing dependencies... php53-devel-5.3.29-10.i486 obsoleted by php55-devel-5.5.21-1.i486 There are 1 package to install, 1 to remove: I php55-devel-5.5.21-1.i486 R php53-devel-5.3.29-10.i486 This operation will use 821.3KB of disk space. Need to get 405.8KB of archives. Executing rpm --upgrade -vh --root / --define _check_dirname_deps 1... Preparing... ################################################## php55-devel ################################################## building RPM using: set -ex; : build-id: d7bb6cb9-23cd-4cc7-8cbd-588120b9c8c6; TMPDIR=/tmp/B.d6b853e3-1df1-4161-9593-4b43c6dd2477/BUILD/tmp exec nice -n 0 rpmbuild -bb --define '_smp_mflags -j9' --define '_make_opts -Otarget' --define '_pld_builder 1' --define '_topdir /tmp/B.d6b853e3-1df1-4161-9593-4b43c6dd2477' --define '_specdir %{_topdir}' --define '_sourcedir %{_specdir}' --define '_rpmdir %{_topdir}/RPMS' --define '_builddir %{_topdir}/BUILD' --target i486-pld-linux --define 'php_suffix 55' /tmp/B.d6b853e3-1df1-4161-9593-4b43c6dd2477/php-pecl-jsonc.spec + : build-id: d7bb6cb9-23cd-4cc7-8cbd-588120b9c8c6 + TMPDIR=/tmp/B.d6b853e3-1df1-4161-9593-4b43c6dd2477/BUILD/tmp + exec nice -n 0 rpmbuild -bb --define '_smp_mflags -j9' --define '_make_opts -Otarget' --define '_pld_builder 1' --define '_topdir /tmp/B.d6b853e3-1df1-4161-9593-4b43c6dd2477' --define '_specdir %{_topdir}' --define '_sourcedir %{_specdir}' --define '_rpmdir %{_topdir}/RPMS' --define '_builddir %{_topdir}/BUILD' --target i486-pld-linux --define 'php_suffix 55' /tmp/B.d6b853e3-1df1-4161-9593-4b43c6dd2477/php-pecl-jsonc.spec Building target platforms: i486-pld-linux Executing(%prep): /bin/sh -e /tmp/B.d6b853e3-1df1-4161-9593-4b43c6dd2477/BUILD/tmp/rpm-tmp.45097 + umask 022 + cd /tmp/B.d6b853e3-1df1-4161-9593-4b43c6dd2477/BUILD + cd /tmp/B.d6b853e3-1df1-4161-9593-4b43c6dd2477/BUILD + rm -rf php55-pecl-jsonc-1.3.6 + /bin/mkdir -p php55-pecl-jsonc-1.3.6 + cd php55-pecl-jsonc-1.3.6 + /usr/bin/gzip -dc /tmp/B.d6b853e3-1df1-4161-9593-4b43c6dd2477/jsonc-1.3.6.tgz + /bin/tar -xf - + STATUS=0 + '[' 0 -ne 0 ']' + /bin/id -u + '[' 2001 '=' 0 ']' + /bin/id -u + '[' 2001 '=' 0 ']' + /bin/chmod -Rf a+rX,u+w,g-w,o-w . + mv jsonc-1.3.6/CREDITS jsonc-1.3.6/INSTALL jsonc-1.3.6/LICENSE jsonc-1.3.6/README.md jsonc-1.3.6/config.m4 jsonc-1.3.6/json-c jsonc-1.3.6/json.c jsonc-1.3.6/php_json.h jsonc-1.3.6/tests . + exit 0 Executing(%build): /bin/sh -e /tmp/B.d6b853e3-1df1-4161-9593-4b43c6dd2477/BUILD/tmp/rpm-tmp.45097 TMP=/home/users/builder/tmp HOME=/home/users/builder PATH=/home/users/builder/GNUstep/Tools:/usr/local/bin:/usr/bin:/bin:/home/users/builder/bin TMPDIR=/tmp/B.d6b853e3-1df1-4161-9593-4b43c6dd2477/BUILD/tmp + umask 022 + cd /tmp/B.d6b853e3-1df1-4161-9593-4b43c6dd2477/BUILD + cd php55-pecl-jsonc-1.3.6 + phpize Configuring for: PHP Api Version: 20121113 Zend Module Api No: 20121212 Zend Extension Api No: 220121212 cp: cannot stat 'ltmain.sh': No such file or directory + ./configure 'LDFLAGS=-Wl,--as-needed -Wl,--no-copy-dt-needed-entries -Wl,-z,relro -Wl,-z,combreloc ' 'CFLAGS=-O2 -fwrapv -pipe -Wformat -Werror=format-security -gdwarf-4 -fno-debug-types-section -fvar-tracking-assignments -g2 -Wp,-D_FORTIFY_SOURCE=2 -fstack-protector --param=ssp-buffer-size=4 -fomit-frame-pointer -march=i486 -fasynchronous-unwind-tables -gdwarf-4 -fno-debug-types-section -fvar-tracking-assignments -g2 ' 'CXXFLAGS=-O2 -fwrapv -pipe -Wformat -Werror=format-security -gdwarf-4 -fno-debug-types-section -fvar-tracking-assignments -g2 -Wp,-D_FORTIFY_SOURCE=2 -fstack-protector --param=ssp-buffer-size=4 -fomit-frame-pointer -march=i486 -fasynchronous-unwind-tables -gdwarf-4 -fno-debug-types-section -fvar-tracking-assignments -g2 ' 'FFLAGS=-O2 -fwrapv -pipe -Wformat -Werror=format-security -gdwarf-4 -fno-debug-types-section -fvar-tracking-assignments -g2 -Wp,-D_FORTIFY_SOURCE=2 -fstack-protector --param=ssp-buffer-size=4 -fomit-frame-pointer -march=i486 -fasynchronous-unwind-tables -gdwarf-4 -fno-debug-types-section -fvar-tracking-assignments -g2 ' 'FCFLAGS=-O2 -fwrapv -pipe -Wformat -Werror=format-security -gdwarf-4 -fno-debug-types-section -fvar-tracking-assignments -g2 -Wp,-D_FORTIFY_SOURCE=2 -fstack-protector --param=ssp-buffer-size=4 -fomit-frame-pointer -march=i486 -fasynchronous-unwind-tables -gdwarf-4 -fno-debug-types-section -fvar-tracking-assignments -g2 ' 'CPPFLAGS=' 'CC=i486-pld-linux-gcc' 'CXX=i486-pld-linux-g++' '--host=i486-pld-linux' '--build=i486-pld-linux' '--prefix=/usr' '--exec-prefix=/usr' '--bindir=/usr/bin' '--sbindir=/usr/sbin' '--sysconfdir=/etc' '--datadir=/usr/share' '--includedir=/usr/include' '--libdir=/usr/lib' '--libexecdir=/usr/lib' '--localstatedir=/var' '--sharedstatedir=/var/lib' '--mandir=/usr/share/man' '--infodir=/usr/share/info' '--x-libraries=/usr/lib' checking for grep that handles long lines and -e... /bin/grep checking for egrep... /bin/grep -E checking for a sed that does not truncate output... /bin/sed checking for i486-pld-linux-cc... i486-pld-linux-gcc checking whether the C compiler works... yes checking for C compiler default output file name... a.out checking for suffix of executables... checking whether we are cross compiling... no checking for suffix of object files... o checking whether we are using the GNU C compiler... yes checking whether i486-pld-linux-gcc accepts -g... yes checking for i486-pld-linux-gcc option to accept ISO C89... none needed checking how to run the C preprocessor... i486-pld-linux-gcc -E checking for icc... no checking for suncc... no checking whether i486-pld-linux-gcc and cc understand -c and -o together... yes checking for system library directory... lib checking if compiler supports -R... no checking if compiler supports -Wl,-rpath,... yes checking build system type... i486-pld-linux-gnu checking host system type... i486-pld-linux-gnu checking target system type... i486-pld-linux-gnu checking for PHP prefix... /usr checking for PHP includes... -I/usr/include/php -I/usr/include/php/main -I/usr/include/php/TSRM -I/usr/include/php/Zend -I/usr/include/php/ext -I/usr/include/php/ext/date/lib checking for PHP extension directory... /usr/lib/php55 checking for PHP installed headers prefix... /usr/include/php checking if debug is enabled... no checking if zts is enabled... no checking for re2c... re2c checking for re2c version... 0.13.5 (ok) checking for gawk... gawk checking whether to enable JavaScript Object Serialization support... yes, shared checking whether to rename module file to jsonc... no checking libjson... no checking whether to enable RDRAND Hardware RNG Hash Seed generation on supported x86/x64 platforms... yes checking for ANSI C header files... yes checking for sys/types.h... yes checking for sys/stat.h... yes checking for stdlib.h... yes checking for string.h... yes checking for memory.h... yes checking for strings.h... yes checking for inttypes.h... yes checking for stdint.h... yes checking for unistd.h... yes checking minix/config.h usability... no checking minix/config.h presence... no checking for minix/config.h... no checking whether it is safe to define __EXTENSIONS__... yes checking for ANSI C header files... (cached) yes checking for working sscanf... no, not working checking fcntl.h usability... yes checking fcntl.h presence... yes checking for fcntl.h... yes checking limits.h usability... yes checking limits.h presence... yes checking for limits.h... yes checking for strings.h... (cached) yes checking syslog.h usability... yes checking syslog.h presence... yes checking for syslog.h... yes checking for unistd.h... (cached) yes checking sys/param.h usability... yes checking sys/param.h presence... yes checking for sys/param.h... yes checking stdarg.h usability... yes checking stdarg.h presence... yes checking for stdarg.h... yes checking for inttypes.h... (cached) yes checking locale.h usability... yes checking locale.h presence... yes checking for locale.h... yes checking endian.h usability... yes checking endian.h presence... yes checking for endian.h... yes checking for strcasecmp... yes checking for strdup... yes checking for strndup... yes checking for strerror... yes checking for snprintf... yes checking for vsnprintf... yes checking for vasprintf... yes checking for open... yes checking for vsyslog... yes checking for strncasecmp... yes checking for setlocale... yes checking JSON extension name:... json checking how to print strings... print -r checking for a sed that does not truncate output... (cached) /bin/sed checking for fgrep... /bin/grep -F checking for ld used by i486-pld-linux-gcc... /usr/bin/ld checking if the linker (/usr/bin/ld) is GNU ld... yes checking for BSD- or MS-compatible name lister (nm)... /usr/bin/nm -B checking the name lister (/usr/bin/nm -B) interface... BSD nm checking whether ln -s works... yes checking the maximum length of command line arguments... 1572864 checking how to convert i486-pld-linux-gnu file names to i486-pld-linux-gnu format... func_convert_file_noop checking how to convert i486-pld-linux-gnu file names to toolchain format... func_convert_file_noop checking for /usr/bin/ld option to reload object files... -r checking for i486-pld-linux-objdump... no checking for objdump... objdump checking how to recognize dependent libraries... pass_all checking for i486-pld-linux-dlltool... no checking for dlltool... no checking how to associate runtime and link libraries... print -r -- checking for i486-pld-linux-ar... no checking for ar... ar checking for archiver @FILE support... @ checking for i486-pld-linux-strip... no checking for strip... strip checking for i486-pld-linux-ranlib... no checking for ranlib... ranlib checking for mawk... (cached) gawk checking command to parse /usr/bin/nm -B output from i486-pld-linux-gcc object... ok checking for sysroot... no checking for a working dd... /bin/dd checking how to truncate binary pipes... /bin/dd bs=4096 count=1 checking for i486-pld-linux-mt... no checking for mt... no checking if : is a manifest tool... no checking for dlfcn.h... yes checking for objdir... .libs checking if i486-pld-linux-gcc supports -fno-rtti -fno-exceptions... no checking for i486-pld-linux-gcc option to produce PIC... -fPIC -DPIC checking if i486-pld-linux-gcc PIC flag -fPIC -DPIC works... yes checking if i486-pld-linux-gcc static flag -static works... yes checking if i486-pld-linux-gcc supports -c -o file.o... yes checking if i486-pld-linux-gcc supports -c -o file.o... (cached) yes checking whether the i486-pld-linux-gcc linker (/usr/bin/ld) supports shared libraries... yes checking whether -lc should be explicitly linked in... no checking dynamic linker characteristics... GNU/Linux ld.so checking how to hardcode library paths into programs... immediate checking whether stripping libraries is possible... yes checking if libtool supports shared libraries... yes checking whether to build shared libraries... yes checking whether to build static libraries... no configure: creating ./config.status config.status: creating config.h config.status: executing libtool commands sed: can't read ./ltmain.sh: No such file or directory mv: cannot stat 'libtoolT': No such file or directory cp: cannot stat 'libtoolT': No such file or directory chmod: cannot access 'libtool': No such file or directory + /usr/bin/make -Otarget -j9 /bin/sh /tmp/B.d6b853e3-1df1-4161-9593-4b43c6dd2477/BUILD/php55-pecl-jsonc-1.3.6/libtool --mode=compile i486-pld-linux-gcc -I. -I/tmp/B.d6b853e3-1df1-4161-9593-4b43c6dd2477/BUILD/php55-pecl-jsonc-1.3.6 -DPHP_ATOM_INC -I/tmp/B.d6b853e3-1df1-4161-9593-4b43c6dd2477/BUILD/php55-pecl-jsonc-1.3.6/include -I/tmp/B.d6b853e3-1df1-4161-9593-4b43c6dd2477/BUILD/php55-pecl-jsonc-1.3.6/main -I/tmp/B.d6b853e3-1df1-4161-9593-4b43c6dd2477/BUILD/php55-pecl-jsonc-1.3.6 -I/usr/include/php -I/usr/include/php/main -I/usr/include/php/TSRM -I/usr/include/php/Zend -I/usr/include/php/ext -I/usr/include/php/ext/date/lib -DHAVE_CONFIG_H -O2 -fwrapv -pipe -Wformat -Werror=format-security -gdwarf-4 -fno-debug-types-section -fvar-tracking-assignments -g2 -Wp,-D_FORTIFY_SOURCE=2 -fstack-protector --param=ssp-buffer-size=4 -fomit-frame-pointer -march=i486 -fasynchronous-unwind-tables -gdwarf-4 -fno-debug-types-section -fvar-tracking-assignments -g2 -c /tmp/B.d6b853e3-1df1-4161-9593-4b43c6dd2477/BUILD/php55-pecl-jsonc-1.3.6/json.c -o json.lo /bin/sh: /tmp/B.d6b853e3-1df1-4161-9593-4b43c6dd2477/BUILD/php55-pecl-jsonc-1.3.6/libtool: No such file or directory Makefile:201: recipe for target 'json.lo' failed make: *** [json.lo] Error 127 make: *** Waiting for unfinished jobs.... /bin/sh /tmp/B.d6b853e3-1df1-4161-9593-4b43c6dd2477/BUILD/php55-pecl-jsonc-1.3.6/libtool --mode=compile i486-pld-linux-gcc -I. -I/tmp/B.d6b853e3-1df1-4161-9593-4b43c6dd2477/BUILD/php55-pecl-jsonc-1.3.6 -DPHP_ATOM_INC -I/tmp/B.d6b853e3-1df1-4161-9593-4b43c6dd2477/BUILD/php55-pecl-jsonc-1.3.6/include -I/tmp/B.d6b853e3-1df1-4161-9593-4b43c6dd2477/BUILD/php55-pecl-jsonc-1.3.6/main -I/tmp/B.d6b853e3-1df1-4161-9593-4b43c6dd2477/BUILD/php55-pecl-jsonc-1.3.6 -I/usr/include/php -I/usr/include/php/main -I/usr/include/php/TSRM -I/usr/include/php/Zend -I/usr/include/php/ext -I/usr/include/php/ext/date/lib -DHAVE_CONFIG_H -O2 -fwrapv -pipe -Wformat -Werror=format-security -gdwarf-4 -fno-debug-types-section -fvar-tracking-assignments -g2 -Wp,-D_FORTIFY_SOURCE=2 -fstack-protector --param=ssp-buffer-size=4 -fomit-frame-pointer -march=i486 -fasynchronous-unwind-tables -gdwarf-4 -fno-debug-types-section -fvar-tracking-assignments -g2 -c /tmp/B.d6b853e3-1df1-4161-9593-4b43c6dd2477/BUILD/php55-pecl-jsonc-1.3.6/json-c/arraylist.c -o json-c/arraylist.lo /bin/sh: /tmp/B.d6b853e3-1df1-4161-9593-4b43c6dd2477/BUILD/php55-pecl-jsonc-1.3.6/libtool: No such file or directory Makefile:203: recipe for target 'json-c/arraylist.lo' failed make: *** [json-c/arraylist.lo] Error 127 /bin/sh /tmp/B.d6b853e3-1df1-4161-9593-4b43c6dd2477/BUILD/php55-pecl-jsonc-1.3.6/libtool --mode=compile i486-pld-linux-gcc -I. -I/tmp/B.d6b853e3-1df1-4161-9593-4b43c6dd2477/BUILD/php55-pecl-jsonc-1.3.6 -DPHP_ATOM_INC -I/tmp/B.d6b853e3-1df1-4161-9593-4b43c6dd2477/BUILD/php55-pecl-jsonc-1.3.6/include -I/tmp/B.d6b853e3-1df1-4161-9593-4b43c6dd2477/BUILD/php55-pecl-jsonc-1.3.6/main -I/tmp/B.d6b853e3-1df1-4161-9593-4b43c6dd2477/BUILD/php55-pecl-jsonc-1.3.6 -I/usr/include/php -I/usr/include/php/main -I/usr/include/php/TSRM -I/usr/include/php/Zend -I/usr/include/php/ext -I/usr/include/php/ext/date/lib -DHAVE_CONFIG_H -O2 -fwrapv -pipe -Wformat -Werror=format-security -gdwarf-4 -fno-debug-types-section -fvar-tracking-assignments -g2 -Wp,-D_FORTIFY_SOURCE=2 -fstack-protector --param=ssp-buffer-size=4 -fomit-frame-pointer -march=i486 -fasynchronous-unwind-tables -gdwarf-4 -fno-debug-types-section -fvar-tracking-assignments -g2 -c /tmp/B.d6b853e3-1df1-4161-9593-4b43c6dd2477/BUILD/php55-pecl-jsonc-1.3.6/json-c/debug.c -o json-c/debug.lo /bin/sh: /tmp/B.d6b853e3-1df1-4161-9593-4b43c6dd2477/BUILD/php55-pecl-jsonc-1.3.6/libtool: No such file or directory Makefile:205: recipe for target 'json-c/debug.lo' failed make: *** [json-c/debug.lo] Error 127 error: Bad exit status from /tmp/B.d6b853e3-1df1-4161-9593-4b43c6dd2477/BUILD/tmp/rpm-tmp.45097 (%build) RPM build errors: Bad exit status from /tmp/B.d6b853e3-1df1-4161-9593-4b43c6dd2477/BUILD/tmp/rpm-tmp.45097 (%build) ended at: Tue Feb 10 14:37:40 2015, done in 0:00:06.274302 error: No files produced. + chmod -R u+rwX /tmp/B.d6b853e3-1df1-4161-9593-4b43c6dd2477/BUILD + rm -rf /tmp/B.d6b853e3-1df1-4161-9593-4b43c6dd2477/tmp /tmp/B.d6b853e3-1df1-4161-9593-4b43c6dd2477/BUILD + rm -rf /tmp/B.d6b853e3-1df1-4161-9593-4b43c6dd2477 Begin-PLD-Builder-Info Build-Time: user:12.52s sys:1.84s real:18.47s (faults io:0 non-io:1181199) End-PLD-Builder-Info
[Back to list of logs] [View rpm -qa of builder]