FailedOk

th/SRPMS[OK]
th/x32[OK]
th/i686[OK]
th/x86_64[OK]

ac/SRPMS[OK]
ac/i386[OK]
ac/i586[OK]
ac/i686[OK]
ac/alpha[OK]
ac/amd64[OK]
ac/athlon[OK]
ac/ppc[OK]
ac/sparc[OK]
ac/sparc64[OK]

Advanced Search
main()
Powered by PLD Linux
(c) 2002-2024 PLD Team
$Revision: 1.37 $
Powered by Joe.
Your IP: 3.239.76.25

ptsminer bd10c692-7224-4769-b035-15fbf7097fe7

Status:Failed
Source URL:https://buildlogs.pld-linux.org/pld/th/i486/FAIL/ptsminer,bd10c692-7224-4769-b035-15fbf7097fe7.bz2
text/plain URL:View!
full text:View!
rpm -qa of builder:View!
Date:2015/02/16 08:50:30
Runtime:0:00:08.514651

Toc:

  • error 1
  • main_poolminer.cpp:246:3: error: 'scoped_ptr' is not a member of 'boost'
  • error 2
  • main_poolminer.cpp:246:49: error: expected primary-expression before '>' token
  • error 3
  • main_poolminer.cpp:251:11: error: request for member 'reset' in 'socket', which is of non-class type 'int(int, int, int) throw ()'
  • error 4
  • main_poolminer.cpp:253:12: error: request for member 'connect' in 'socket', which is of non-class type 'int(int, int, int) throw ()'
  • error 5
  • main_poolminer.cpp:256:11: error: request for member 'set_option' in 'socket', which is of non-class type 'int(int, int, int) throw ()'
  • error 6
  • main_poolminer.cpp:257:11: error: request for member 'set_option' in 'socket', which is of non-class type 'int(int, int, int) throw ()'
  • error 7
  • main_poolminer.cpp:286:12: error: request for member 'write_some' in 'socket', which is of non-class type 'int(int, int, int) throw ()'
  • error 8
  • main_poolminer.cpp:292:29: error: request for member 'get' in 'socket', which is of non-class type 'int(int, int, int) throw ()'
  • error 9
  • main_poolminer.cpp:360:16: error: request for member 'close' in 'socket', which is of non-class type 'int(int, int, int) throw ()'
  • error 10
  • makefile.unix:130: recipe for target 'obj/main_poolminer.o' failed
  • error 11
  • error: Bad exit status from /tmp/B.c9ce44b2-893d-433a-9648-d39094785ee6/BUILD/tmp/rpm-tmp.75811 (%build)
  • error 12
  • RPM build errors:
  • error 13
  • error: No files produced.

Content:

+ cd /tmp/B.c9ce44b2-893d-433a-9648-d39094785ee6/BUILD
+ rm -rf ptsminer
+ /usr/bin/bzip2 -dc /tmp/B.c9ce44b2-893d-433a-9648-d39094785ee6/ptsminer-20131203.tar.bz2
+ /bin/tar -xf -
+ STATUS=0 
+ '[' 0 -ne 0 ']'
+ cd ptsminer
+ /bin/id -u
+ '[' 2001 '=' 0 ']'
+ /bin/id -u
+ '[' 2001 '=' 0 ']'
+ /bin/chmod -Rf a+rX,u+w,g-w,o-w .
+ exit 0
Executing(%build): /bin/sh -e /tmp/B.c9ce44b2-893d-433a-9648-d39094785ee6/BUILD/tmp/rpm-tmp.75811
TMP=/home/users/builder/tmp
HOME=/home/users/builder
PATH=/home/users/builder/GNUstep/Tools:/usr/local/bin:/usr/bin:/bin:/home/users/builder/bin
TMPDIR=/tmp/B.c9ce44b2-893d-433a-9648-d39094785ee6/BUILD/tmp
+ umask 022
+ cd /tmp/B.c9ce44b2-893d-433a-9648-d39094785ee6/BUILD
+ cd ptsminer
+ /usr/bin/make -Otarget -j9 -C src -f makefile.unix
make: Entering directory '/tmp/B.c9ce44b2-893d-433a-9648-d39094785ee6/BUILD/ptsminer/src'
g++ -c -O2  -fpermissive -o obj/cpuid.o cpuid.c
make: Leaving directory '/tmp/B.c9ce44b2-893d-433a-9648-d39094785ee6/BUILD/ptsminer/src'
make: Entering directory '/tmp/B.c9ce44b2-893d-433a-9648-d39094785ee6/BUILD/ptsminer/src'
yasm -f elf32 -o obj/sha512_sse4.o intel/sha512_sse4.asm
make: Leaving directory '/tmp/B.c9ce44b2-893d-433a-9648-d39094785ee6/BUILD/ptsminer/src'
make: Entering directory '/tmp/B.c9ce44b2-893d-433a-9648-d39094785ee6/BUILD/ptsminer/src'
yasm -f elf32 -o obj/sha512_avx.o intel/sha512_avx.asm
make: Leaving directory '/tmp/B.c9ce44b2-893d-433a-9648-d39094785ee6/BUILD/ptsminer/src'
make: Entering directory '/tmp/B.c9ce44b2-893d-433a-9648-d39094785ee6/BUILD/ptsminer/src'
g++ -c -O2  -fpermissive -o obj/sha512.o sha512.c
make: Leaving directory '/tmp/B.c9ce44b2-893d-433a-9648-d39094785ee6/BUILD/ptsminer/src'
make: Entering directory '/tmp/B.c9ce44b2-893d-433a-9648-d39094785ee6/BUILD/ptsminer/src'
g++ -c -O1  -fpermissive -o obj/sph_sha2big.o sph_sha2big.c
sph_sha2big.c: In function 'void sph_sha384_init(void*)':
sph_sha2big.c:191:5: warning: invalid conversion from 'void*' to 'sph_sha384_context*' [-fpermissive]
  sc = cc;
     ^
sph_sha2big.c: In function 'void sph_sha512_init(void*)':
sph_sha2big.c:202:5: warning: invalid conversion from 'void*' to 'sph_sha512_context* {aka sph_sha384_context*}' [-fpermissive]
  sc = cc;
     ^
In file included from sph_sha2big.c:210:0:
sph_md_helper.c: In function 'void sha384_short(void*, const void*, size_t)':
sph_md_helper.c:136:5: warning: invalid conversion from 'void*' to 'sph_sha384_context*' [-fpermissive]
  sc = cc;
     ^
sph_md_helper.c: In function 'void sph_sha384(void*, const void*, size_t)':
sph_md_helper.c:186:5: warning: invalid conversion from 'void*' to 'sph_sha384_context*' [-fpermissive]
  sc = cc;
     ^
sph_md_helper.c:208:21: warning: invalid conversion from 'const void*' to 'const unsigned char*' [-fpermissive]
   RFUN(data, SPH_VAL);
                     ^
sph_sha2big.c:178:1: note: initializing argument 1 of 'void sha3_round(const unsigned char*, sph_u64*)'
 sha3_round(const unsigned char *data, sph_u64 r[8])
 ^
In file included from sph_sha2big.c:210:0:
sph_md_helper.c: In function 'void sha384_addbits_and_close(void*, unsigned int, unsigned int, void*, unsigned int)':
sph_md_helper.c:250:5: warning: invalid conversion from 'void*' to 'sph_sha384_context*' [-fpermissive]
  sc = cc;
     ^
make: Leaving directory '/tmp/B.c9ce44b2-893d-433a-9648-d39094785ee6/BUILD/ptsminer/src'
make: Entering directory '/tmp/B.c9ce44b2-893d-433a-9648-d39094785ee6/BUILD/ptsminer/src'
g++ -c -O1  -fpermissive -o obj/sph_sha2.o sph_sha2.c
sph_sha2.c: In function 'void sph_sha224_init(void*)':
sph_sha2.c:628:5: warning: invalid conversion from 'void*' to 'sph_sha224_context*' [-fpermissive]
  sc = cc;
     ^
sph_sha2.c: In function 'void sph_sha256_init(void*)':
sph_sha2.c:643:5: warning: invalid conversion from 'void*' to 'sph_sha256_context* {aka sph_sha224_context*}' [-fpermissive]
  sc = cc;
     ^
In file included from sph_sha2.c:655:0:
sph_md_helper.c: In function 'void sha224_short(void*, const void*, size_t)':
sph_md_helper.c:136:5: warning: invalid conversion from 'void*' to 'sph_sha224_context*' [-fpermissive]
  sc = cc;
     ^
sph_md_helper.c: In function 'void sph_sha224(void*, const void*, size_t)':
sph_md_helper.c:186:5: warning: invalid conversion from 'void*' to 'sph_sha224_context*' [-fpermissive]
  sc = cc;
     ^
sph_md_helper.c:208:21: warning: invalid conversion from 'const void*' to 'const unsigned char*' [-fpermissive]
   RFUN(data, SPH_VAL);
                     ^
sph_sha2.c:615:1: note: initializing argument 1 of 'void sha2_round(const unsigned char*, sph_u32*)'
 sha2_round(const unsigned char *data, sph_u32 r[8])
 ^
In file included from sph_sha2.c:655:0:
sph_md_helper.c: In function 'void sha224_addbits_and_close(void*, unsigned int, unsigned int, void*, unsigned int)':
sph_md_helper.c:250:5: warning: invalid conversion from 'void*' to 'sph_sha224_context*' [-fpermissive]
  sc = cc;
     ^
make: Leaving directory '/tmp/B.c9ce44b2-893d-433a-9648-d39094785ee6/BUILD/ptsminer/src'
make: Entering directory '/tmp/B.c9ce44b2-893d-433a-9648-d39094785ee6/BUILD/ptsminer/src'
g++ -c -O2  -pthread -DBOOST_SPIRIT_THREADSAFE -D_FILE_OFFSET_BITS=64 -I/tmp/B.c9ce44b2-893d-433a-9648-d39094785ee6/BUILD/ptsminer/src -I/tmp/B.c9ce44b2-893d-433a-9648-d39094785ee6/BUILD/ptsminer/src/obj -fno-stack-protector -fstack-protector-all -Wstack-protector -D_FORTIFY_SOURCE=2  -o obj/main_poolminer.o main_poolminer.cpp
main_poolminer.cpp: In member function 'void CMasterThread::run()':
main_poolminer.cpp:246:3: error: 'scoped_ptr' is not a member of 'boost'
   boost::scoped_ptr<boost::asio::ip::tcp::socket> socket;
   ^
main_poolminer.cpp:246:3: note: suggested alternative:
In file included from /usr/include/boost/asio/impl/io_service.ipp:21:0,
                 from /usr/include/boost/asio/io_service.hpp:769,
                 from /usr/include/boost/asio/basic_io_object.hpp:19,
                 from /usr/include/boost/asio/basic_socket.hpp:20,
                 from /usr/include/boost/asio/basic_datagram_socket.hpp:20,
                 from /usr/include/boost/asio.hpp:21,
                 from main_poolminer.hpp:7,
                 from main_poolminer.cpp:13:
/usr/include/boost/asio/detail/scoped_ptr.hpp:27:7: note:   'boost::asio::detail::scoped_ptr'
 class scoped_ptr
       ^
main_poolminer.cpp:246:49: error: expected primary-expression before '>' token
   boost::scoped_ptr<boost::asio::ip::tcp::socket> socket;
                                                 ^
main_poolminer.cpp:251:11: error: request for member 'reset' in 'socket', which is of non-class type 'int(int, int, int) throw ()'
    socket.reset(new boost::asio::ip::tcp::socket(io_service));
           ^
main_poolminer.cpp:253:12: error: request for member 'connect' in 'socket', which is of non-class type 'int(int, int, int) throw ()'
    socket->connect(tcp_ep, error_socket);
            ^
main_poolminer.cpp:256:11: error: request for member 'set_option' in 'socket', which is of non-class type 'int(int, int, int) throw ()'
   socket->set_option(nd_option);
           ^
main_poolminer.cpp:257:11: error: request for member 'set_option' in 'socket', which is of non-class type 'int(int, int, int) throw ()'
   socket->set_option(ka_option);
           ^
main_poolminer.cpp:286:12: error: request for member 'write_some' in 'socket', which is of non-class type 'int(int, int, int) throw ()'
    socket->write_some(boost::asio::buffer(hello, pool_username.length()+2+20+1+pool_password.length()), error);
            ^
main_poolminer.cpp:292:29: error: request for member 'get' in 'socket', which is of non-class type 'int(int, int, int) throw ()'
   socket_to_server = socket.get(); //TODO: lock/mutex
                             ^
main_poolminer.cpp:360:16: error: request for member 'close' in 'socket', which is of non-class type 'int(int, int, int) throw ()'
        socket->close();
                ^
makefile.unix:130: recipe for target 'obj/main_poolminer.o' failed
make: *** [obj/main_poolminer.o] Error 1
make: Leaving directory '/tmp/B.c9ce44b2-893d-433a-9648-d39094785ee6/BUILD/ptsminer/src'
error: Bad exit status from /tmp/B.c9ce44b2-893d-433a-9648-d39094785ee6/BUILD/tmp/rpm-tmp.75811 (%build)


RPM build errors:
    Bad exit status from /tmp/B.c9ce44b2-893d-433a-9648-d39094785ee6/BUILD/tmp/rpm-tmp.75811 (%build)
ended at: Mon Feb 16 08:50:30 2015, done in 0:00:08.514651
error: No files produced.
+ chmod -R u+rwX /tmp/B.c9ce44b2-893d-433a-9648-d39094785ee6/BUILD
+ rm -rf /tmp/B.c9ce44b2-893d-433a-9648-d39094785ee6/tmp /tmp/B.c9ce44b2-893d-433a-9648-d39094785ee6/BUILD
+ rm -rf /tmp/B.c9ce44b2-893d-433a-9648-d39094785ee6
Begin-PLD-Builder-Info
Build-Time: user:8.10s sys:0.63s real:14.12s (faults io:65 non-io:300744)

End-PLD-Builder-Info
[Back to list of logs] [View rpm -qa of builder]