FailedOk

th/SRPMS[OK]
th/x32[OK]
th/i686[OK]
th/x86_64[OK]

ac/SRPMS[OK]
ac/i386[OK]
ac/i586[OK]
ac/i686[OK]
ac/alpha[OK]
ac/amd64[OK]
ac/athlon[OK]
ac/ppc[OK]
ac/sparc[OK]
ac/sparc64[OK]

Advanced Search
main()
Powered by PLD Linux
(c) 2002-2024 PLD Team
$Revision: 1.37 $
Powered by foobar.
Your IP: 44.220.44.148

rstudio e09084c3-57ad-411f-9db2-340991726946

Status:Failed
Source URL:https://buildlogs.pld-linux.org/pld/th/i486/FAIL/rstudio,e09084c3-57ad-411f-9db2-340991726946.bz2
text/plain URL:View!
full text:View!
rpm -qa of builder:View!
Date:2015/02/18 01:09:57
Runtime:0:15:37.987304

Toc:

  • error 1
  • src/cpp/desktop/CMakeFiles/rstudio.dir/build.make:141: recipe for target 'src/cpp/desktop/moc_DesktopNetworkReply.cxx' failed
  • error 2
  • make[2]: *** [src/cpp/desktop/moc_DesktopNetworkReply.cxx] Error 1
  • error 3
  • CMakeFiles/Makefile2:533: recipe for target 'src/cpp/desktop/CMakeFiles/rstudio.dir/all' failed
  • error 4
  • make[1]: *** [src/cpp/desktop/CMakeFiles/rstudio.dir/all] Error 2
  • error 5
  • Makefile:140: recipe for target 'all' failed
  • error 6
  • error: Bad exit status from /tmp/B.f12ff3bb-6888-43c1-bd5e-f512ada18a27/BUILD/tmp/rpm-tmp.38317 (%build)
  • error 7
  • RPM build errors:
  • error 8
  • error: No files produced.

Content:

/usr/bin/cmake -E cmake_progress_report /tmp/B.f12ff3bb-6888-43c1-bd5e-f512ada18a27/BUILD/rstudio-0.99.39/build/CMakeFiles 
[ 33%] Generating ui_DesktopInputDialog.h
cd /tmp/B.f12ff3bb-6888-43c1-bd5e-f512ada18a27/BUILD/rstudio-0.99.39/build/src/cpp/desktop && /usr/lib/qt4/bin/uic -o /tmp/B.f12ff3bb-6888-43c1-bd5e-f512ada18a27/BUILD/rstudio-0.99.39/build/src/cpp/desktop/ui_DesktopInputDialog.h /tmp/B.f12ff3bb-6888-43c1-bd5e-f512ada18a27/BUILD/rstudio-0.99.39/src/cpp/desktop/DesktopInputDialog.ui
make[2]: Leaving directory '/tmp/B.f12ff3bb-6888-43c1-bd5e-f512ada18a27/BUILD/rstudio-0.99.39/build'
make[2]: Entering directory '/tmp/B.f12ff3bb-6888-43c1-bd5e-f512ada18a27/BUILD/rstudio-0.99.39/build'
cd /tmp/B.f12ff3bb-6888-43c1-bd5e-f512ada18a27/BUILD/rstudio-0.99.39/build && /usr/bin/cmake -E cmake_depends "Unix Makefiles" /tmp/B.f12ff3bb-6888-43c1-bd5e-f512ada18a27/BUILD/rstudio-0.99.39 /tmp/B.f12ff3bb-6888-43c1-bd5e-f512ada18a27/BUILD/rstudio-0.99.39/src/cpp/monitor /tmp/B.f12ff3bb-6888-43c1-bd5e-f512ada18a27/BUILD/rstudio-0.99.39/build /tmp/B.f12ff3bb-6888-43c1-bd5e-f512ada18a27/BUILD/rstudio-0.99.39/build/src/cpp/monitor /tmp/B.f12ff3bb-6888-43c1-bd5e-f512ada18a27/BUILD/rstudio-0.99.39/build/src/cpp/monitor/CMakeFiles/rstudio-monitor.dir/DependInfo.cmake --color=
Scanning dependencies of target rstudio-monitor
make[2]: Leaving directory '/tmp/B.f12ff3bb-6888-43c1-bd5e-f512ada18a27/BUILD/rstudio-0.99.39/build'
/usr/bin/make -f src/cpp/monitor/CMakeFiles/rstudio-monitor.dir/build.make src/cpp/monitor/CMakeFiles/rstudio-monitor.dir/build
make[2]: Entering directory '/tmp/B.f12ff3bb-6888-43c1-bd5e-f512ada18a27/BUILD/rstudio-0.99.39/build'
cd /tmp/B.f12ff3bb-6888-43c1-bd5e-f512ada18a27/BUILD/rstudio-0.99.39/build && /usr/bin/cmake -E cmake_depends "Unix Makefiles" /tmp/B.f12ff3bb-6888-43c1-bd5e-f512ada18a27/BUILD/rstudio-0.99.39 /tmp/B.f12ff3bb-6888-43c1-bd5e-f512ada18a27/BUILD/rstudio-0.99.39/src/cpp/session/postback /tmp/B.f12ff3bb-6888-43c1-bd5e-f512ada18a27/BUILD/rstudio-0.99.39/build /tmp/B.f12ff3bb-6888-43c1-bd5e-f512ada18a27/BUILD/rstudio-0.99.39/build/src/cpp/session/postback /tmp/B.f12ff3bb-6888-43c1-bd5e-f512ada18a27/BUILD/rstudio-0.99.39/build/src/cpp/session/postback/CMakeFiles/rpostback.dir/DependInfo.cmake --color=
Scanning dependencies of target rpostback
make[2]: Leaving directory '/tmp/B.f12ff3bb-6888-43c1-bd5e-f512ada18a27/BUILD/rstudio-0.99.39/build'
/usr/bin/make -f src/cpp/session/postback/CMakeFiles/rpostback.dir/build.make src/cpp/session/postback/CMakeFiles/rpostback.dir/build
make[2]: Entering directory '/tmp/B.f12ff3bb-6888-43c1-bd5e-f512ada18a27/BUILD/rstudio-0.99.39/build'
cd /tmp/B.f12ff3bb-6888-43c1-bd5e-f512ada18a27/BUILD/rstudio-0.99.39/build && /usr/bin/cmake -E cmake_depends "Unix Makefiles" /tmp/B.f12ff3bb-6888-43c1-bd5e-f512ada18a27/BUILD/rstudio-0.99.39 /tmp/B.f12ff3bb-6888-43c1-bd5e-f512ada18a27/BUILD/rstudio-0.99.39/src/cpp/r /tmp/B.f12ff3bb-6888-43c1-bd5e-f512ada18a27/BUILD/rstudio-0.99.39/build /tmp/B.f12ff3bb-6888-43c1-bd5e-f512ada18a27/BUILD/rstudio-0.99.39/build/src/cpp/r /tmp/B.f12ff3bb-6888-43c1-bd5e-f512ada18a27/BUILD/rstudio-0.99.39/build/src/cpp/r/CMakeFiles/rstudio-r.dir/DependInfo.cmake --color=
Scanning dependencies of target rstudio-r
make[2]: Leaving directory '/tmp/B.f12ff3bb-6888-43c1-bd5e-f512ada18a27/BUILD/rstudio-0.99.39/build'
/usr/bin/make -f src/cpp/r/CMakeFiles/rstudio-r.dir/build.make src/cpp/r/CMakeFiles/rstudio-r.dir/build
make[2]: Entering directory '/tmp/B.f12ff3bb-6888-43c1-bd5e-f512ada18a27/BUILD/rstudio-0.99.39/build'
/usr/bin/cmake -E cmake_progress_report /tmp/B.f12ff3bb-6888-43c1-bd5e-f512ada18a27/BUILD/rstudio-0.99.39/build/CMakeFiles 
[ 34%] Generating 3rdparty/qtsingleapplication/moc_qtsingleapplication.cxx
cd /tmp/B.f12ff3bb-6888-43c1-bd5e-f512ada18a27/BUILD/rstudio-0.99.39/build/src/cpp/desktop/3rdparty/qtsingleapplication && /usr/lib/qt4/bin/moc @/tmp/B.f12ff3bb-6888-43c1-bd5e-f512ada18a27/BUILD/rstudio-0.99.39/build/src/cpp/desktop/3rdparty/qtsingleapplication/moc_qtsingleapplication.cxx_parameters
make[2]: Leaving directory '/tmp/B.f12ff3bb-6888-43c1-bd5e-f512ada18a27/BUILD/rstudio-0.99.39/build'
make[2]: Entering directory '/tmp/B.f12ff3bb-6888-43c1-bd5e-f512ada18a27/BUILD/rstudio-0.99.39/build'
/usr/bin/cmake -E cmake_progress_report /tmp/B.f12ff3bb-6888-43c1-bd5e-f512ada18a27/BUILD/rstudio-0.99.39/build/CMakeFiles 30
[ 34%] Generating 3rdparty/qtsingleapplication/moc_qtlocalpeer.cxx
cd /tmp/B.f12ff3bb-6888-43c1-bd5e-f512ada18a27/BUILD/rstudio-0.99.39/build/src/cpp/desktop/3rdparty/qtsingleapplication && /usr/lib/qt4/bin/moc @/tmp/B.f12ff3bb-6888-43c1-bd5e-f512ada18a27/BUILD/rstudio-0.99.39/build/src/cpp/desktop/3rdparty/qtsingleapplication/moc_qtlocalpeer.cxx_parameters
make[2]: Leaving directory '/tmp/B.f12ff3bb-6888-43c1-bd5e-f512ada18a27/BUILD/rstudio-0.99.39/build'
make[2]: Entering directory '/tmp/B.f12ff3bb-6888-43c1-bd5e-f512ada18a27/BUILD/rstudio-0.99.39/build'
/usr/bin/cmake -E cmake_progress_report /tmp/B.f12ff3bb-6888-43c1-bd5e-f512ada18a27/BUILD/rstudio-0.99.39/build/CMakeFiles 
[ 35%] Generating moc_DesktopAboutDialog.cxx
cd /tmp/B.f12ff3bb-6888-43c1-bd5e-f512ada18a27/BUILD/rstudio-0.99.39/build/src/cpp/desktop && /usr/lib/qt4/bin/moc @/tmp/B.f12ff3bb-6888-43c1-bd5e-f512ada18a27/BUILD/rstudio-0.99.39/build/src/cpp/desktop/moc_DesktopAboutDialog.cxx_parameters
make[2]: Leaving directory '/tmp/B.f12ff3bb-6888-43c1-bd5e-f512ada18a27/BUILD/rstudio-0.99.39/build'
make[2]: Entering directory '/tmp/B.f12ff3bb-6888-43c1-bd5e-f512ada18a27/BUILD/rstudio-0.99.39/build'
/usr/bin/cmake -E cmake_progress_report /tmp/B.f12ff3bb-6888-43c1-bd5e-f512ada18a27/BUILD/rstudio-0.99.39/build/CMakeFiles 31
[ 37%] Generating moc_DesktopApplicationLaunch.cxx
cd /tmp/B.f12ff3bb-6888-43c1-bd5e-f512ada18a27/BUILD/rstudio-0.99.39/build/src/cpp/desktop && /usr/lib/qt4/bin/moc @/tmp/B.f12ff3bb-6888-43c1-bd5e-f512ada18a27/BUILD/rstudio-0.99.39/build/src/cpp/desktop/moc_DesktopApplicationLaunch.cxx_parameters
make[2]: Leaving directory '/tmp/B.f12ff3bb-6888-43c1-bd5e-f512ada18a27/BUILD/rstudio-0.99.39/build'
make[2]: Entering directory '/tmp/B.f12ff3bb-6888-43c1-bd5e-f512ada18a27/BUILD/rstudio-0.99.39/build'
/usr/bin/cmake -E cmake_progress_report /tmp/B.f12ff3bb-6888-43c1-bd5e-f512ada18a27/BUILD/rstudio-0.99.39/build/CMakeFiles 
[ 37%] Generating moc_DesktopCommandInvoker.cxx
cd /tmp/B.f12ff3bb-6888-43c1-bd5e-f512ada18a27/BUILD/rstudio-0.99.39/build/src/cpp/desktop && /usr/lib/qt4/bin/moc @/tmp/B.f12ff3bb-6888-43c1-bd5e-f512ada18a27/BUILD/rstudio-0.99.39/build/src/cpp/desktop/moc_DesktopCommandInvoker.cxx_parameters
make[2]: Leaving directory '/tmp/B.f12ff3bb-6888-43c1-bd5e-f512ada18a27/BUILD/rstudio-0.99.39/build'
make[2]: Entering directory '/tmp/B.f12ff3bb-6888-43c1-bd5e-f512ada18a27/BUILD/rstudio-0.99.39/build'
/usr/bin/cmake -E cmake_progress_report /tmp/B.f12ff3bb-6888-43c1-bd5e-f512ada18a27/BUILD/rstudio-0.99.39/build/CMakeFiles 
[ 37%] Generating moc_DesktopDataUriNetworkReply.cxx
cd /tmp/B.f12ff3bb-6888-43c1-bd5e-f512ada18a27/BUILD/rstudio-0.99.39/build/src/cpp/desktop && /usr/lib/qt4/bin/moc @/tmp/B.f12ff3bb-6888-43c1-bd5e-f512ada18a27/BUILD/rstudio-0.99.39/build/src/cpp/desktop/moc_DesktopDataUriNetworkReply.cxx_parameters
make[2]: Leaving directory '/tmp/B.f12ff3bb-6888-43c1-bd5e-f512ada18a27/BUILD/rstudio-0.99.39/build'
make[2]: Entering directory '/tmp/B.f12ff3bb-6888-43c1-bd5e-f512ada18a27/BUILD/rstudio-0.99.39/build'
/usr/bin/cmake -E cmake_progress_report /tmp/B.f12ff3bb-6888-43c1-bd5e-f512ada18a27/BUILD/rstudio-0.99.39/build/CMakeFiles 32
[ 38%] Generating moc_DesktopDownloadHelper.cxx
cd /tmp/B.f12ff3bb-6888-43c1-bd5e-f512ada18a27/BUILD/rstudio-0.99.39/build/src/cpp/desktop && /usr/lib/qt4/bin/moc @/tmp/B.f12ff3bb-6888-43c1-bd5e-f512ada18a27/BUILD/rstudio-0.99.39/build/src/cpp/desktop/moc_DesktopDownloadHelper.cxx_parameters
make[2]: Leaving directory '/tmp/B.f12ff3bb-6888-43c1-bd5e-f512ada18a27/BUILD/rstudio-0.99.39/build'
make[2]: Entering directory '/tmp/B.f12ff3bb-6888-43c1-bd5e-f512ada18a27/BUILD/rstudio-0.99.39/build'
/usr/bin/cmake -E cmake_progress_report /tmp/B.f12ff3bb-6888-43c1-bd5e-f512ada18a27/BUILD/rstudio-0.99.39/build/CMakeFiles 
[ 37%] Building CXX object src/cpp/r/CMakeFiles/rstudio-r.dir/RErrorCategory.cpp.o
cd /tmp/B.f12ff3bb-6888-43c1-bd5e-f512ada18a27/BUILD/rstudio-0.99.39/build/src/cpp/r && /usr/bin/i486-pld-linux-g++   -DBOOST_ASIO_DISABLE_KQUEUE -DBOOST_ENABLE_ASSERT_HANDLER -D_FORTIFY_SOURCE=2 -O2 -fwrapv -pipe -Wformat -Werror=format-security -gdwarf-4 -fno-debug-types-section -fvar-tracking-assignments -g2 -Wp,-D_FORTIFY_SOURCE=2 -fstack-protector --param=ssp-buffer-size=4 -fomit-frame-pointer -march=i486 -fasynchronous-unwind-tables -gdwarf-4 -fno-debug-types-section -fvar-tracking-assignments -g2  -DNDEBUG -DQT_NO_DEBUG -I/tmp/B.f12ff3bb-6888-43c1-bd5e-f512ada18a27/BUILD/rstudio-0.99.39/src/cpp/r/include -I/tmp/B.f12ff3bb-6888-43c1-bd5e-f512ada18a27/BUILD/rstudio-0.99.39/build/src/cpp/r -I/tmp/B.f12ff3bb-6888-43c1-bd5e-f512ada18a27/BUILD/rstudio-0.99.39/src/cpp/core/include -I/usr/lib/R/include    -Wall -pthread -Wformat -Wformat-security -fstack-protector --param ssp-buffer-size=4 -pie -fPIE -o CMakeFiles/rstudio-r.dir/RErrorCategory.cpp.o -c /tmp/B.f12ff3bb-6888-43c1-bd5e-f512ada18a27/BUILD/rstudio-0.99.39/src/cpp/r/RErrorCategory.cpp
make[2]: Leaving directory '/tmp/B.f12ff3bb-6888-43c1-bd5e-f512ada18a27/BUILD/rstudio-0.99.39/build'
make[2]: Entering directory '/tmp/B.f12ff3bb-6888-43c1-bd5e-f512ada18a27/BUILD/rstudio-0.99.39/build'
/usr/bin/cmake -E cmake_progress_report /tmp/B.f12ff3bb-6888-43c1-bd5e-f512ada18a27/BUILD/rstudio-0.99.39/build/CMakeFiles 
[ 38%] Generating moc_DesktopGwtCallback.cxx
cd /tmp/B.f12ff3bb-6888-43c1-bd5e-f512ada18a27/BUILD/rstudio-0.99.39/build/src/cpp/desktop && /usr/lib/qt4/bin/moc @/tmp/B.f12ff3bb-6888-43c1-bd5e-f512ada18a27/BUILD/rstudio-0.99.39/build/src/cpp/desktop/moc_DesktopGwtCallback.cxx_parameters
make[2]: Leaving directory '/tmp/B.f12ff3bb-6888-43c1-bd5e-f512ada18a27/BUILD/rstudio-0.99.39/build'
make[2]: Entering directory '/tmp/B.f12ff3bb-6888-43c1-bd5e-f512ada18a27/BUILD/rstudio-0.99.39/build'
/usr/bin/cmake -E cmake_progress_report /tmp/B.f12ff3bb-6888-43c1-bd5e-f512ada18a27/BUILD/rstudio-0.99.39/build/CMakeFiles 
[ 38%] Generating moc_DesktopInputDialog.cxx
cd /tmp/B.f12ff3bb-6888-43c1-bd5e-f512ada18a27/BUILD/rstudio-0.99.39/build/src/cpp/desktop && /usr/lib/qt4/bin/moc @/tmp/B.f12ff3bb-6888-43c1-bd5e-f512ada18a27/BUILD/rstudio-0.99.39/build/src/cpp/desktop/moc_DesktopInputDialog.cxx_parameters
make[2]: Leaving directory '/tmp/B.f12ff3bb-6888-43c1-bd5e-f512ada18a27/BUILD/rstudio-0.99.39/build'
make[2]: Entering directory '/tmp/B.f12ff3bb-6888-43c1-bd5e-f512ada18a27/BUILD/rstudio-0.99.39/build'
/usr/bin/cmake -E cmake_progress_report /tmp/B.f12ff3bb-6888-43c1-bd5e-f512ada18a27/BUILD/rstudio-0.99.39/build/CMakeFiles 
[ 38%] Generating moc_DesktopGwtWindow.cxx
cd /tmp/B.f12ff3bb-6888-43c1-bd5e-f512ada18a27/BUILD/rstudio-0.99.39/build/src/cpp/desktop && /usr/lib/qt4/bin/moc @/tmp/B.f12ff3bb-6888-43c1-bd5e-f512ada18a27/BUILD/rstudio-0.99.39/build/src/cpp/desktop/moc_DesktopGwtWindow.cxx_parameters
make[2]: Leaving directory '/tmp/B.f12ff3bb-6888-43c1-bd5e-f512ada18a27/BUILD/rstudio-0.99.39/build'
make[2]: Entering directory '/tmp/B.f12ff3bb-6888-43c1-bd5e-f512ada18a27/BUILD/rstudio-0.99.39/build'
/usr/bin/cmake -E cmake_progress_report /tmp/B.f12ff3bb-6888-43c1-bd5e-f512ada18a27/BUILD/rstudio-0.99.39/build/CMakeFiles 
[ 37%] Generating moc_DesktopBrowserWindow.cxx
cd /tmp/B.f12ff3bb-6888-43c1-bd5e-f512ada18a27/BUILD/rstudio-0.99.39/build/src/cpp/desktop && /usr/lib/qt4/bin/moc @/tmp/B.f12ff3bb-6888-43c1-bd5e-f512ada18a27/BUILD/rstudio-0.99.39/build/src/cpp/desktop/moc_DesktopBrowserWindow.cxx_parameters
make[2]: Leaving directory '/tmp/B.f12ff3bb-6888-43c1-bd5e-f512ada18a27/BUILD/rstudio-0.99.39/build'
make[2]: Entering directory '/tmp/B.f12ff3bb-6888-43c1-bd5e-f512ada18a27/BUILD/rstudio-0.99.39/build'
/usr/bin/cmake -E cmake_progress_report /tmp/B.f12ff3bb-6888-43c1-bd5e-f512ada18a27/BUILD/rstudio-0.99.39/build/CMakeFiles 
[ 39%] Generating moc_DesktopMenuCallback.cxx
cd /tmp/B.f12ff3bb-6888-43c1-bd5e-f512ada18a27/BUILD/rstudio-0.99.39/build/src/cpp/desktop && /usr/lib/qt4/bin/moc @/tmp/B.f12ff3bb-6888-43c1-bd5e-f512ada18a27/BUILD/rstudio-0.99.39/build/src/cpp/desktop/moc_DesktopMenuCallback.cxx_parameters
make[2]: Leaving directory '/tmp/B.f12ff3bb-6888-43c1-bd5e-f512ada18a27/BUILD/rstudio-0.99.39/build'
make[2]: Entering directory '/tmp/B.f12ff3bb-6888-43c1-bd5e-f512ada18a27/BUILD/rstudio-0.99.39/build'
/usr/bin/cmake -E cmake_progress_report /tmp/B.f12ff3bb-6888-43c1-bd5e-f512ada18a27/BUILD/rstudio-0.99.39/build/CMakeFiles 33
[ 39%] Generating moc_DesktopMainWindow.cxx
cd /tmp/B.f12ff3bb-6888-43c1-bd5e-f512ada18a27/BUILD/rstudio-0.99.39/build/src/cpp/desktop && /usr/lib/qt4/bin/moc @/tmp/B.f12ff3bb-6888-43c1-bd5e-f512ada18a27/BUILD/rstudio-0.99.39/build/src/cpp/desktop/moc_DesktopMainWindow.cxx_parameters
make[2]: Leaving directory '/tmp/B.f12ff3bb-6888-43c1-bd5e-f512ada18a27/BUILD/rstudio-0.99.39/build'
make[2]: Entering directory '/tmp/B.f12ff3bb-6888-43c1-bd5e-f512ada18a27/BUILD/rstudio-0.99.39/build'
/usr/bin/cmake -E cmake_progress_report /tmp/B.f12ff3bb-6888-43c1-bd5e-f512ada18a27/BUILD/rstudio-0.99.39/build/CMakeFiles 
[ 39%] Generating moc_DesktopNetworkAccessManager.cxx
cd /tmp/B.f12ff3bb-6888-43c1-bd5e-f512ada18a27/BUILD/rstudio-0.99.39/build/src/cpp/desktop && /usr/lib/qt4/bin/moc @/tmp/B.f12ff3bb-6888-43c1-bd5e-f512ada18a27/BUILD/rstudio-0.99.39/build/src/cpp/desktop/moc_DesktopNetworkAccessManager.cxx_parameters
make[2]: Leaving directory '/tmp/B.f12ff3bb-6888-43c1-bd5e-f512ada18a27/BUILD/rstudio-0.99.39/build'
make[2]: Entering directory '/tmp/B.f12ff3bb-6888-43c1-bd5e-f512ada18a27/BUILD/rstudio-0.99.39/build'
/usr/bin/cmake -E cmake_progress_report /tmp/B.f12ff3bb-6888-43c1-bd5e-f512ada18a27/BUILD/rstudio-0.99.39/build/CMakeFiles 34
[ 40%] Generating moc_DesktopNetworkReply.cxx
cd /tmp/B.f12ff3bb-6888-43c1-bd5e-f512ada18a27/BUILD/rstudio-0.99.39/build/src/cpp/desktop && /usr/lib/qt4/bin/moc @/tmp/B.f12ff3bb-6888-43c1-bd5e-f512ada18a27/BUILD/rstudio-0.99.39/build/src/cpp/desktop/moc_DesktopNetworkReply.cxx_parameters
usr/include/boost/type_traits/detail/has_binary_operator.hp:50: Parse error at "BOOST_JOIN"
src/cpp/desktop/CMakeFiles/rstudio.dir/build.make:141: recipe for target 'src/cpp/desktop/moc_DesktopNetworkReply.cxx' failed
make[2]: *** [src/cpp/desktop/moc_DesktopNetworkReply.cxx] Error 1
make[2]: Leaving directory '/tmp/B.f12ff3bb-6888-43c1-bd5e-f512ada18a27/BUILD/rstudio-0.99.39/build'
CMakeFiles/Makefile2:533: recipe for target 'src/cpp/desktop/CMakeFiles/rstudio.dir/all' failed
make[1]: *** [src/cpp/desktop/CMakeFiles/rstudio.dir/all] Error 2
make[1]: *** Waiting for unfinished jobs....
make[2]: Entering directory '/tmp/B.f12ff3bb-6888-43c1-bd5e-f512ada18a27/BUILD/rstudio-0.99.39/build'
/usr/bin/cmake -E cmake_progress_report /tmp/B.f12ff3bb-6888-43c1-bd5e-f512ada18a27/BUILD/rstudio-0.99.39/build/CMakeFiles 100
[ 35%] Building CXX object src/cpp/session/workers/CMakeFiles/rstudio-session-workers.dir/SessionWebRequestWorker.cpp.o
cd /tmp/B.f12ff3bb-6888-43c1-bd5e-f512ada18a27/BUILD/rstudio-0.99.39/build/src/cpp/session/workers && /usr/bin/i486-pld-linux-g++   -DBOOST_ASIO_DISABLE_KQUEUE -DBOOST_ENABLE_ASSERT_HANDLER -D_FORTIFY_SOURCE=2 -O2 -fwrapv -pipe -Wformat -Werror=format-security -gdwarf-4 -fno-debug-types-section -fvar-tracking-assignments -g2 -Wp,-D_FORTIFY_SOURCE=2 -fstack-protector --param=ssp-buffer-size=4 -fomit-frame-pointer -march=i486 -fasynchronous-unwind-tables -gdwarf-4 -fno-debug-types-section -fvar-tracking-assignments -g2  -DNDEBUG -DQT_NO_DEBUG -I/tmp/B.f12ff3bb-6888-43c1-bd5e-f512ada18a27/BUILD/rstudio-0.99.39/src/cpp/core/include -I/tmp/B.f12ff3bb-6888-43c1-bd5e-f512ada18a27/BUILD/rstudio-0.99.39/src/cpp/session/include/session/worker_safe    -Wall -pthread -Wformat -Wformat-security -fstack-protector --param ssp-buffer-size=4 -pie -fPIE -o CMakeFiles/rstudio-session-workers.dir/SessionWebRequestWorker.cpp.o -c /tmp/B.f12ff3bb-6888-43c1-bd5e-f512ada18a27/BUILD/rstudio-0.99.39/src/cpp/session/workers/SessionWebRequestWorker.cpp
make[2]: Leaving directory '/tmp/B.f12ff3bb-6888-43c1-bd5e-f512ada18a27/BUILD/rstudio-0.99.39/build'
make[2]: Entering directory '/tmp/B.f12ff3bb-6888-43c1-bd5e-f512ada18a27/BUILD/rstudio-0.99.39/build'
/usr/bin/cmake -E cmake_progress_report /tmp/B.f12ff3bb-6888-43c1-bd5e-f512ada18a27/BUILD/rstudio-0.99.39/build/CMakeFiles 
[ 34%] Building CXX object src/cpp/diagnostics/CMakeFiles/diagnostics.dir/DiagnosticsMain.cpp.o
cd /tmp/B.f12ff3bb-6888-43c1-bd5e-f512ada18a27/BUILD/rstudio-0.99.39/build/src/cpp/diagnostics && /usr/bin/i486-pld-linux-g++   -DBOOST_ASIO_DISABLE_KQUEUE -DBOOST_ENABLE_ASSERT_HANDLER -D_FORTIFY_SOURCE=2 -O2 -fwrapv -pipe -Wformat -Werror=format-security -gdwarf-4 -fno-debug-types-section -fvar-tracking-assignments -g2 -Wp,-D_FORTIFY_SOURCE=2 -fstack-protector --param=ssp-buffer-size=4 -fomit-frame-pointer -march=i486 -fasynchronous-unwind-tables -gdwarf-4 -fno-debug-types-section -fvar-tracking-assignments -g2  -DNDEBUG -DQT_NO_DEBUG -I/tmp/B.f12ff3bb-6888-43c1-bd5e-f512ada18a27/BUILD/rstudio-0.99.39/src/cpp/core/include -I/tmp/B.f12ff3bb-6888-43c1-bd5e-f512ada18a27/BUILD/rstudio-0.99.39/build/src/cpp/diagnostics    -Wall -pthread -Wformat -Wformat-security -fstack-protector --param ssp-buffer-size=4 -pie -fPIE -o CMakeFiles/diagnostics.dir/DiagnosticsMain.cpp.o -c /tmp/B.f12ff3bb-6888-43c1-bd5e-f512ada18a27/BUILD/rstudio-0.99.39/src/cpp/diagnostics/DiagnosticsMain.cpp
make[2]: Leaving directory '/tmp/B.f12ff3bb-6888-43c1-bd5e-f512ada18a27/BUILD/rstudio-0.99.39/build'
make[2]: Entering directory '/tmp/B.f12ff3bb-6888-43c1-bd5e-f512ada18a27/BUILD/rstudio-0.99.39/build'
/usr/bin/cmake -E cmake_progress_report /tmp/B.f12ff3bb-6888-43c1-bd5e-f512ada18a27/BUILD/rstudio-0.99.39/build/CMakeFiles 
[ 35%] Building CXX object src/cpp/monitor/CMakeFiles/rstudio-monitor.dir/events/Event.cpp.o
cd /tmp/B.f12ff3bb-6888-43c1-bd5e-f512ada18a27/BUILD/rstudio-0.99.39/build/src/cpp/monitor && /usr/bin/i486-pld-linux-g++   -DBOOST_ASIO_DISABLE_KQUEUE -DBOOST_ENABLE_ASSERT_HANDLER -D_FORTIFY_SOURCE=2 -O2 -fwrapv -pipe -Wformat -Werror=format-security -gdwarf-4 -fno-debug-types-section -fvar-tracking-assignments -g2 -Wp,-D_FORTIFY_SOURCE=2 -fstack-protector --param=ssp-buffer-size=4 -fomit-frame-pointer -march=i486 -fasynchronous-unwind-tables -gdwarf-4 -fno-debug-types-section -fvar-tracking-assignments -g2  -DNDEBUG -DQT_NO_DEBUG -I/tmp/B.f12ff3bb-6888-43c1-bd5e-f512ada18a27/BUILD/rstudio-0.99.39/src/cpp/monitor/include -I/tmp/B.f12ff3bb-6888-43c1-bd5e-f512ada18a27/BUILD/rstudio-0.99.39/build/src/cpp/monitor -I/tmp/B.f12ff3bb-6888-43c1-bd5e-f512ada18a27/BUILD/rstudio-0.99.39/src/cpp/core/include    -Wall -pthread -Wformat -Wformat-security -fstack-protector --param ssp-buffer-size=4 -pie -fPIE -o CMakeFiles/rstudio-monitor.dir/events/Event.cpp.o -c /tmp/B.f12ff3bb-6888-43c1-bd5e-f512ada18a27/BUILD/rstudio-0.99.39/src/cpp/monitor/events/Event.cpp
make[2]: Leaving directory '/tmp/B.f12ff3bb-6888-43c1-bd5e-f512ada18a27/BUILD/rstudio-0.99.39/build'
make[2]: Entering directory '/tmp/B.f12ff3bb-6888-43c1-bd5e-f512ada18a27/BUILD/rstudio-0.99.39/build'
Linking CXX static library librstudio-session-workers.a
cd /tmp/B.f12ff3bb-6888-43c1-bd5e-f512ada18a27/BUILD/rstudio-0.99.39/build/src/cpp/session/workers && /usr/bin/cmake -P CMakeFiles/rstudio-session-workers.dir/cmake_clean_target.cmake
cd /tmp/B.f12ff3bb-6888-43c1-bd5e-f512ada18a27/BUILD/rstudio-0.99.39/build/src/cpp/session/workers && /usr/bin/cmake -E cmake_link_script CMakeFiles/rstudio-session-workers.dir/link.txt --verbose=1
/usr/bin/ar cq librstudio-session-workers.a  CMakeFiles/rstudio-session-workers.dir/SessionWebRequestWorker.cpp.o
/usr/bin/ranlib librstudio-session-workers.a
make[2]: Leaving directory '/tmp/B.f12ff3bb-6888-43c1-bd5e-f512ada18a27/BUILD/rstudio-0.99.39/build'
make[1]: Entering directory '/tmp/B.f12ff3bb-6888-43c1-bd5e-f512ada18a27/BUILD/rstudio-0.99.39/build'
/usr/bin/cmake -E cmake_progress_report /tmp/B.f12ff3bb-6888-43c1-bd5e-f512ada18a27/BUILD/rstudio-0.99.39/build/CMakeFiles  100
[ 41%] Built target rstudio-session-workers
make[1]: Leaving directory '/tmp/B.f12ff3bb-6888-43c1-bd5e-f512ada18a27/BUILD/rstudio-0.99.39/build'
make[2]: Entering directory '/tmp/B.f12ff3bb-6888-43c1-bd5e-f512ada18a27/BUILD/rstudio-0.99.39/build'
/usr/bin/cmake -E cmake_progress_report /tmp/B.f12ff3bb-6888-43c1-bd5e-f512ada18a27/BUILD/rstudio-0.99.39/build/CMakeFiles 
[ 39%] Building CXX object src/cpp/session/postback/CMakeFiles/rpostback.dir/PostbackOptions.cpp.o
cd /tmp/B.f12ff3bb-6888-43c1-bd5e-f512ada18a27/BUILD/rstudio-0.99.39/build/src/cpp/session/postback && /usr/bin/i486-pld-linux-g++   -DBOOST_ASIO_DISABLE_KQUEUE -DBOOST_ENABLE_ASSERT_HANDLER -D_FORTIFY_SOURCE=2 -O2 -fwrapv -pipe -Wformat -Werror=format-security -gdwarf-4 -fno-debug-types-section -fvar-tracking-assignments -g2 -Wp,-D_FORTIFY_SOURCE=2 -fstack-protector --param=ssp-buffer-size=4 -fomit-frame-pointer -march=i486 -fasynchronous-unwind-tables -gdwarf-4 -fno-debug-types-section -fvar-tracking-assignments -g2  -DNDEBUG -DQT_NO_DEBUG -I/tmp/B.f12ff3bb-6888-43c1-bd5e-f512ada18a27/BUILD/rstudio-0.99.39/src/cpp/session/include -I/usr/lib/R/include -I/tmp/B.f12ff3bb-6888-43c1-bd5e-f512ada18a27/BUILD/rstudio-0.99.39/src/cpp/core/include -I/tmp/B.f12ff3bb-6888-43c1-bd5e-f512ada18a27/BUILD/rstudio-0.99.39/src/cpp/monitor/include -I/tmp/B.f12ff3bb-6888-43c1-bd5e-f512ada18a27/BUILD/rstudio-0.99.39/src/cpp/r/include -I/tmp/B.f12ff3bb-6888-43c1-bd5e-f512ada18a27/BUILD/rstudio-0.99.39/build/src/cpp/session    -Wall -pthread -Wformat -Wformat-security -fstack-protector --param ssp-buffer-size=4 -pie -fPIE -o CMakeFiles/rpostback.dir/PostbackOptions.cpp.o -c /tmp/B.f12ff3bb-6888-43c1-bd5e-f512ada18a27/BUILD/rstudio-0.99.39/src/cpp/session/postback/PostbackOptions.cpp
make[2]: Leaving directory '/tmp/B.f12ff3bb-6888-43c1-bd5e-f512ada18a27/BUILD/rstudio-0.99.39/build'
make[2]: Entering directory '/tmp/B.f12ff3bb-6888-43c1-bd5e-f512ada18a27/BUILD/rstudio-0.99.39/build'
/usr/bin/cmake -E cmake_progress_report /tmp/B.f12ff3bb-6888-43c1-bd5e-f512ada18a27/BUILD/rstudio-0.99.39/build/CMakeFiles 
[ 38%] Building CXX object src/cpp/r/CMakeFiles/rstudio-r.dir/RExec.cpp.o
cd /tmp/B.f12ff3bb-6888-43c1-bd5e-f512ada18a27/BUILD/rstudio-0.99.39/build/src/cpp/r && /usr/bin/i486-pld-linux-g++   -DBOOST_ASIO_DISABLE_KQUEUE -DBOOST_ENABLE_ASSERT_HANDLER -D_FORTIFY_SOURCE=2 -O2 -fwrapv -pipe -Wformat -Werror=format-security -gdwarf-4 -fno-debug-types-section -fvar-tracking-assignments -g2 -Wp,-D_FORTIFY_SOURCE=2 -fstack-protector --param=ssp-buffer-size=4 -fomit-frame-pointer -march=i486 -fasynchronous-unwind-tables -gdwarf-4 -fno-debug-types-section -fvar-tracking-assignments -g2  -DNDEBUG -DQT_NO_DEBUG -I/tmp/B.f12ff3bb-6888-43c1-bd5e-f512ada18a27/BUILD/rstudio-0.99.39/src/cpp/r/include -I/tmp/B.f12ff3bb-6888-43c1-bd5e-f512ada18a27/BUILD/rstudio-0.99.39/build/src/cpp/r -I/tmp/B.f12ff3bb-6888-43c1-bd5e-f512ada18a27/BUILD/rstudio-0.99.39/src/cpp/core/include -I/usr/lib/R/include    -Wall -pthread -Wformat -Wformat-security -fstack-protector --param ssp-buffer-size=4 -pie -fPIE -o CMakeFiles/rstudio-r.dir/RExec.cpp.o -c /tmp/B.f12ff3bb-6888-43c1-bd5e-f512ada18a27/BUILD/rstudio-0.99.39/src/cpp/r/RExec.cpp
make[2]: Leaving directory '/tmp/B.f12ff3bb-6888-43c1-bd5e-f512ada18a27/BUILD/rstudio-0.99.39/build'
make[2]: Entering directory '/tmp/B.f12ff3bb-6888-43c1-bd5e-f512ada18a27/BUILD/rstudio-0.99.39/build'
/usr/bin/cmake -E cmake_progress_report /tmp/B.f12ff3bb-6888-43c1-bd5e-f512ada18a27/BUILD/rstudio-0.99.39/build/CMakeFiles 92
[ 41%] Building CXX object src/cpp/r/CMakeFiles/rstudio-r.dir/RFunctionHook.cpp.o
cd /tmp/B.f12ff3bb-6888-43c1-bd5e-f512ada18a27/BUILD/rstudio-0.99.39/build/src/cpp/r && /usr/bin/i486-pld-linux-g++   -DBOOST_ASIO_DISABLE_KQUEUE -DBOOST_ENABLE_ASSERT_HANDLER -D_FORTIFY_SOURCE=2 -O2 -fwrapv -pipe -Wformat -Werror=format-security -gdwarf-4 -fno-debug-types-section -fvar-tracking-assignments -g2 -Wp,-D_FORTIFY_SOURCE=2 -fstack-protector --param=ssp-buffer-size=4 -fomit-frame-pointer -march=i486 -fasynchronous-unwind-tables -gdwarf-4 -fno-debug-types-section -fvar-tracking-assignments -g2  -DNDEBUG -DQT_NO_DEBUG -I/tmp/B.f12ff3bb-6888-43c1-bd5e-f512ada18a27/BUILD/rstudio-0.99.39/src/cpp/r/include -I/tmp/B.f12ff3bb-6888-43c1-bd5e-f512ada18a27/BUILD/rstudio-0.99.39/build/src/cpp/r -I/tmp/B.f12ff3bb-6888-43c1-bd5e-f512ada18a27/BUILD/rstudio-0.99.39/src/cpp/core/include -I/usr/lib/R/include    -Wall -pthread -Wformat -Wformat-security -fstack-protector --param ssp-buffer-size=4 -pie -fPIE -o CMakeFiles/rstudio-r.dir/RFunctionHook.cpp.o -c /tmp/B.f12ff3bb-6888-43c1-bd5e-f512ada18a27/BUILD/rstudio-0.99.39/src/cpp/r/RFunctionHook.cpp
make[2]: Leaving directory '/tmp/B.f12ff3bb-6888-43c1-bd5e-f512ada18a27/BUILD/rstudio-0.99.39/build'
make[2]: Entering directory '/tmp/B.f12ff3bb-6888-43c1-bd5e-f512ada18a27/BUILD/rstudio-0.99.39/build'
/usr/bin/cmake -E cmake_progress_report /tmp/B.f12ff3bb-6888-43c1-bd5e-f512ada18a27/BUILD/rstudio-0.99.39/build/CMakeFiles 
[ 39%] Building CXX object src/cpp/monitor/CMakeFiles/rstudio-monitor.dir/metrics/Metric.cpp.o
cd /tmp/B.f12ff3bb-6888-43c1-bd5e-f512ada18a27/BUILD/rstudio-0.99.39/build/src/cpp/monitor && /usr/bin/i486-pld-linux-g++   -DBOOST_ASIO_DISABLE_KQUEUE -DBOOST_ENABLE_ASSERT_HANDLER -D_FORTIFY_SOURCE=2 -O2 -fwrapv -pipe -Wformat -Werror=format-security -gdwarf-4 -fno-debug-types-section -fvar-tracking-assignments -g2 -Wp,-D_FORTIFY_SOURCE=2 -fstack-protector --param=ssp-buffer-size=4 -fomit-frame-pointer -march=i486 -fasynchronous-unwind-tables -gdwarf-4 -fno-debug-types-section -fvar-tracking-assignments -g2  -DNDEBUG -DQT_NO_DEBUG -I/tmp/B.f12ff3bb-6888-43c1-bd5e-f512ada18a27/BUILD/rstudio-0.99.39/src/cpp/monitor/include -I/tmp/B.f12ff3bb-6888-43c1-bd5e-f512ada18a27/BUILD/rstudio-0.99.39/build/src/cpp/monitor -I/tmp/B.f12ff3bb-6888-43c1-bd5e-f512ada18a27/BUILD/rstudio-0.99.39/src/cpp/core/include    -Wall -pthread -Wformat -Wformat-security -fstack-protector --param ssp-buffer-size=4 -pie -fPIE -o CMakeFiles/rstudio-monitor.dir/metrics/Metric.cpp.o -c /tmp/B.f12ff3bb-6888-43c1-bd5e-f512ada18a27/BUILD/rstudio-0.99.39/src/cpp/monitor/metrics/Metric.cpp
make[2]: Leaving directory '/tmp/B.f12ff3bb-6888-43c1-bd5e-f512ada18a27/BUILD/rstudio-0.99.39/build'
make[2]: Entering directory '/tmp/B.f12ff3bb-6888-43c1-bd5e-f512ada18a27/BUILD/rstudio-0.99.39/build'
/usr/bin/cmake -E cmake_progress_report /tmp/B.f12ff3bb-6888-43c1-bd5e-f512ada18a27/BUILD/rstudio-0.99.39/build/CMakeFiles 
[ 41%] Building CXX object src/cpp/r/CMakeFiles/rstudio-r.dir/RJson.cpp.o
cd /tmp/B.f12ff3bb-6888-43c1-bd5e-f512ada18a27/BUILD/rstudio-0.99.39/build/src/cpp/r && /usr/bin/i486-pld-linux-g++   -DBOOST_ASIO_DISABLE_KQUEUE -DBOOST_ENABLE_ASSERT_HANDLER -D_FORTIFY_SOURCE=2 -O2 -fwrapv -pipe -Wformat -Werror=format-security -gdwarf-4 -fno-debug-types-section -fvar-tracking-assignments -g2 -Wp,-D_FORTIFY_SOURCE=2 -fstack-protector --param=ssp-buffer-size=4 -fomit-frame-pointer -march=i486 -fasynchronous-unwind-tables -gdwarf-4 -fno-debug-types-section -fvar-tracking-assignments -g2  -DNDEBUG -DQT_NO_DEBUG -I/tmp/B.f12ff3bb-6888-43c1-bd5e-f512ada18a27/BUILD/rstudio-0.99.39/src/cpp/r/include -I/tmp/B.f12ff3bb-6888-43c1-bd5e-f512ada18a27/BUILD/rstudio-0.99.39/build/src/cpp/r -I/tmp/B.f12ff3bb-6888-43c1-bd5e-f512ada18a27/BUILD/rstudio-0.99.39/src/cpp/core/include -I/usr/lib/R/include    -Wall -pthread -Wformat -Wformat-security -fstack-protector --param ssp-buffer-size=4 -pie -fPIE -o CMakeFiles/rstudio-r.dir/RJson.cpp.o -c /tmp/B.f12ff3bb-6888-43c1-bd5e-f512ada18a27/BUILD/rstudio-0.99.39/src/cpp/r/RJson.cpp
make[2]: Leaving directory '/tmp/B.f12ff3bb-6888-43c1-bd5e-f512ada18a27/BUILD/rstudio-0.99.39/build'
make[2]: Entering directory '/tmp/B.f12ff3bb-6888-43c1-bd5e-f512ada18a27/BUILD/rstudio-0.99.39/build'
/usr/bin/cmake -E cmake_progress_report /tmp/B.f12ff3bb-6888-43c1-bd5e-f512ada18a27/BUILD/rstudio-0.99.39/build/CMakeFiles 
[ 43%] Building CXX object src/cpp/r/CMakeFiles/rstudio-r.dir/RRoutines.cpp.o
cd /tmp/B.f12ff3bb-6888-43c1-bd5e-f512ada18a27/BUILD/rstudio-0.99.39/build/src/cpp/r && /usr/bin/i486-pld-linux-g++   -DBOOST_ASIO_DISABLE_KQUEUE -DBOOST_ENABLE_ASSERT_HANDLER -D_FORTIFY_SOURCE=2 -O2 -fwrapv -pipe -Wformat -Werror=format-security -gdwarf-4 -fno-debug-types-section -fvar-tracking-assignments -g2 -Wp,-D_FORTIFY_SOURCE=2 -fstack-protector --param=ssp-buffer-size=4 -fomit-frame-pointer -march=i486 -fasynchronous-unwind-tables -gdwarf-4 -fno-debug-types-section -fvar-tracking-assignments -g2  -DNDEBUG -DQT_NO_DEBUG -I/tmp/B.f12ff3bb-6888-43c1-bd5e-f512ada18a27/BUILD/rstudio-0.99.39/src/cpp/r/include -I/tmp/B.f12ff3bb-6888-43c1-bd5e-f512ada18a27/BUILD/rstudio-0.99.39/build/src/cpp/r -I/tmp/B.f12ff3bb-6888-43c1-bd5e-f512ada18a27/BUILD/rstudio-0.99.39/src/cpp/core/include -I/usr/lib/R/include    -Wall -pthread -Wformat -Wformat-security -fstack-protector --param ssp-buffer-size=4 -pie -fPIE -o CMakeFiles/rstudio-r.dir/RRoutines.cpp.o -c /tmp/B.f12ff3bb-6888-43c1-bd5e-f512ada18a27/BUILD/rstudio-0.99.39/src/cpp/r/RRoutines.cpp
make[2]: Leaving directory '/tmp/B.f12ff3bb-6888-43c1-bd5e-f512ada18a27/BUILD/rstudio-0.99.39/build'
make[2]: Entering directory '/tmp/B.f12ff3bb-6888-43c1-bd5e-f512ada18a27/BUILD/rstudio-0.99.39/build'
Linking CXX executable diagnostics
cd /tmp/B.f12ff3bb-6888-43c1-bd5e-f512ada18a27/BUILD/rstudio-0.99.39/build/src/cpp/diagnostics && /usr/bin/cmake -E cmake_link_script CMakeFiles/diagnostics.dir/link.txt --verbose=1
/usr/bin/i486-pld-linux-g++   -O2 -fwrapv -pipe -Wformat -Werror=format-security -gdwarf-4 -fno-debug-types-section -fvar-tracking-assignments -g2 -Wp,-D_FORTIFY_SOURCE=2 -fstack-protector --param=ssp-buffer-size=4 -fomit-frame-pointer -march=i486 -fasynchronous-unwind-tables -gdwarf-4 -fno-debug-types-section -fvar-tracking-assignments -g2  -DNDEBUG -DQT_NO_DEBUG   -Wl,-z,relro,-z,now CMakeFiles/diagnostics.dir/DiagnosticsMain.cpp.o  -o diagnostics -rdynamic ../core/librstudio-core.a -lboost_date_time -lboost_filesystem -lboost_iostreams -lboost_program_options -lboost_regex -lboost_signals -lboost_system -lboost_thread -lboost_chrono -lpthread -lutil -luuid -lrt -lz 
make[2]: Leaving directory '/tmp/B.f12ff3bb-6888-43c1-bd5e-f512ada18a27/BUILD/rstudio-0.99.39/build'
make[1]: Entering directory '/tmp/B.f12ff3bb-6888-43c1-bd5e-f512ada18a27/BUILD/rstudio-0.99.39/build'
/usr/bin/cmake -E cmake_progress_report /tmp/B.f12ff3bb-6888-43c1-bd5e-f512ada18a27/BUILD/rstudio-0.99.39/build/CMakeFiles 
[ 43%] Built target diagnostics
make[1]: Leaving directory '/tmp/B.f12ff3bb-6888-43c1-bd5e-f512ada18a27/BUILD/rstudio-0.99.39/build'
make[2]: Entering directory '/tmp/B.f12ff3bb-6888-43c1-bd5e-f512ada18a27/BUILD/rstudio-0.99.39/build'
/usr/bin/cmake -E cmake_progress_report /tmp/B.f12ff3bb-6888-43c1-bd5e-f512ada18a27/BUILD/rstudio-0.99.39/build/CMakeFiles 
[ 42%] Building CXX object src/cpp/monitor/CMakeFiles/rstudio-monitor.dir/MonitorClientOverlay.cpp.o
cd /tmp/B.f12ff3bb-6888-43c1-bd5e-f512ada18a27/BUILD/rstudio-0.99.39/build/src/cpp/monitor && /usr/bin/i486-pld-linux-g++   -DBOOST_ASIO_DISABLE_KQUEUE -DBOOST_ENABLE_ASSERT_HANDLER -D_FORTIFY_SOURCE=2 -O2 -fwrapv -pipe -Wformat -Werror=format-security -gdwarf-4 -fno-debug-types-section -fvar-tracking-assignments -g2 -Wp,-D_FORTIFY_SOURCE=2 -fstack-protector --param=ssp-buffer-size=4 -fomit-frame-pointer -march=i486 -fasynchronous-unwind-tables -gdwarf-4 -fno-debug-types-section -fvar-tracking-assignments -g2  -DNDEBUG -DQT_NO_DEBUG -I/tmp/B.f12ff3bb-6888-43c1-bd5e-f512ada18a27/BUILD/rstudio-0.99.39/src/cpp/monitor/include -I/tmp/B.f12ff3bb-6888-43c1-bd5e-f512ada18a27/BUILD/rstudio-0.99.39/build/src/cpp/monitor -I/tmp/B.f12ff3bb-6888-43c1-bd5e-f512ada18a27/BUILD/rstudio-0.99.39/src/cpp/core/include    -Wall -pthread -Wformat -Wformat-security -fstack-protector --param ssp-buffer-size=4 -pie -fPIE -o CMakeFiles/rstudio-monitor.dir/MonitorClientOverlay.cpp.o -c /tmp/B.f12ff3bb-6888-43c1-bd5e-f512ada18a27/BUILD/rstudio-0.99.39/src/cpp/monitor/MonitorClientOverlay.cpp
make[2]: Leaving directory '/tmp/B.f12ff3bb-6888-43c1-bd5e-f512ada18a27/BUILD/rstudio-0.99.39/build'
make[2]: Entering directory '/tmp/B.f12ff3bb-6888-43c1-bd5e-f512ada18a27/BUILD/rstudio-0.99.39/build'
/usr/bin/cmake -E cmake_progress_report /tmp/B.f12ff3bb-6888-43c1-bd5e-f512ada18a27/BUILD/rstudio-0.99.39/build/CMakeFiles 91
[ 43%] Building CXX object src/cpp/monitor/CMakeFiles/rstudio-monitor.dir/MonitorClient.cpp.o
cd /tmp/B.f12ff3bb-6888-43c1-bd5e-f512ada18a27/BUILD/rstudio-0.99.39/build/src/cpp/monitor && /usr/bin/i486-pld-linux-g++   -DBOOST_ASIO_DISABLE_KQUEUE -DBOOST_ENABLE_ASSERT_HANDLER -D_FORTIFY_SOURCE=2 -O2 -fwrapv -pipe -Wformat -Werror=format-security -gdwarf-4 -fno-debug-types-section -fvar-tracking-assignments -g2 -Wp,-D_FORTIFY_SOURCE=2 -fstack-protector --param=ssp-buffer-size=4 -fomit-frame-pointer -march=i486 -fasynchronous-unwind-tables -gdwarf-4 -fno-debug-types-section -fvar-tracking-assignments -g2  -DNDEBUG -DQT_NO_DEBUG -I/tmp/B.f12ff3bb-6888-43c1-bd5e-f512ada18a27/BUILD/rstudio-0.99.39/src/cpp/monitor/include -I/tmp/B.f12ff3bb-6888-43c1-bd5e-f512ada18a27/BUILD/rstudio-0.99.39/build/src/cpp/monitor -I/tmp/B.f12ff3bb-6888-43c1-bd5e-f512ada18a27/BUILD/rstudio-0.99.39/src/cpp/core/include    -Wall -pthread -Wformat -Wformat-security -fstack-protector --param ssp-buffer-size=4 -pie -fPIE -o CMakeFiles/rstudio-monitor.dir/MonitorClient.cpp.o -c /tmp/B.f12ff3bb-6888-43c1-bd5e-f512ada18a27/BUILD/rstudio-0.99.39/src/cpp/monitor/MonitorClient.cpp
make[2]: Leaving directory '/tmp/B.f12ff3bb-6888-43c1-bd5e-f512ada18a27/BUILD/rstudio-0.99.39/build'
make[2]: Entering directory '/tmp/B.f12ff3bb-6888-43c1-bd5e-f512ada18a27/BUILD/rstudio-0.99.39/build'
/usr/bin/cmake -E cmake_progress_report /tmp/B.f12ff3bb-6888-43c1-bd5e-f512ada18a27/BUILD/rstudio-0.99.39/build/CMakeFiles 1
[ 36%] Building CXX object src/cpp/session/postback/CMakeFiles/rpostback.dir/PostbackMain.cpp.o
cd /tmp/B.f12ff3bb-6888-43c1-bd5e-f512ada18a27/BUILD/rstudio-0.99.39/build/src/cpp/session/postback && /usr/bin/i486-pld-linux-g++   -DBOOST_ASIO_DISABLE_KQUEUE -DBOOST_ENABLE_ASSERT_HANDLER -D_FORTIFY_SOURCE=2 -O2 -fwrapv -pipe -Wformat -Werror=format-security -gdwarf-4 -fno-debug-types-section -fvar-tracking-assignments -g2 -Wp,-D_FORTIFY_SOURCE=2 -fstack-protector --param=ssp-buffer-size=4 -fomit-frame-pointer -march=i486 -fasynchronous-unwind-tables -gdwarf-4 -fno-debug-types-section -fvar-tracking-assignments -g2  -DNDEBUG -DQT_NO_DEBUG -I/tmp/B.f12ff3bb-6888-43c1-bd5e-f512ada18a27/BUILD/rstudio-0.99.39/src/cpp/session/include -I/usr/lib/R/include -I/tmp/B.f12ff3bb-6888-43c1-bd5e-f512ada18a27/BUILD/rstudio-0.99.39/src/cpp/core/include -I/tmp/B.f12ff3bb-6888-43c1-bd5e-f512ada18a27/BUILD/rstudio-0.99.39/src/cpp/monitor/include -I/tmp/B.f12ff3bb-6888-43c1-bd5e-f512ada18a27/BUILD/rstudio-0.99.39/src/cpp/r/include -I/tmp/B.f12ff3bb-6888-43c1-bd5e-f512ada18a27/BUILD/rstudio-0.99.39/build/src/cpp/session    -Wall -pthread -Wformat -Wformat-security -fstack-protector --param ssp-buffer-size=4 -pie -fPIE -o CMakeFiles/rpostback.dir/PostbackMain.cpp.o -c /tmp/B.f12ff3bb-6888-43c1-bd5e-f512ada18a27/BUILD/rstudio-0.99.39/src/cpp/session/postback/PostbackMain.cpp
make[2]: Leaving directory '/tmp/B.f12ff3bb-6888-43c1-bd5e-f512ada18a27/BUILD/rstudio-0.99.39/build'
make[2]: Entering directory '/tmp/B.f12ff3bb-6888-43c1-bd5e-f512ada18a27/BUILD/rstudio-0.99.39/build'
/usr/bin/cmake -E cmake_progress_report /tmp/B.f12ff3bb-6888-43c1-bd5e-f512ada18a27/BUILD/rstudio-0.99.39/build/CMakeFiles 
[ 43%] Building CXX object src/cpp/r/CMakeFiles/rstudio-r.dir/RSexp.cpp.o
cd /tmp/B.f12ff3bb-6888-43c1-bd5e-f512ada18a27/BUILD/rstudio-0.99.39/build/src/cpp/r && /usr/bin/i486-pld-linux-g++   -DBOOST_ASIO_DISABLE_KQUEUE -DBOOST_ENABLE_ASSERT_HANDLER -D_FORTIFY_SOURCE=2 -O2 -fwrapv -pipe -Wformat -Werror=format-security -gdwarf-4 -fno-debug-types-section -fvar-tracking-assignments -g2 -Wp,-D_FORTIFY_SOURCE=2 -fstack-protector --param=ssp-buffer-size=4 -fomit-frame-pointer -march=i486 -fasynchronous-unwind-tables -gdwarf-4 -fno-debug-types-section -fvar-tracking-assignments -g2  -DNDEBUG -DQT_NO_DEBUG -I/tmp/B.f12ff3bb-6888-43c1-bd5e-f512ada18a27/BUILD/rstudio-0.99.39/src/cpp/r/include -I/tmp/B.f12ff3bb-6888-43c1-bd5e-f512ada18a27/BUILD/rstudio-0.99.39/build/src/cpp/r -I/tmp/B.f12ff3bb-6888-43c1-bd5e-f512ada18a27/BUILD/rstudio-0.99.39/src/cpp/core/include -I/usr/lib/R/include    -Wall -pthread -Wformat -Wformat-security -fstack-protector --param ssp-buffer-size=4 -pie -fPIE -o CMakeFiles/rstudio-r.dir/RSexp.cpp.o -c /tmp/B.f12ff3bb-6888-43c1-bd5e-f512ada18a27/BUILD/rstudio-0.99.39/src/cpp/r/RSexp.cpp
make[2]: Leaving directory '/tmp/B.f12ff3bb-6888-43c1-bd5e-f512ada18a27/BUILD/rstudio-0.99.39/build'
make[2]: Entering directory '/tmp/B.f12ff3bb-6888-43c1-bd5e-f512ada18a27/BUILD/rstudio-0.99.39/build'
/usr/bin/cmake -E cmake_progress_report /tmp/B.f12ff3bb-6888-43c1-bd5e-f512ada18a27/BUILD/rstudio-0.99.39/build/CMakeFiles 
[ 43%] Building CXX object src/cpp/r/CMakeFiles/rstudio-r.dir/RSourceManager.cpp.o
cd /tmp/B.f12ff3bb-6888-43c1-bd5e-f512ada18a27/BUILD/rstudio-0.99.39/build/src/cpp/r && /usr/bin/i486-pld-linux-g++   -DBOOST_ASIO_DISABLE_KQUEUE -DBOOST_ENABLE_ASSERT_HANDLER -D_FORTIFY_SOURCE=2 -O2 -fwrapv -pipe -Wformat -Werror=format-security -gdwarf-4 -fno-debug-types-section -fvar-tracking-assignments -g2 -Wp,-D_FORTIFY_SOURCE=2 -fstack-protector --param=ssp-buffer-size=4 -fomit-frame-pointer -march=i486 -fasynchronous-unwind-tables -gdwarf-4 -fno-debug-types-section -fvar-tracking-assignments -g2  -DNDEBUG -DQT_NO_DEBUG -I/tmp/B.f12ff3bb-6888-43c1-bd5e-f512ada18a27/BUILD/rstudio-0.99.39/src/cpp/r/include -I/tmp/B.f12ff3bb-6888-43c1-bd5e-f512ada18a27/BUILD/rstudio-0.99.39/build/src/cpp/r -I/tmp/B.f12ff3bb-6888-43c1-bd5e-f512ada18a27/BUILD/rstudio-0.99.39/src/cpp/core/include -I/usr/lib/R/include    -Wall -pthread -Wformat -Wformat-security -fstack-protector --param ssp-buffer-size=4 -pie -fPIE -o CMakeFiles/rstudio-r.dir/RSourceManager.cpp.o -c /tmp/B.f12ff3bb-6888-43c1-bd5e-f512ada18a27/BUILD/rstudio-0.99.39/src/cpp/r/RSourceManager.cpp
make[2]: Leaving directory '/tmp/B.f12ff3bb-6888-43c1-bd5e-f512ada18a27/BUILD/rstudio-0.99.39/build'
make[2]: Entering directory '/tmp/B.f12ff3bb-6888-43c1-bd5e-f512ada18a27/BUILD/rstudio-0.99.39/build'
/usr/bin/cmake -E cmake_progress_report /tmp/B.f12ff3bb-6888-43c1-bd5e-f512ada18a27/BUILD/rstudio-0.99.39/build/CMakeFiles 
[ 41%] Building CXX object src/cpp/r/CMakeFiles/rstudio-r.dir/RJsonRpc.cpp.o
cd /tmp/B.f12ff3bb-6888-43c1-bd5e-f512ada18a27/BUILD/rstudio-0.99.39/build/src/cpp/r && /usr/bin/i486-pld-linux-g++   -DBOOST_ASIO_DISABLE_KQUEUE -DBOOST_ENABLE_ASSERT_HANDLER -D_FORTIFY_SOURCE=2 -O2 -fwrapv -pipe -Wformat -Werror=format-security -gdwarf-4 -fno-debug-types-section -fvar-tracking-assignments -g2 -Wp,-D_FORTIFY_SOURCE=2 -fstack-protector --param=ssp-buffer-size=4 -fomit-frame-pointer -march=i486 -fasynchronous-unwind-tables -gdwarf-4 -fno-debug-types-section -fvar-tracking-assignments -g2  -DNDEBUG -DQT_NO_DEBUG -I/tmp/B.f12ff3bb-6888-43c1-bd5e-f512ada18a27/BUILD/rstudio-0.99.39/src/cpp/r/include -I/tmp/B.f12ff3bb-6888-43c1-bd5e-f512ada18a27/BUILD/rstudio-0.99.39/build/src/cpp/r -I/tmp/B.f12ff3bb-6888-43c1-bd5e-f512ada18a27/BUILD/rstudio-0.99.39/src/cpp/core/include -I/usr/lib/R/include    -Wall -pthread -Wformat -Wformat-security -fstack-protector --param ssp-buffer-size=4 -pie -fPIE -o CMakeFiles/rstudio-r.dir/RJsonRpc.cpp.o -c /tmp/B.f12ff3bb-6888-43c1-bd5e-f512ada18a27/BUILD/rstudio-0.99.39/src/cpp/r/RJsonRpc.cpp
make[2]: Leaving directory '/tmp/B.f12ff3bb-6888-43c1-bd5e-f512ada18a27/BUILD/rstudio-0.99.39/build'
make[2]: Entering directory '/tmp/B.f12ff3bb-6888-43c1-bd5e-f512ada18a27/BUILD/rstudio-0.99.39/build'
/usr/bin/cmake -E cmake_progress_report /tmp/B.f12ff3bb-6888-43c1-bd5e-f512ada18a27/BUILD/rstudio-0.99.39/build/CMakeFiles 93
[ 42%] Building CXX object src/cpp/r/CMakeFiles/rstudio-r.dir/ROptions.cpp.o
cd /tmp/B.f12ff3bb-6888-43c1-bd5e-f512ada18a27/BUILD/rstudio-0.99.39/build/src/cpp/r && /usr/bin/i486-pld-linux-g++   -DBOOST_ASIO_DISABLE_KQUEUE -DBOOST_ENABLE_ASSERT_HANDLER -D_FORTIFY_SOURCE=2 -O2 -fwrapv -pipe -Wformat -Werror=format-security -gdwarf-4 -fno-debug-types-section -fvar-tracking-assignments -g2 -Wp,-D_FORTIFY_SOURCE=2 -fstack-protector --param=ssp-buffer-size=4 -fomit-frame-pointer -march=i486 -fasynchronous-unwind-tables -gdwarf-4 -fno-debug-types-section -fvar-tracking-assignments -g2  -DNDEBUG -DQT_NO_DEBUG -I/tmp/B.f12ff3bb-6888-43c1-bd5e-f512ada18a27/BUILD/rstudio-0.99.39/src/cpp/r/include -I/tmp/B.f12ff3bb-6888-43c1-bd5e-f512ada18a27/BUILD/rstudio-0.99.39/build/src/cpp/r -I/tmp/B.f12ff3bb-6888-43c1-bd5e-f512ada18a27/BUILD/rstudio-0.99.39/src/cpp/core/include -I/usr/lib/R/include    -Wall -pthread -Wformat -Wformat-security -fstack-protector --param ssp-buffer-size=4 -pie -fPIE -o CMakeFiles/rstudio-r.dir/ROptions.cpp.o -c /tmp/B.f12ff3bb-6888-43c1-bd5e-f512ada18a27/BUILD/rstudio-0.99.39/src/cpp/r/ROptions.cpp
make[2]: Leaving directory '/tmp/B.f12ff3bb-6888-43c1-bd5e-f512ada18a27/BUILD/rstudio-0.99.39/build'
make[2]: Entering directory '/tmp/B.f12ff3bb-6888-43c1-bd5e-f512ada18a27/BUILD/rstudio-0.99.39/build'
Linking CXX static library librstudio-monitor.a
cd /tmp/B.f12ff3bb-6888-43c1-bd5e-f512ada18a27/BUILD/rstudio-0.99.39/build/src/cpp/monitor && /usr/bin/cmake -P CMakeFiles/rstudio-monitor.dir/cmake_clean_target.cmake
cd /tmp/B.f12ff3bb-6888-43c1-bd5e-f512ada18a27/BUILD/rstudio-0.99.39/build/src/cpp/monitor && /usr/bin/cmake -E cmake_link_script CMakeFiles/rstudio-monitor.dir/link.txt --verbose=1
/usr/bin/ar cq librstudio-monitor.a  CMakeFiles/rstudio-monitor.dir/events/Event.cpp.o CMakeFiles/rstudio-monitor.dir/metrics/Metric.cpp.o CMakeFiles/rstudio-monitor.dir/MonitorClient.cpp.o CMakeFiles/rstudio-monitor.dir/MonitorClientOverlay.cpp.o
/usr/bin/ranlib librstudio-monitor.a
make[2]: Leaving directory '/tmp/B.f12ff3bb-6888-43c1-bd5e-f512ada18a27/BUILD/rstudio-0.99.39/build'
make[2]: Entering directory '/tmp/B.f12ff3bb-6888-43c1-bd5e-f512ada18a27/BUILD/rstudio-0.99.39/build'
/usr/bin/cmake -E cmake_progress_report /tmp/B.f12ff3bb-6888-43c1-bd5e-f512ada18a27/BUILD/rstudio-0.99.39/build/CMakeFiles 94
[ 44%] Building CXX object src/cpp/r/CMakeFiles/rstudio-r.dir/RUtil.cpp.o
cd /tmp/B.f12ff3bb-6888-43c1-bd5e-f512ada18a27/BUILD/rstudio-0.99.39/build/src/cpp/r && /usr/bin/i486-pld-linux-g++   -DBOOST_ASIO_DISABLE_KQUEUE -DBOOST_ENABLE_ASSERT_HANDLER -D_FORTIFY_SOURCE=2 -O2 -fwrapv -pipe -Wformat -Werror=format-security -gdwarf-4 -fno-debug-types-section -fvar-tracking-assignments -g2 -Wp,-D_FORTIFY_SOURCE=2 -fstack-protector --param=ssp-buffer-size=4 -fomit-frame-pointer -march=i486 -fasynchronous-unwind-tables -gdwarf-4 -fno-debug-types-section -fvar-tracking-assignments -g2  -DNDEBUG -DQT_NO_DEBUG -I/tmp/B.f12ff3bb-6888-43c1-bd5e-f512ada18a27/BUILD/rstudio-0.99.39/src/cpp/r/include -I/tmp/B.f12ff3bb-6888-43c1-bd5e-f512ada18a27/BUILD/rstudio-0.99.39/build/src/cpp/r -I/tmp/B.f12ff3bb-6888-43c1-bd5e-f512ada18a27/BUILD/rstudio-0.99.39/src/cpp/core/include -I/usr/lib/R/include    -Wall -pthread -Wformat -Wformat-security -fstack-protector --param ssp-buffer-size=4 -pie -fPIE -o CMakeFiles/rstudio-r.dir/RUtil.cpp.o -c /tmp/B.f12ff3bb-6888-43c1-bd5e-f512ada18a27/BUILD/rstudio-0.99.39/src/cpp/r/RUtil.cpp
make[2]: Leaving directory '/tmp/B.f12ff3bb-6888-43c1-bd5e-f512ada18a27/BUILD/rstudio-0.99.39/build'
make[1]: Entering directory '/tmp/B.f12ff3bb-6888-43c1-bd5e-f512ada18a27/BUILD/rstudio-0.99.39/build'
/usr/bin/cmake -E cmake_progress_report /tmp/B.f12ff3bb-6888-43c1-bd5e-f512ada18a27/BUILD/rstudio-0.99.39/build/CMakeFiles  91
[ 45%] Built target rstudio-monitor
make[1]: Leaving directory '/tmp/B.f12ff3bb-6888-43c1-bd5e-f512ada18a27/BUILD/rstudio-0.99.39/build'
make[2]: Entering directory '/tmp/B.f12ff3bb-6888-43c1-bd5e-f512ada18a27/BUILD/rstudio-0.99.39/build'
/usr/bin/cmake -E cmake_progress_report /tmp/B.f12ff3bb-6888-43c1-bd5e-f512ada18a27/BUILD/rstudio-0.99.39/build/CMakeFiles 
[ 45%] Building CXX object src/cpp/r/CMakeFiles/rstudio-r.dir/session/RDiscovery.cpp.o
cd /tmp/B.f12ff3bb-6888-43c1-bd5e-f512ada18a27/BUILD/rstudio-0.99.39/build/src/cpp/r && /usr/bin/i486-pld-linux-g++   -DBOOST_ASIO_DISABLE_KQUEUE -DBOOST_ENABLE_ASSERT_HANDLER -D_FORTIFY_SOURCE=2 -O2 -fwrapv -pipe -Wformat -Werror=format-security -gdwarf-4 -fno-debug-types-section -fvar-tracking-assignments -g2 -Wp,-D_FORTIFY_SOURCE=2 -fstack-protector --param=ssp-buffer-size=4 -fomit-frame-pointer -march=i486 -fasynchronous-unwind-tables -gdwarf-4 -fno-debug-types-section -fvar-tracking-assignments -g2  -DNDEBUG -DQT_NO_DEBUG -I/tmp/B.f12ff3bb-6888-43c1-bd5e-f512ada18a27/BUILD/rstudio-0.99.39/src/cpp/r/include -I/tmp/B.f12ff3bb-6888-43c1-bd5e-f512ada18a27/BUILD/rstudio-0.99.39/build/src/cpp/r -I/tmp/B.f12ff3bb-6888-43c1-bd5e-f512ada18a27/BUILD/rstudio-0.99.39/src/cpp/core/include -I/usr/lib/R/include    -Wall -pthread -Wformat -Wformat-security -fstack-protector --param ssp-buffer-size=4 -pie -fPIE -o CMakeFiles/rstudio-r.dir/session/RDiscovery.cpp.o -c /tmp/B.f12ff3bb-6888-43c1-bd5e-f512ada18a27/BUILD/rstudio-0.99.39/src/cpp/r/session/RDiscovery.cpp
make[2]: Leaving directory '/tmp/B.f12ff3bb-6888-43c1-bd5e-f512ada18a27/BUILD/rstudio-0.99.39/build'
make[2]: Entering directory '/tmp/B.f12ff3bb-6888-43c1-bd5e-f512ada18a27/BUILD/rstudio-0.99.39/build'
/usr/bin/cmake -E cmake_progress_report /tmp/B.f12ff3bb-6888-43c1-bd5e-f512ada18a27/BUILD/rstudio-0.99.39/build/CMakeFiles 
[ 45%] Building CXX object src/cpp/r/CMakeFiles/rstudio-r.dir/session/RRestartContext.cpp.o
cd /tmp/B.f12ff3bb-6888-43c1-bd5e-f512ada18a27/BUILD/rstudio-0.99.39/build/src/cpp/r && /usr/bin/i486-pld-linux-g++   -DBOOST_ASIO_DISABLE_KQUEUE -DBOOST_ENABLE_ASSERT_HANDLER -D_FORTIFY_SOURCE=2 -O2 -fwrapv -pipe -Wformat -Werror=format-security -gdwarf-4 -fno-debug-types-section -fvar-tracking-assignments -g2 -Wp,-D_FORTIFY_SOURCE=2 -fstack-protector --param=ssp-buffer-size=4 -fomit-frame-pointer -march=i486 -fasynchronous-unwind-tables -gdwarf-4 -fno-debug-types-section -fvar-tracking-assignments -g2  -DNDEBUG -DQT_NO_DEBUG -I/tmp/B.f12ff3bb-6888-43c1-bd5e-f512ada18a27/BUILD/rstudio-0.99.39/src/cpp/r/include -I/tmp/B.f12ff3bb-6888-43c1-bd5e-f512ada18a27/BUILD/rstudio-0.99.39/build/src/cpp/r -I/tmp/B.f12ff3bb-6888-43c1-bd5e-f512ada18a27/BUILD/rstudio-0.99.39/src/cpp/core/include -I/usr/lib/R/include    -Wall -pthread -Wformat -Wformat-security -fstack-protector --param ssp-buffer-size=4 -pie -fPIE -o CMakeFiles/rstudio-r.dir/session/RRestartContext.cpp.o -c /tmp/B.f12ff3bb-6888-43c1-bd5e-f512ada18a27/BUILD/rstudio-0.99.39/src/cpp/r/session/RRestartContext.cpp
make[2]: Leaving directory '/tmp/B.f12ff3bb-6888-43c1-bd5e-f512ada18a27/BUILD/rstudio-0.99.39/build'
make[2]: Entering directory '/tmp/B.f12ff3bb-6888-43c1-bd5e-f512ada18a27/BUILD/rstudio-0.99.39/build'
/usr/bin/cmake -E cmake_progress_report /tmp/B.f12ff3bb-6888-43c1-bd5e-f512ada18a27/BUILD/rstudio-0.99.39/build/CMakeFiles 
[ 44%] Building CXX object src/cpp/r/CMakeFiles/rstudio-r.dir/session/RClientMetrics.cpp.o
cd /tmp/B.f12ff3bb-6888-43c1-bd5e-f512ada18a27/BUILD/rstudio-0.99.39/build/src/cpp/r && /usr/bin/i486-pld-linux-g++   -DBOOST_ASIO_DISABLE_KQUEUE -DBOOST_ENABLE_ASSERT_HANDLER -D_FORTIFY_SOURCE=2 -O2 -fwrapv -pipe -Wformat -Werror=format-security -gdwarf-4 -fno-debug-types-section -fvar-tracking-assignments -g2 -Wp,-D_FORTIFY_SOURCE=2 -fstack-protector --param=ssp-buffer-size=4 -fomit-frame-pointer -march=i486 -fasynchronous-unwind-tables -gdwarf-4 -fno-debug-types-section -fvar-tracking-assignments -g2  -DNDEBUG -DQT_NO_DEBUG -I/tmp/B.f12ff3bb-6888-43c1-bd5e-f512ada18a27/BUILD/rstudio-0.99.39/src/cpp/r/include -I/tmp/B.f12ff3bb-6888-43c1-bd5e-f512ada18a27/BUILD/rstudio-0.99.39/build/src/cpp/r -I/tmp/B.f12ff3bb-6888-43c1-bd5e-f512ada18a27/BUILD/rstudio-0.99.39/src/cpp/core/include -I/usr/lib/R/include    -Wall -pthread -Wformat -Wformat-security -fstack-protector --param ssp-buffer-size=4 -pie -fPIE -o CMakeFiles/rstudio-r.dir/session/RClientMetrics.cpp.o -c /tmp/B.f12ff3bb-6888-43c1-bd5e-f512ada18a27/BUILD/rstudio-0.99.39/src/cpp/r/session/RClientMetrics.cpp
make[2]: Leaving directory '/tmp/B.f12ff3bb-6888-43c1-bd5e-f512ada18a27/BUILD/rstudio-0.99.39/build'
make[2]: Entering directory '/tmp/B.f12ff3bb-6888-43c1-bd5e-f512ada18a27/BUILD/rstudio-0.99.39/build'
/usr/bin/cmake -E cmake_progress_report /tmp/B.f12ff3bb-6888-43c1-bd5e-f512ada18a27/BUILD/rstudio-0.99.39/build/CMakeFiles 
[ 46%] Building CXX object src/cpp/r/CMakeFiles/rstudio-r.dir/session/graphics/RGraphicsDevice.cpp.o
cd /tmp/B.f12ff3bb-6888-43c1-bd5e-f512ada18a27/BUILD/rstudio-0.99.39/build/src/cpp/r && /usr/bin/i486-pld-linux-g++   -DBOOST_ASIO_DISABLE_KQUEUE -DBOOST_ENABLE_ASSERT_HANDLER -D_FORTIFY_SOURCE=2 -O2 -fwrapv -pipe -Wformat -Werror=format-security -gdwarf-4 -fno-debug-types-section -fvar-tracking-assignments -g2 -Wp,-D_FORTIFY_SOURCE=2 -fstack-protector --param=ssp-buffer-size=4 -fomit-frame-pointer -march=i486 -fasynchronous-unwind-tables -gdwarf-4 -fno-debug-types-section -fvar-tracking-assignments -g2  -DNDEBUG -DQT_NO_DEBUG -I/tmp/B.f12ff3bb-6888-43c1-bd5e-f512ada18a27/BUILD/rstudio-0.99.39/src/cpp/r/include -I/tmp/B.f12ff3bb-6888-43c1-bd5e-f512ada18a27/BUILD/rstudio-0.99.39/build/src/cpp/r -I/tmp/B.f12ff3bb-6888-43c1-bd5e-f512ada18a27/BUILD/rstudio-0.99.39/src/cpp/core/include -I/usr/lib/R/include    -Wall -pthread -Wformat -Wformat-security -fstack-protector --param ssp-buffer-size=4 -pie -fPIE -o CMakeFiles/rstudio-r.dir/session/graphics/RGraphicsDevice.cpp.o -c /tmp/B.f12ff3bb-6888-43c1-bd5e-f512ada18a27/BUILD/rstudio-0.99.39/src/cpp/r/session/graphics/RGraphicsDevice.cpp
In file included from /tmp/B.f12ff3bb-6888-43c1-bd5e-f512ada18a27/BUILD/rstudio-0.99.39/src/cpp/r/session/graphics/RGraphicsPlotManager.hpp:25:0,
                 from /tmp/B.f12ff3bb-6888-43c1-bd5e-f512ada18a27/BUILD/rstudio-0.99.39/src/cpp/r/session/graphics/RGraphicsDevice.cpp:32:
/usr/include/boost/signal.hpp:17:4: warning: #warning "Boost.Signals is no longer being maintained and is now deprecated. Please switch to Boost.Signals2. To disable this warning message, define BOOST_SIGNALS_NO_DEPRECATION_WARNING." [-Wcpp]
 #  warning                  "Boost.Signals is no longer being maintained and is now deprecated. Please switch to Boost.Signals2. To disable this warning message, define BOOST_SIGNALS_NO_DEPRECATION_WARNING."
    ^
make[2]: Leaving directory '/tmp/B.f12ff3bb-6888-43c1-bd5e-f512ada18a27/BUILD/rstudio-0.99.39/build'
make[2]: Entering directory '/tmp/B.f12ff3bb-6888-43c1-bd5e-f512ada18a27/BUILD/rstudio-0.99.39/build'
/usr/bin/cmake -E cmake_progress_report /tmp/B.f12ff3bb-6888-43c1-bd5e-f512ada18a27/BUILD/rstudio-0.99.39/build/CMakeFiles 95
[ 45%] Building CXX object src/cpp/r/CMakeFiles/rstudio-r.dir/session/RConsoleActions.cpp.o
cd /tmp/B.f12ff3bb-6888-43c1-bd5e-f512ada18a27/BUILD/rstudio-0.99.39/build/src/cpp/r && /usr/bin/i486-pld-linux-g++   -DBOOST_ASIO_DISABLE_KQUEUE -DBOOST_ENABLE_ASSERT_HANDLER -D_FORTIFY_SOURCE=2 -O2 -fwrapv -pipe -Wformat -Werror=format-security -gdwarf-4 -fno-debug-types-section -fvar-tracking-assignments -g2 -Wp,-D_FORTIFY_SOURCE=2 -fstack-protector --param=ssp-buffer-size=4 -fomit-frame-pointer -march=i486 -fasynchronous-unwind-tables -gdwarf-4 -fno-debug-types-section -fvar-tracking-assignments -g2  -DNDEBUG -DQT_NO_DEBUG -I/tmp/B.f12ff3bb-6888-43c1-bd5e-f512ada18a27/BUILD/rstudio-0.99.39/src/cpp/r/include -I/tmp/B.f12ff3bb-6888-43c1-bd5e-f512ada18a27/BUILD/rstudio-0.99.39/build/src/cpp/r -I/tmp/B.f12ff3bb-6888-43c1-bd5e-f512ada18a27/BUILD/rstudio-0.99.39/src/cpp/core/include -I/usr/lib/R/include    -Wall -pthread -Wformat -Wformat-security -fstack-protector --param ssp-buffer-size=4 -pie -fPIE -o CMakeFiles/rstudio-r.dir/session/RConsoleActions.cpp.o -c /tmp/B.f12ff3bb-6888-43c1-bd5e-f512ada18a27/BUILD/rstudio-0.99.39/src/cpp/r/session/RConsoleActions.cpp
make[2]: Leaving directory '/tmp/B.f12ff3bb-6888-43c1-bd5e-f512ada18a27/BUILD/rstudio-0.99.39/build'
make[2]: Entering directory '/tmp/B.f12ff3bb-6888-43c1-bd5e-f512ada18a27/BUILD/rstudio-0.99.39/build'
/usr/bin/cmake -E cmake_progress_report /tmp/B.f12ff3bb-6888-43c1-bd5e-f512ada18a27/BUILD/rstudio-0.99.39/build/CMakeFiles 
[ 46%] Building CXX object src/cpp/r/CMakeFiles/rstudio-r.dir/session/RSession.cpp.o
cd /tmp/B.f12ff3bb-6888-43c1-bd5e-f512ada18a27/BUILD/rstudio-0.99.39/build/src/cpp/r && /usr/bin/i486-pld-linux-g++   -DBOOST_ASIO_DISABLE_KQUEUE -DBOOST_ENABLE_ASSERT_HANDLER -D_FORTIFY_SOURCE=2 -O2 -fwrapv -pipe -Wformat -Werror=format-security -gdwarf-4 -fno-debug-types-section -fvar-tracking-assignments -g2 -Wp,-D_FORTIFY_SOURCE=2 -fstack-protector --param=ssp-buffer-size=4 -fomit-frame-pointer -march=i486 -fasynchronous-unwind-tables -gdwarf-4 -fno-debug-types-section -fvar-tracking-assignments -g2  -DNDEBUG -DQT_NO_DEBUG -I/tmp/B.f12ff3bb-6888-43c1-bd5e-f512ada18a27/BUILD/rstudio-0.99.39/src/cpp/r/include -I/tmp/B.f12ff3bb-6888-43c1-bd5e-f512ada18a27/BUILD/rstudio-0.99.39/build/src/cpp/r -I/tmp/B.f12ff3bb-6888-43c1-bd5e-f512ada18a27/BUILD/rstudio-0.99.39/src/cpp/core/include -I/usr/lib/R/include    -Wall -pthread -Wformat -Wformat-security -fstack-protector --param ssp-buffer-size=4 -pie -fPIE -o CMakeFiles/rstudio-r.dir/session/RSession.cpp.o -c /tmp/B.f12ff3bb-6888-43c1-bd5e-f512ada18a27/BUILD/rstudio-0.99.39/src/cpp/r/session/RSession.cpp
In file included from /tmp/B.f12ff3bb-6888-43c1-bd5e-f512ada18a27/BUILD/rstudio-0.99.39/src/cpp/r/include/r/session/RConsoleHistory.hpp:23:0,
                 from /tmp/B.f12ff3bb-6888-43c1-bd5e-f512ada18a27/BUILD/rstudio-0.99.39/src/cpp/r/session/RSession.cpp:44:
/usr/include/boost/signal.hpp:17:4: warning: #warning "Boost.Signals is no longer being maintained and is now deprecated. Please switch to Boost.Signals2. To disable this warning message, define BOOST_SIGNALS_NO_DEPRECATION_WARNING." [-Wcpp]
 #  warning                  "Boost.Signals is no longer being maintained and is now deprecated. Please switch to Boost.Signals2. To disable this warning message, define BOOST_SIGNALS_NO_DEPRECATION_WARNING."
    ^
make[2]: Leaving directory '/tmp/B.f12ff3bb-6888-43c1-bd5e-f512ada18a27/BUILD/rstudio-0.99.39/build'
make[2]: Entering directory '/tmp/B.f12ff3bb-6888-43c1-bd5e-f512ada18a27/BUILD/rstudio-0.99.39/build'
/usr/bin/cmake -E cmake_progress_report /tmp/B.f12ff3bb-6888-43c1-bd5e-f512ada18a27/BUILD/rstudio-0.99.39/build/CMakeFiles 
[ 44%] Building CXX object src/cpp/r/CMakeFiles/rstudio-r.dir/session/RClientState.cpp.o
cd /tmp/B.f12ff3bb-6888-43c1-bd5e-f512ada18a27/BUILD/rstudio-0.99.39/build/src/cpp/r && /usr/bin/i486-pld-linux-g++   -DBOOST_ASIO_DISABLE_KQUEUE -DBOOST_ENABLE_ASSERT_HANDLER -D_FORTIFY_SOURCE=2 -O2 -fwrapv -pipe -Wformat -Werror=format-security -gdwarf-4 -fno-debug-types-section -fvar-tracking-assignments -g2 -Wp,-D_FORTIFY_SOURCE=2 -fstack-protector --param=ssp-buffer-size=4 -fomit-frame-pointer -march=i486 -fasynchronous-unwind-tables -gdwarf-4 -fno-debug-types-section -fvar-tracking-assignments -g2  -DNDEBUG -DQT_NO_DEBUG -I/tmp/B.f12ff3bb-6888-43c1-bd5e-f512ada18a27/BUILD/rstudio-0.99.39/src/cpp/r/include -I/tmp/B.f12ff3bb-6888-43c1-bd5e-f512ada18a27/BUILD/rstudio-0.99.39/build/src/cpp/r -I/tmp/B.f12ff3bb-6888-43c1-bd5e-f512ada18a27/BUILD/rstudio-0.99.39/src/cpp/core/include -I/usr/lib/R/include    -Wall -pthread -Wformat -Wformat-security -fstack-protector --param ssp-buffer-size=4 -pie -fPIE -o CMakeFiles/rstudio-r.dir/session/RClientState.cpp.o -c /tmp/B.f12ff3bb-6888-43c1-bd5e-f512ada18a27/BUILD/rstudio-0.99.39/src/cpp/r/session/RClientState.cpp
make[2]: Leaving directory '/tmp/B.f12ff3bb-6888-43c1-bd5e-f512ada18a27/BUILD/rstudio-0.99.39/build'
make[2]: Entering directory '/tmp/B.f12ff3bb-6888-43c1-bd5e-f512ada18a27/BUILD/rstudio-0.99.39/build'
/usr/bin/cmake -E cmake_progress_report /tmp/B.f12ff3bb-6888-43c1-bd5e-f512ada18a27/BUILD/rstudio-0.99.39/build/CMakeFiles 
[ 44%] Building CXX object src/cpp/r/CMakeFiles/rstudio-r.dir/session/RConsoleHistory.cpp.o
cd /tmp/B.f12ff3bb-6888-43c1-bd5e-f512ada18a27/BUILD/rstudio-0.99.39/build/src/cpp/r && /usr/bin/i486-pld-linux-g++   -DBOOST_ASIO_DISABLE_KQUEUE -DBOOST_ENABLE_ASSERT_HANDLER -D_FORTIFY_SOURCE=2 -O2 -fwrapv -pipe -Wformat -Werror=format-security -gdwarf-4 -fno-debug-types-section -fvar-tracking-assignments -g2 -Wp,-D_FORTIFY_SOURCE=2 -fstack-protector --param=ssp-buffer-size=4 -fomit-frame-pointer -march=i486 -fasynchronous-unwind-tables -gdwarf-4 -fno-debug-types-section -fvar-tracking-assignments -g2  -DNDEBUG -DQT_NO_DEBUG -I/tmp/B.f12ff3bb-6888-43c1-bd5e-f512ada18a27/BUILD/rstudio-0.99.39/src/cpp/r/include -I/tmp/B.f12ff3bb-6888-43c1-bd5e-f512ada18a27/BUILD/rstudio-0.99.39/build/src/cpp/r -I/tmp/B.f12ff3bb-6888-43c1-bd5e-f512ada18a27/BUILD/rstudio-0.99.39/src/cpp/core/include -I/usr/lib/R/include    -Wall -pthread -Wformat -Wformat-security -fstack-protector --param ssp-buffer-size=4 -pie -fPIE -o CMakeFiles/rstudio-r.dir/session/RConsoleHistory.cpp.o -c /tmp/B.f12ff3bb-6888-43c1-bd5e-f512ada18a27/BUILD/rstudio-0.99.39/src/cpp/r/session/RConsoleHistory.cpp
In file included from /tmp/B.f12ff3bb-6888-43c1-bd5e-f512ada18a27/BUILD/rstudio-0.99.39/src/cpp/r/include/r/session/RConsoleHistory.hpp:23:0,
                 from /tmp/B.f12ff3bb-6888-43c1-bd5e-f512ada18a27/BUILD/rstudio-0.99.39/src/cpp/r/session/RConsoleHistory.cpp:16:
/usr/include/boost/signal.hpp:17:4: warning: #warning "Boost.Signals is no longer being maintained and is now deprecated. Please switch to Boost.Signals2. To disable this warning message, define BOOST_SIGNALS_NO_DEPRECATION_WARNING." [-Wcpp]
 #  warning                  "Boost.Signals is no longer being maintained and is now deprecated. Please switch to Boost.Signals2. To disable this warning message, define BOOST_SIGNALS_NO_DEPRECATION_WARNING."
    ^
make[2]: Leaving directory '/tmp/B.f12ff3bb-6888-43c1-bd5e-f512ada18a27/BUILD/rstudio-0.99.39/build'
make[2]: Entering directory '/tmp/B.f12ff3bb-6888-43c1-bd5e-f512ada18a27/BUILD/rstudio-0.99.39/build'
/usr/bin/cmake -E cmake_progress_report /tmp/B.f12ff3bb-6888-43c1-bd5e-f512ada18a27/BUILD/rstudio-0.99.39/build/CMakeFiles 96
[ 46%] Building CXX object src/cpp/r/CMakeFiles/rstudio-r.dir/session/RSearchPath.cpp.o
cd /tmp/B.f12ff3bb-6888-43c1-bd5e-f512ada18a27/BUILD/rstudio-0.99.39/build/src/cpp/r && /usr/bin/i486-pld-linux-g++   -DBOOST_ASIO_DISABLE_KQUEUE -DBOOST_ENABLE_ASSERT_HANDLER -D_FORTIFY_SOURCE=2 -O2 -fwrapv -pipe -Wformat -Werror=format-security -gdwarf-4 -fno-debug-types-section -fvar-tracking-assignments -g2 -Wp,-D_FORTIFY_SOURCE=2 -fstack-protector --param=ssp-buffer-size=4 -fomit-frame-pointer -march=i486 -fasynchronous-unwind-tables -gdwarf-4 -fno-debug-types-section -fvar-tracking-assignments -g2  -DNDEBUG -DQT_NO_DEBUG -I/tmp/B.f12ff3bb-6888-43c1-bd5e-f512ada18a27/BUILD/rstudio-0.99.39/src/cpp/r/include -I/tmp/B.f12ff3bb-6888-43c1-bd5e-f512ada18a27/BUILD/rstudio-0.99.39/build/src/cpp/r -I/tmp/B.f12ff3bb-6888-43c1-bd5e-f512ada18a27/BUILD/rstudio-0.99.39/src/cpp/core/include -I/usr/lib/R/include    -Wall -pthread -Wformat -Wformat-security -fstack-protector --param ssp-buffer-size=4 -pie -fPIE -o CMakeFiles/rstudio-r.dir/session/RSearchPath.cpp.o -c /tmp/B.f12ff3bb-6888-43c1-bd5e-f512ada18a27/BUILD/rstudio-0.99.39/src/cpp/r/session/RSearchPath.cpp
make[2]: Leaving directory '/tmp/B.f12ff3bb-6888-43c1-bd5e-f512ada18a27/BUILD/rstudio-0.99.39/build'
make[2]: Entering directory '/tmp/B.f12ff3bb-6888-43c1-bd5e-f512ada18a27/BUILD/rstudio-0.99.39/build'
Linking CXX executable rpostback
cd /tmp/B.f12ff3bb-6888-43c1-bd5e-f512ada18a27/BUILD/rstudio-0.99.39/build/src/cpp/session/postback && /usr/bin/cmake -E cmake_link_script CMakeFiles/rpostback.dir/link.txt --verbose=1
/usr/bin/i486-pld-linux-g++   -O2 -fwrapv -pipe -Wformat -Werror=format-security -gdwarf-4 -fno-debug-types-section -fvar-tracking-assignments -g2 -Wp,-D_FORTIFY_SOURCE=2 -fstack-protector --param=ssp-buffer-size=4 -fomit-frame-pointer -march=i486 -fasynchronous-unwind-tables -gdwarf-4 -fno-debug-types-section -fvar-tracking-assignments -g2  -DNDEBUG -DQT_NO_DEBUG   -Wl,-z,relro,-z,now CMakeFiles/rpostback.dir/PostbackMain.cpp.o CMakeFiles/rpostback.dir/PostbackOptions.cpp.o  -o rpostback -rdynamic ../../core/librstudio-core.a -lboost_date_time -lboost_filesystem -lboost_iostreams -lboost_program_options -lboost_regex -lboost_signals -lboost_system -lboost_thread -lboost_chrono -lpthread -lutil -luuid -lrt -lz 
make[2]: Leaving directory '/tmp/B.f12ff3bb-6888-43c1-bd5e-f512ada18a27/BUILD/rstudio-0.99.39/build'
make[1]: Entering directory '/tmp/B.f12ff3bb-6888-43c1-bd5e-f512ada18a27/BUILD/rstudio-0.99.39/build'
/usr/bin/cmake -E cmake_progress_report /tmp/B.f12ff3bb-6888-43c1-bd5e-f512ada18a27/BUILD/rstudio-0.99.39/build/CMakeFiles  1
[ 48%] Built target rpostback
make[1]: Leaving directory '/tmp/B.f12ff3bb-6888-43c1-bd5e-f512ada18a27/BUILD/rstudio-0.99.39/build'
make[2]: Entering directory '/tmp/B.f12ff3bb-6888-43c1-bd5e-f512ada18a27/BUILD/rstudio-0.99.39/build'
/usr/bin/cmake -E cmake_progress_report /tmp/B.f12ff3bb-6888-43c1-bd5e-f512ada18a27/BUILD/rstudio-0.99.39/build/CMakeFiles 
[ 48%] Building CXX object src/cpp/r/CMakeFiles/rstudio-r.dir/session/graphics/RGraphicsDevDesc.cpp.o
cd /tmp/B.f12ff3bb-6888-43c1-bd5e-f512ada18a27/BUILD/rstudio-0.99.39/build/src/cpp/r && /usr/bin/i486-pld-linux-g++   -DBOOST_ASIO_DISABLE_KQUEUE -DBOOST_ENABLE_ASSERT_HANDLER -D_FORTIFY_SOURCE=2 -O2 -fwrapv -pipe -Wformat -Werror=format-security -gdwarf-4 -fno-debug-types-section -fvar-tracking-assignments -g2 -Wp,-D_FORTIFY_SOURCE=2 -fstack-protector --param=ssp-buffer-size=4 -fomit-frame-pointer -march=i486 -fasynchronous-unwind-tables -gdwarf-4 -fno-debug-types-section -fvar-tracking-assignments -g2  -DNDEBUG -DQT_NO_DEBUG -I/tmp/B.f12ff3bb-6888-43c1-bd5e-f512ada18a27/BUILD/rstudio-0.99.39/src/cpp/r/include -I/tmp/B.f12ff3bb-6888-43c1-bd5e-f512ada18a27/BUILD/rstudio-0.99.39/build/src/cpp/r -I/tmp/B.f12ff3bb-6888-43c1-bd5e-f512ada18a27/BUILD/rstudio-0.99.39/src/cpp/core/include -I/usr/lib/R/include    -Wall -pthread -Wformat -Wformat-security -fstack-protector --param ssp-buffer-size=4 -pie -fPIE -o CMakeFiles/rstudio-r.dir/session/graphics/RGraphicsDevDesc.cpp.o -c /tmp/B.f12ff3bb-6888-43c1-bd5e-f512ada18a27/BUILD/rstudio-0.99.39/src/cpp/r/session/graphics/RGraphicsDevDesc.cpp
make[2]: Leaving directory '/tmp/B.f12ff3bb-6888-43c1-bd5e-f512ada18a27/BUILD/rstudio-0.99.39/build'
make[2]: Entering directory '/tmp/B.f12ff3bb-6888-43c1-bd5e-f512ada18a27/BUILD/rstudio-0.99.39/build'
/usr/bin/cmake -E cmake_progress_report /tmp/B.f12ff3bb-6888-43c1-bd5e-f512ada18a27/BUILD/rstudio-0.99.39/build/CMakeFiles 99
[ 49%] Building CXX object src/cpp/r/CMakeFiles/rstudio-r.dir/session/graphics/RGraphicsHandler.cpp.o
cd /tmp/B.f12ff3bb-6888-43c1-bd5e-f512ada18a27/BUILD/rstudio-0.99.39/build/src/cpp/r && /usr/bin/i486-pld-linux-g++   -DBOOST_ASIO_DISABLE_KQUEUE -DBOOST_ENABLE_ASSERT_HANDLER -D_FORTIFY_SOURCE=2 -O2 -fwrapv -pipe -Wformat -Werror=format-security -gdwarf-4 -fno-debug-types-section -fvar-tracking-assignments -g2 -Wp,-D_FORTIFY_SOURCE=2 -fstack-protector --param=ssp-buffer-size=4 -fomit-frame-pointer -march=i486 -fasynchronous-unwind-tables -gdwarf-4 -fno-debug-types-section -fvar-tracking-assignments -g2  -DNDEBUG -DQT_NO_DEBUG -I/tmp/B.f12ff3bb-6888-43c1-bd5e-f512ada18a27/BUILD/rstudio-0.99.39/src/cpp/r/include -I/tmp/B.f12ff3bb-6888-43c1-bd5e-f512ada18a27/BUILD/rstudio-0.99.39/build/src/cpp/r -I/tmp/B.f12ff3bb-6888-43c1-bd5e-f512ada18a27/BUILD/rstudio-0.99.39/src/cpp/core/include -I/usr/lib/R/include    -Wall -pthread -Wformat -Wformat-security -fstack-protector --param ssp-buffer-size=4 -pie -fPIE -o CMakeFiles/rstudio-r.dir/session/graphics/RGraphicsHandler.cpp.o -c /tmp/B.f12ff3bb-6888-43c1-bd5e-f512ada18a27/BUILD/rstudio-0.99.39/src/cpp/r/session/graphics/RGraphicsHandler.cpp
make[2]: Leaving directory '/tmp/B.f12ff3bb-6888-43c1-bd5e-f512ada18a27/BUILD/rstudio-0.99.39/build'
make[2]: Entering directory '/tmp/B.f12ff3bb-6888-43c1-bd5e-f512ada18a27/BUILD/rstudio-0.99.39/build'
/usr/bin/cmake -E cmake_progress_report /tmp/B.f12ff3bb-6888-43c1-bd5e-f512ada18a27/BUILD/rstudio-0.99.39/build/CMakeFiles 97
[ 48%] Building CXX object src/cpp/r/CMakeFiles/rstudio-r.dir/session/graphics/RGraphicsErrorCategory.cpp.o
cd /tmp/B.f12ff3bb-6888-43c1-bd5e-f512ada18a27/BUILD/rstudio-0.99.39/build/src/cpp/r && /usr/bin/i486-pld-linux-g++   -DBOOST_ASIO_DISABLE_KQUEUE -DBOOST_ENABLE_ASSERT_HANDLER -D_FORTIFY_SOURCE=2 -O2 -fwrapv -pipe -Wformat -Werror=format-security -gdwarf-4 -fno-debug-types-section -fvar-tracking-assignments -g2 -Wp,-D_FORTIFY_SOURCE=2 -fstack-protector --param=ssp-buffer-size=4 -fomit-frame-pointer -march=i486 -fasynchronous-unwind-tables -gdwarf-4 -fno-debug-types-section -fvar-tracking-assignments -g2  -DNDEBUG -DQT_NO_DEBUG -I/tmp/B.f12ff3bb-6888-43c1-bd5e-f512ada18a27/BUILD/rstudio-0.99.39/src/cpp/r/include -I/tmp/B.f12ff3bb-6888-43c1-bd5e-f512ada18a27/BUILD/rstudio-0.99.39/build/src/cpp/r -I/tmp/B.f12ff3bb-6888-43c1-bd5e-f512ada18a27/BUILD/rstudio-0.99.39/src/cpp/core/include -I/usr/lib/R/include    -Wall -pthread -Wformat -Wformat-security -fstack-protector --param ssp-buffer-size=4 -pie -fPIE -o CMakeFiles/rstudio-r.dir/session/graphics/RGraphicsErrorCategory.cpp.o -c /tmp/B.f12ff3bb-6888-43c1-bd5e-f512ada18a27/BUILD/rstudio-0.99.39/src/cpp/r/session/graphics/RGraphicsErrorCategory.cpp
In file included from /tmp/B.f12ff3bb-6888-43c1-bd5e-f512ada18a27/BUILD/rstudio-0.99.39/src/cpp/r/include/r/session/RGraphics.hpp:57:0,
                 from /tmp/B.f12ff3bb-6888-43c1-bd5e-f512ada18a27/BUILD/rstudio-0.99.39/src/cpp/r/session/graphics/RGraphicsErrorCategory.cpp:16:
/usr/include/boost/signal.hpp:17:4: warning: #warning "Boost.Signals is no longer being maintained and is now deprecated. Please switch to Boost.Signals2. To disable this warning message, define BOOST_SIGNALS_NO_DEPRECATION_WARNING." [-Wcpp]
 #  warning                  "Boost.Signals is no longer being maintained and is now deprecated. Please switch to Boost.Signals2. To disable this warning message, define BOOST_SIGNALS_NO_DEPRECATION_WARNING."
    ^
make[2]: Leaving directory '/tmp/B.f12ff3bb-6888-43c1-bd5e-f512ada18a27/BUILD/rstudio-0.99.39/build'
make[2]: Entering directory '/tmp/B.f12ff3bb-6888-43c1-bd5e-f512ada18a27/BUILD/rstudio-0.99.39/build'
/usr/bin/cmake -E cmake_progress_report /tmp/B.f12ff3bb-6888-43c1-bd5e-f512ada18a27/BUILD/rstudio-0.99.39/build/CMakeFiles 
[ 49%] Building CXX object src/cpp/r/CMakeFiles/rstudio-r.dir/session/REmbeddedPosix.cpp.o
cd /tmp/B.f12ff3bb-6888-43c1-bd5e-f512ada18a27/BUILD/rstudio-0.99.39/build/src/cpp/r && /usr/bin/i486-pld-linux-g++   -DBOOST_ASIO_DISABLE_KQUEUE -DBOOST_ENABLE_ASSERT_HANDLER -D_FORTIFY_SOURCE=2 -O2 -fwrapv -pipe -Wformat -Werror=format-security -gdwarf-4 -fno-debug-types-section -fvar-tracking-assignments -g2 -Wp,-D_FORTIFY_SOURCE=2 -fstack-protector --param=ssp-buffer-size=4 -fomit-frame-pointer -march=i486 -fasynchronous-unwind-tables -gdwarf-4 -fno-debug-types-section -fvar-tracking-assignments -g2  -DNDEBUG -DQT_NO_DEBUG -I/tmp/B.f12ff3bb-6888-43c1-bd5e-f512ada18a27/BUILD/rstudio-0.99.39/src/cpp/r/include -I/tmp/B.f12ff3bb-6888-43c1-bd5e-f512ada18a27/BUILD/rstudio-0.99.39/build/src/cpp/r -I/tmp/B.f12ff3bb-6888-43c1-bd5e-f512ada18a27/BUILD/rstudio-0.99.39/src/cpp/core/include -I/usr/lib/R/include    -Wall -pthread -Wformat -Wformat-security -fstack-protector --param ssp-buffer-size=4 -pie -fPIE -o CMakeFiles/rstudio-r.dir/session/REmbeddedPosix.cpp.o -c /tmp/B.f12ff3bb-6888-43c1-bd5e-f512ada18a27/BUILD/rstudio-0.99.39/src/cpp/r/session/REmbeddedPosix.cpp
make[2]: Leaving directory '/tmp/B.f12ff3bb-6888-43c1-bd5e-f512ada18a27/BUILD/rstudio-0.99.39/build'
make[2]: Entering directory '/tmp/B.f12ff3bb-6888-43c1-bd5e-f512ada18a27/BUILD/rstudio-0.99.39/build'
/usr/bin/cmake -E cmake_progress_report /tmp/B.f12ff3bb-6888-43c1-bd5e-f512ada18a27/BUILD/rstudio-0.99.39/build/CMakeFiles 
[ 47%] Building CXX object src/cpp/r/CMakeFiles/rstudio-r.dir/session/graphics/RGraphicsUtils.cpp.o
cd /tmp/B.f12ff3bb-6888-43c1-bd5e-f512ada18a27/BUILD/rstudio-0.99.39/build/src/cpp/r && /usr/bin/i486-pld-linux-g++   -DBOOST_ASIO_DISABLE_KQUEUE -DBOOST_ENABLE_ASSERT_HANDLER -D_FORTIFY_SOURCE=2 -O2 -fwrapv -pipe -Wformat -Werror=format-security -gdwarf-4 -fno-debug-types-section -fvar-tracking-assignments -g2 -Wp,-D_FORTIFY_SOURCE=2 -fstack-protector --param=ssp-buffer-size=4 -fomit-frame-pointer -march=i486 -fasynchronous-unwind-tables -gdwarf-4 -fno-debug-types-section -fvar-tracking-assignments -g2  -DNDEBUG -DQT_NO_DEBUG -I/tmp/B.f12ff3bb-6888-43c1-bd5e-f512ada18a27/BUILD/rstudio-0.99.39/src/cpp/r/include -I/tmp/B.f12ff3bb-6888-43c1-bd5e-f512ada18a27/BUILD/rstudio-0.99.39/build/src/cpp/r -I/tmp/B.f12ff3bb-6888-43c1-bd5e-f512ada18a27/BUILD/rstudio-0.99.39/src/cpp/core/include -I/usr/lib/R/include    -Wall -pthread -Wformat -Wformat-security -fstack-protector --param ssp-buffer-size=4 -pie -fPIE -o CMakeFiles/rstudio-r.dir/session/graphics/RGraphicsUtils.cpp.o -c /tmp/B.f12ff3bb-6888-43c1-bd5e-f512ada18a27/BUILD/rstudio-0.99.39/src/cpp/r/session/graphics/RGraphicsUtils.cpp
make[2]: Leaving directory '/tmp/B.f12ff3bb-6888-43c1-bd5e-f512ada18a27/BUILD/rstudio-0.99.39/build'
make[2]: Entering directory '/tmp/B.f12ff3bb-6888-43c1-bd5e-f512ada18a27/BUILD/rstudio-0.99.39/build'
/usr/bin/cmake -E cmake_progress_report /tmp/B.f12ff3bb-6888-43c1-bd5e-f512ada18a27/BUILD/rstudio-0.99.39/build/CMakeFiles 
[ 49%] Building CXX object src/cpp/r/CMakeFiles/rstudio-r.dir/session/graphics/RShadowPngGraphicsHandler.cpp.o
cd /tmp/B.f12ff3bb-6888-43c1-bd5e-f512ada18a27/BUILD/rstudio-0.99.39/build/src/cpp/r && /usr/bin/i486-pld-linux-g++   -DBOOST_ASIO_DISABLE_KQUEUE -DBOOST_ENABLE_ASSERT_HANDLER -D_FORTIFY_SOURCE=2 -O2 -fwrapv -pipe -Wformat -Werror=format-security -gdwarf-4 -fno-debug-types-section -fvar-tracking-assignments -g2 -Wp,-D_FORTIFY_SOURCE=2 -fstack-protector --param=ssp-buffer-size=4 -fomit-frame-pointer -march=i486 -fasynchronous-unwind-tables -gdwarf-4 -fno-debug-types-section -fvar-tracking-assignments -g2  -DNDEBUG -DQT_NO_DEBUG -I/tmp/B.f12ff3bb-6888-43c1-bd5e-f512ada18a27/BUILD/rstudio-0.99.39/src/cpp/r/include -I/tmp/B.f12ff3bb-6888-43c1-bd5e-f512ada18a27/BUILD/rstudio-0.99.39/build/src/cpp/r -I/tmp/B.f12ff3bb-6888-43c1-bd5e-f512ada18a27/BUILD/rstudio-0.99.39/src/cpp/core/include -I/usr/lib/R/include    -Wall -pthread -Wformat -Wformat-security -fstack-protector --param ssp-buffer-size=4 -pie -fPIE -o CMakeFiles/rstudio-r.dir/session/graphics/RShadowPngGraphicsHandler.cpp.o -c /tmp/B.f12ff3bb-6888-43c1-bd5e-f512ada18a27/BUILD/rstudio-0.99.39/src/cpp/r/session/graphics/RShadowPngGraphicsHandler.cpp
make[2]: Leaving directory '/tmp/B.f12ff3bb-6888-43c1-bd5e-f512ada18a27/BUILD/rstudio-0.99.39/build'
make[2]: Entering directory '/tmp/B.f12ff3bb-6888-43c1-bd5e-f512ada18a27/BUILD/rstudio-0.99.39/build'
/usr/bin/cmake -E cmake_progress_report /tmp/B.f12ff3bb-6888-43c1-bd5e-f512ada18a27/BUILD/rstudio-0.99.39/build/CMakeFiles 
[ 48%] Building CXX object src/cpp/r/CMakeFiles/rstudio-r.dir/session/graphics/RGraphicsPlot.cpp.o
cd /tmp/B.f12ff3bb-6888-43c1-bd5e-f512ada18a27/BUILD/rstudio-0.99.39/build/src/cpp/r && /usr/bin/i486-pld-linux-g++   -DBOOST_ASIO_DISABLE_KQUEUE -DBOOST_ENABLE_ASSERT_HANDLER -D_FORTIFY_SOURCE=2 -O2 -fwrapv -pipe -Wformat -Werror=format-security -gdwarf-4 -fno-debug-types-section -fvar-tracking-assignments -g2 -Wp,-D_FORTIFY_SOURCE=2 -fstack-protector --param=ssp-buffer-size=4 -fomit-frame-pointer -march=i486 -fasynchronous-unwind-tables -gdwarf-4 -fno-debug-types-section -fvar-tracking-assignments -g2  -DNDEBUG -DQT_NO_DEBUG -I/tmp/B.f12ff3bb-6888-43c1-bd5e-f512ada18a27/BUILD/rstudio-0.99.39/src/cpp/r/include -I/tmp/B.f12ff3bb-6888-43c1-bd5e-f512ada18a27/BUILD/rstudio-0.99.39/build/src/cpp/r -I/tmp/B.f12ff3bb-6888-43c1-bd5e-f512ada18a27/BUILD/rstudio-0.99.39/src/cpp/core/include -I/usr/lib/R/include    -Wall -pthread -Wformat -Wformat-security -fstack-protector --param ssp-buffer-size=4 -pie -fPIE -o CMakeFiles/rstudio-r.dir/session/graphics/RGraphicsPlot.cpp.o -c /tmp/B.f12ff3bb-6888-43c1-bd5e-f512ada18a27/BUILD/rstudio-0.99.39/src/cpp/r/session/graphics/RGraphicsPlot.cpp
In file included from /tmp/B.f12ff3bb-6888-43c1-bd5e-f512ada18a27/BUILD/rstudio-0.99.39/src/cpp/r/include/r/session/RGraphics.hpp:57:0,
                 from /tmp/B.f12ff3bb-6888-43c1-bd5e-f512ada18a27/BUILD/rstudio-0.99.39/src/cpp/r/session/graphics/RGraphicsPlot.cpp:29:
/usr/include/boost/signal.hpp:17:4: warning: #warning "Boost.Signals is no longer being maintained and is now deprecated. Please switch to Boost.Signals2. To disable this warning message, define BOOST_SIGNALS_NO_DEPRECATION_WARNING." [-Wcpp]
 #  warning                  "Boost.Signals is no longer being maintained and is now deprecated. Please switch to Boost.Signals2. To disable this warning message, define BOOST_SIGNALS_NO_DEPRECATION_WARNING."
    ^
make[2]: Leaving directory '/tmp/B.f12ff3bb-6888-43c1-bd5e-f512ada18a27/BUILD/rstudio-0.99.39/build'
make[2]: Entering directory '/tmp/B.f12ff3bb-6888-43c1-bd5e-f512ada18a27/BUILD/rstudio-0.99.39/build'
/usr/bin/cmake -E cmake_progress_report /tmp/B.f12ff3bb-6888-43c1-bd5e-f512ada18a27/BUILD/rstudio-0.99.39/build/CMakeFiles 
[ 46%] Building CXX object src/cpp/r/CMakeFiles/rstudio-r.dir/session/RSessionState.cpp.o
cd /tmp/B.f12ff3bb-6888-43c1-bd5e-f512ada18a27/BUILD/rstudio-0.99.39/build/src/cpp/r && /usr/bin/i486-pld-linux-g++   -DBOOST_ASIO_DISABLE_KQUEUE -DBOOST_ENABLE_ASSERT_HANDLER -D_FORTIFY_SOURCE=2 -O2 -fwrapv -pipe -Wformat -Werror=format-security -gdwarf-4 -fno-debug-types-section -fvar-tracking-assignments -g2 -Wp,-D_FORTIFY_SOURCE=2 -fstack-protector --param=ssp-buffer-size=4 -fomit-frame-pointer -march=i486 -fasynchronous-unwind-tables -gdwarf-4 -fno-debug-types-section -fvar-tracking-assignments -g2  -DNDEBUG -DQT_NO_DEBUG -I/tmp/B.f12ff3bb-6888-43c1-bd5e-f512ada18a27/BUILD/rstudio-0.99.39/src/cpp/r/include -I/tmp/B.f12ff3bb-6888-43c1-bd5e-f512ada18a27/BUILD/rstudio-0.99.39/build/src/cpp/r -I/tmp/B.f12ff3bb-6888-43c1-bd5e-f512ada18a27/BUILD/rstudio-0.99.39/src/cpp/core/include -I/usr/lib/R/include    -Wall -pthread -Wformat -Wformat-security -fstack-protector --param ssp-buffer-size=4 -pie -fPIE -o CMakeFiles/rstudio-r.dir/session/RSessionState.cpp.o -c /tmp/B.f12ff3bb-6888-43c1-bd5e-f512ada18a27/BUILD/rstudio-0.99.39/src/cpp/r/session/RSessionState.cpp
In file included from /tmp/B.f12ff3bb-6888-43c1-bd5e-f512ada18a27/BUILD/rstudio-0.99.39/src/cpp/r/include/r/session/RConsoleHistory.hpp:23:0,
                 from /tmp/B.f12ff3bb-6888-43c1-bd5e-f512ada18a27/BUILD/rstudio-0.99.39/src/cpp/r/session/RSessionState.cpp:35:
/usr/include/boost/signal.hpp:17:4: warning: #warning "Boost.Signals is no longer being maintained and is now deprecated. Please switch to Boost.Signals2. To disable this warning message, define BOOST_SIGNALS_NO_DEPRECATION_WARNING." [-Wcpp]
 #  warning                  "Boost.Signals is no longer being maintained and is now deprecated. Please switch to Boost.Signals2. To disable this warning message, define BOOST_SIGNALS_NO_DEPRECATION_WARNING."
    ^
make[2]: Leaving directory '/tmp/B.f12ff3bb-6888-43c1-bd5e-f512ada18a27/BUILD/rstudio-0.99.39/build'
make[2]: Entering directory '/tmp/B.f12ff3bb-6888-43c1-bd5e-f512ada18a27/BUILD/rstudio-0.99.39/build'
/usr/bin/cmake -E cmake_progress_report /tmp/B.f12ff3bb-6888-43c1-bd5e-f512ada18a27/BUILD/rstudio-0.99.39/build/CMakeFiles 
[ 48%] Building CXX object src/cpp/r/CMakeFiles/rstudio-r.dir/session/graphics/RGraphicsPlotManipulator.cpp.o
cd /tmp/B.f12ff3bb-6888-43c1-bd5e-f512ada18a27/BUILD/rstudio-0.99.39/build/src/cpp/r && /usr/bin/i486-pld-linux-g++   -DBOOST_ASIO_DISABLE_KQUEUE -DBOOST_ENABLE_ASSERT_HANDLER -D_FORTIFY_SOURCE=2 -O2 -fwrapv -pipe -Wformat -Werror=format-security -gdwarf-4 -fno-debug-types-section -fvar-tracking-assignments -g2 -Wp,-D_FORTIFY_SOURCE=2 -fstack-protector --param=ssp-buffer-size=4 -fomit-frame-pointer -march=i486 -fasynchronous-unwind-tables -gdwarf-4 -fno-debug-types-section -fvar-tracking-assignments -g2  -DNDEBUG -DQT_NO_DEBUG -I/tmp/B.f12ff3bb-6888-43c1-bd5e-f512ada18a27/BUILD/rstudio-0.99.39/src/cpp/r/include -I/tmp/B.f12ff3bb-6888-43c1-bd5e-f512ada18a27/BUILD/rstudio-0.99.39/build/src/cpp/r -I/tmp/B.f12ff3bb-6888-43c1-bd5e-f512ada18a27/BUILD/rstudio-0.99.39/src/cpp/core/include -I/usr/lib/R/include    -Wall -pthread -Wformat -Wformat-security -fstack-protector --param ssp-buffer-size=4 -pie -fPIE -o CMakeFiles/rstudio-r.dir/session/graphics/RGraphicsPlotManipulator.cpp.o -c /tmp/B.f12ff3bb-6888-43c1-bd5e-f512ada18a27/BUILD/rstudio-0.99.39/src/cpp/r/session/graphics/RGraphicsPlotManipulator.cpp
make[2]: Leaving directory '/tmp/B.f12ff3bb-6888-43c1-bd5e-f512ada18a27/BUILD/rstudio-0.99.39/build'
make[2]: Entering directory '/tmp/B.f12ff3bb-6888-43c1-bd5e-f512ada18a27/BUILD/rstudio-0.99.39/build'
/usr/bin/cmake -E cmake_progress_report /tmp/B.f12ff3bb-6888-43c1-bd5e-f512ada18a27/BUILD/rstudio-0.99.39/build/CMakeFiles 98
[ 47%] Building CXX object src/cpp/r/CMakeFiles/rstudio-r.dir/session/graphics/RGraphicsPlotManipulatorManager.cpp.o
cd /tmp/B.f12ff3bb-6888-43c1-bd5e-f512ada18a27/BUILD/rstudio-0.99.39/build/src/cpp/r && /usr/bin/i486-pld-linux-g++   -DBOOST_ASIO_DISABLE_KQUEUE -DBOOST_ENABLE_ASSERT_HANDLER -D_FORTIFY_SOURCE=2 -O2 -fwrapv -pipe -Wformat -Werror=format-security -gdwarf-4 -fno-debug-types-section -fvar-tracking-assignments -g2 -Wp,-D_FORTIFY_SOURCE=2 -fstack-protector --param=ssp-buffer-size=4 -fomit-frame-pointer -march=i486 -fasynchronous-unwind-tables -gdwarf-4 -fno-debug-types-section -fvar-tracking-assignments -g2  -DNDEBUG -DQT_NO_DEBUG -I/tmp/B.f12ff3bb-6888-43c1-bd5e-f512ada18a27/BUILD/rstudio-0.99.39/src/cpp/r/include -I/tmp/B.f12ff3bb-6888-43c1-bd5e-f512ada18a27/BUILD/rstudio-0.99.39/build/src/cpp/r -I/tmp/B.f12ff3bb-6888-43c1-bd5e-f512ada18a27/BUILD/rstudio-0.99.39/src/cpp/core/include -I/usr/lib/R/include    -Wall -pthread -Wformat -Wformat-security -fstack-protector --param ssp-buffer-size=4 -pie -fPIE -o CMakeFiles/rstudio-r.dir/session/graphics/RGraphicsPlotManipulatorManager.cpp.o -c /tmp/B.f12ff3bb-6888-43c1-bd5e-f512ada18a27/BUILD/rstudio-0.99.39/src/cpp/r/session/graphics/RGraphicsPlotManipulatorManager.cpp
In file included from /tmp/B.f12ff3bb-6888-43c1-bd5e-f512ada18a27/BUILD/rstudio-0.99.39/src/cpp/r/session/graphics/RGraphicsPlotManipulatorManager.hpp:19:0,
                 from /tmp/B.f12ff3bb-6888-43c1-bd5e-f512ada18a27/BUILD/rstudio-0.99.39/src/cpp/r/session/graphics/RGraphicsPlotManipulatorManager.cpp:16:
/usr/include/boost/signal.hpp:17:4: warning: #warning "Boost.Signals is no longer being maintained and is now deprecated. Please switch to Boost.Signals2. To disable this warning message, define BOOST_SIGNALS_NO_DEPRECATION_WARNING." [-Wcpp]
 #  warning                  "Boost.Signals is no longer being maintained and is now deprecated. Please switch to Boost.Signals2. To disable this warning message, define BOOST_SIGNALS_NO_DEPRECATION_WARNING."
    ^
make[2]: Leaving directory '/tmp/B.f12ff3bb-6888-43c1-bd5e-f512ada18a27/BUILD/rstudio-0.99.39/build'
make[2]: Entering directory '/tmp/B.f12ff3bb-6888-43c1-bd5e-f512ada18a27/BUILD/rstudio-0.99.39/build'
/usr/bin/cmake -E cmake_progress_report /tmp/B.f12ff3bb-6888-43c1-bd5e-f512ada18a27/BUILD/rstudio-0.99.39/build/CMakeFiles 
[ 48%] Building CXX object src/cpp/r/CMakeFiles/rstudio-r.dir/session/graphics/RGraphicsPlotManager.cpp.o
cd /tmp/B.f12ff3bb-6888-43c1-bd5e-f512ada18a27/BUILD/rstudio-0.99.39/build/src/cpp/r && /usr/bin/i486-pld-linux-g++   -DBOOST_ASIO_DISABLE_KQUEUE -DBOOST_ENABLE_ASSERT_HANDLER -D_FORTIFY_SOURCE=2 -O2 -fwrapv -pipe -Wformat -Werror=format-security -gdwarf-4 -fno-debug-types-section -fvar-tracking-assignments -g2 -Wp,-D_FORTIFY_SOURCE=2 -fstack-protector --param=ssp-buffer-size=4 -fomit-frame-pointer -march=i486 -fasynchronous-unwind-tables -gdwarf-4 -fno-debug-types-section -fvar-tracking-assignments -g2  -DNDEBUG -DQT_NO_DEBUG -I/tmp/B.f12ff3bb-6888-43c1-bd5e-f512ada18a27/BUILD/rstudio-0.99.39/src/cpp/r/include -I/tmp/B.f12ff3bb-6888-43c1-bd5e-f512ada18a27/BUILD/rstudio-0.99.39/build/src/cpp/r -I/tmp/B.f12ff3bb-6888-43c1-bd5e-f512ada18a27/BUILD/rstudio-0.99.39/src/cpp/core/include -I/usr/lib/R/include    -Wall -pthread -Wformat -Wformat-security -fstack-protector --param ssp-buffer-size=4 -pie -fPIE -o CMakeFiles/rstudio-r.dir/session/graphics/RGraphicsPlotManager.cpp.o -c /tmp/B.f12ff3bb-6888-43c1-bd5e-f512ada18a27/BUILD/rstudio-0.99.39/src/cpp/r/session/graphics/RGraphicsPlotManager.cpp
In file included from /tmp/B.f12ff3bb-6888-43c1-bd5e-f512ada18a27/BUILD/rstudio-0.99.39/src/cpp/r/session/graphics/RGraphicsPlotManager.hpp:25:0,
                 from /tmp/B.f12ff3bb-6888-43c1-bd5e-f512ada18a27/BUILD/rstudio-0.99.39/src/cpp/r/session/graphics/RGraphicsPlotManager.cpp:16:
/usr/include/boost/signal.hpp:17:4: warning: #warning "Boost.Signals is no longer being maintained and is now deprecated. Please switch to Boost.Signals2. To disable this warning message, define BOOST_SIGNALS_NO_DEPRECATION_WARNING." [-Wcpp]
 #  warning                  "Boost.Signals is no longer being maintained and is now deprecated. Please switch to Boost.Signals2. To disable this warning message, define BOOST_SIGNALS_NO_DEPRECATION_WARNING."
    ^
make[2]: Leaving directory '/tmp/B.f12ff3bb-6888-43c1-bd5e-f512ada18a27/BUILD/rstudio-0.99.39/build'
make[2]: Entering directory '/tmp/B.f12ff3bb-6888-43c1-bd5e-f512ada18a27/BUILD/rstudio-0.99.39/build'
Linking CXX static library librstudio-r.a
cd /tmp/B.f12ff3bb-6888-43c1-bd5e-f512ada18a27/BUILD/rstudio-0.99.39/build/src/cpp/r && /usr/bin/cmake -P CMakeFiles/rstudio-r.dir/cmake_clean_target.cmake
cd /tmp/B.f12ff3bb-6888-43c1-bd5e-f512ada18a27/BUILD/rstudio-0.99.39/build/src/cpp/r && /usr/bin/cmake -E cmake_link_script CMakeFiles/rstudio-r.dir/link.txt --verbose=1
/usr/bin/ar cq librstudio-r.a  CMakeFiles/rstudio-r.dir/RErrorCategory.cpp.o CMakeFiles/rstudio-r.dir/RExec.cpp.o CMakeFiles/rstudio-r.dir/RFunctionHook.cpp.o CMakeFiles/rstudio-r.dir/RJson.cpp.o CMakeFiles/rstudio-r.dir/RJsonRpc.cpp.o CMakeFiles/rstudio-r.dir/ROptions.cpp.o CMakeFiles/rstudio-r.dir/RRoutines.cpp.o CMakeFiles/rstudio-r.dir/RSexp.cpp.o CMakeFiles/rstudio-r.dir/RSourceManager.cpp.o CMakeFiles/rstudio-r.dir/RUtil.cpp.o CMakeFiles/rstudio-r.dir/session/RClientMetrics.cpp.o CMakeFiles/rstudio-r.dir/session/RClientState.cpp.o CMakeFiles/rstudio-r.dir/session/RConsoleActions.cpp.o CMakeFiles/rstudio-r.dir/session/RConsoleHistory.cpp.o CMakeFiles/rstudio-r.dir/session/RDiscovery.cpp.o CMakeFiles/rstudio-r.dir/session/RRestartContext.cpp.o CMakeFiles/rstudio-r.dir/session/RSearchPath.cpp.o CMakeFiles/rstudio-r.dir/session/RSessionState.cpp.o CMakeFiles/rstudio-r.dir/session/RSession.cpp.o CMakeFiles/rstudio-r.dir/session/graphics/RGraphicsDevice.cpp.o CMakeFiles/rstudio-r.dir/session/graphics/RGraphicsErrorCategory.cpp.o CMakeFiles/rstudio-r.dir/session/graphics/RGraphicsPlot.cpp.o CMakeFiles/rstudio-r.dir/session/graphics/RGraphicsPlotManipulator.cpp.o CMakeFiles/rstudio-r.dir/session/graphics/RGraphicsPlotManipulatorManager.cpp.o CMakeFiles/rstudio-r.dir/session/graphics/RGraphicsPlotManager.cpp.o CMakeFiles/rstudio-r.dir/session/graphics/RGraphicsUtils.cpp.o CMakeFiles/rstudio-r.dir/session/graphics/RGraphicsDevDesc.cpp.o CMakeFiles/rstudio-r.dir/session/graphics/RGraphicsHandler.cpp.o CMakeFiles/rstudio-r.dir/session/graphics/RShadowPngGraphicsHandler.cpp.o CMakeFiles/rstudio-r.dir/session/REmbeddedPosix.cpp.o
/usr/bin/ranlib librstudio-r.a
make[2]: Leaving directory '/tmp/B.f12ff3bb-6888-43c1-bd5e-f512ada18a27/BUILD/rstudio-0.99.39/build'
make[1]: Entering directory '/tmp/B.f12ff3bb-6888-43c1-bd5e-f512ada18a27/BUILD/rstudio-0.99.39/build'
/usr/bin/cmake -E cmake_progress_report /tmp/B.f12ff3bb-6888-43c1-bd5e-f512ada18a27/BUILD/rstudio-0.99.39/build/CMakeFiles  92 93 94 95 96 97 98 99
[ 49%] Built target rstudio-r
make[1]: Leaving directory '/tmp/B.f12ff3bb-6888-43c1-bd5e-f512ada18a27/BUILD/rstudio-0.99.39/build'
make[2]: Entering directory '/tmp/B.f12ff3bb-6888-43c1-bd5e-f512ada18a27/BUILD/rstudio-0.99.39/build'
cd /tmp/B.f12ff3bb-6888-43c1-bd5e-f512ada18a27/BUILD/rstudio-0.99.39/src/gwt && ant
Buildfile: /tmp/B.f12ff3bb-6888-43c1-bd5e-f512ada18a27/BUILD/rstudio-0.99.39/src/gwt/build.xml

ext:
   [jscomp] Compiling 49 file(s) with 41 extern(s)
   [jscomp] 0 error(s), 0 warning(s)

javac:
    [mkdir] Created dir: /tmp/B.f12ff3bb-6888-43c1-bd5e-f512ada18a27/BUILD/rstudio-0.99.39/src/gwt/bin
    [javac] Compiling 10 source files to /tmp/B.f12ff3bb-6888-43c1-bd5e-f512ada18a27/BUILD/rstudio-0.99.39/src/gwt/bin
    [javac] Note: Some input files use or override a deprecated API.
    [javac] Note: Recompile with -Xlint:deprecation for details.
    [javac] Compiling 1486 source files to /tmp/B.f12ff3bb-6888-43c1-bd5e-f512ada18a27/BUILD/rstudio-0.99.39/src/gwt/bin
     [copy] Copying 699 files to /tmp/B.f12ff3bb-6888-43c1-bd5e-f512ada18a27/BUILD/rstudio-0.99.39/src/gwt/bin

gwtc:
     [java] Compiling module org.rstudio.studio.RStudio
     [java]    Compiling 2 permutations
     [java]       Compiling permutation 1...
     [java]       Process output
     [java]          Compiling
     [java]             Compiling permutation 0...
     [java]    Compile of permutations succeeded
     [java] Linking into /tmp/B.f12ff3bb-6888-43c1-bd5e-f512ada18a27/BUILD/rstudio-0.99.39/src/gwt/www/rstudio; Writing extras to /tmp/B.f12ff3bb-6888-43c1-bd5e-f512ada18a27/BUILD/rstudio-0.99.39/src/gwt/extras/rstudio
     [java]    Link succeeded
     [java]    Compilation succeeded -- 568.033s

build:

BUILD SUCCESSFUL
Total time: 14 minutes 56 seconds
make[2]: Leaving directory '/tmp/B.f12ff3bb-6888-43c1-bd5e-f512ada18a27/BUILD/rstudio-0.99.39/build'
make[1]: Entering directory '/tmp/B.f12ff3bb-6888-43c1-bd5e-f512ada18a27/BUILD/rstudio-0.99.39/build'
/usr/bin/cmake -E cmake_progress_report /tmp/B.f12ff3bb-6888-43c1-bd5e-f512ada18a27/BUILD/rstudio-0.99.39/build/CMakeFiles 
[ 49%] Built target gwt_build
make[1]: Leaving directory '/tmp/B.f12ff3bb-6888-43c1-bd5e-f512ada18a27/BUILD/rstudio-0.99.39/build'
Makefile:140: recipe for target 'all' failed
make: *** [all] Error 2
error: Bad exit status from /tmp/B.f12ff3bb-6888-43c1-bd5e-f512ada18a27/BUILD/tmp/rpm-tmp.38317 (%build)


RPM build errors:
    Bad exit status from /tmp/B.f12ff3bb-6888-43c1-bd5e-f512ada18a27/BUILD/tmp/rpm-tmp.38317 (%build)
ended at: Wed Feb 18 01:09:47 2015, done in 0:15:37.987304
error: No files produced.
+ chmod -R u+rwX /tmp/B.f12ff3bb-6888-43c1-bd5e-f512ada18a27/BUILD
+ rm -rf /tmp/B.f12ff3bb-6888-43c1-bd5e-f512ada18a27/tmp /tmp/B.f12ff3bb-6888-43c1-bd5e-f512ada18a27/BUILD
+ rm -rf /tmp/B.f12ff3bb-6888-43c1-bd5e-f512ada18a27
Begin-PLD-Builder-Info
Build-Time: user:1771.64s sys:328.52s real:959.61s (faults io:173608 non-io:11130122)

End-PLD-Builder-Info
[Back to list of logs] [View rpm -qa of builder]