FailedOk

th/SRPMS[OK]
th/x32[OK]
th/i686[OK]
th/x86_64[OK]

ac/SRPMS[OK]
ac/i386[OK]
ac/i586[OK]
ac/i686[OK]
ac/alpha[OK]
ac/amd64[OK]
ac/athlon[OK]
ac/ppc[OK]
ac/sparc[OK]
ac/sparc64[OK]

Advanced Search
main()
Powered by PLD Linux
(c) 2002-2022 PLD Team
$Revision: 1.37 $
Powered by ufo.
Your IP: 52.203.18.65

cups-filters a370d466-09aa-42f8-9483-2b4804246e9b

Status:Failed
Source URL:https://buildlogs.pld-linux.org/pld/th/i486/FAIL/cups-filters,a370d466-09aa-42f8-9483-2b4804246e9b.bz2
text/plain URL:View!
rpm -qa of builder:View!
Date:2014/04/28 13:49:32
Runtime:0:00:26.540643

Toc:

  • prep
  • Executing(%prep): /bin/sh -e /tmp/B.5f7a4b71-2252-48e9-9e4e-2f2de3091f6f/BUILD/tmp/rpm-tmp.25788
  • build
  • Executing(%build): /bin/sh -e /tmp/B.5f7a4b71-2252-48e9-9e4e-2f2de3091f6f/BUILD/tmp/rpm-tmp.25788
  • error 1
  • werror: no
  • error 2
  • scripting/php/phpcups.c:47:1: error: unknown type name 'function_entry'
  • error 3
  • Makefile:2525: recipe for target 'libphpcups_la-phpcups.lo' failed
  • error 4
  • make[1]: *** [libphpcups_la-phpcups.lo] Error 1
  • error 5
  • Makefile:1613: recipe for target 'all' failed
  • error 6
  • error: Bad exit status from /tmp/B.5f7a4b71-2252-48e9-9e4e-2f2de3091f6f/BUILD/tmp/rpm-tmp.25788 (%build)
  • error 7
  • RPM build errors:
  • error 8
  • error: No files produced.

Content:

request from: glen
checking if we should skip the build
started at: Mon Apr 28 13:48:59 2014
fetching http://src.th.pld-linux.org//srpms/a370d466-09aa-42f8-9483-2b4804246e9b/cups-filters-1.0.47-1.src.rpm
fetched 1333689 bytes, 3386.4 K/s
installing srpm: cups-filters-1.0.47-1.src.rpm
+ install -d /tmp/B.5f7a4b71-2252-48e9-9e4e-2f2de3091f6f/BUILD /tmp/B.5f7a4b71-2252-48e9-9e4e-2f2de3091f6f/RPMS
+ rpm -Uhv --nodeps --define '_topdir /tmp/B.5f7a4b71-2252-48e9-9e4e-2f2de3091f6f' --define '_specdir %{_topdir}' --define '_sourcedir %{_specdir}' --define '_rpmdir %{_topdir}/RPMS' --define '_builddir %{_topdir}/BUILD' cups-filters-1.0.47-1.src.rpm
Preparing...                ##################################################
cups-filters                ##################################################
+ rm -f cups-filters-1.0.47-1.src.rpm
+ install -m 700 -d /tmp/B.5f7a4b71-2252-48e9-9e4e-2f2de3091f6f/BUILD/tmp
+ TMPDIR=/tmp/B.5f7a4b71-2252-48e9-9e4e-2f2de3091f6f/BUILD/tmp
+ exec nice -n 0 rpmbuild -bp --short-circuit --nodeps --define '_topdir /tmp/B.5f7a4b71-2252-48e9-9e4e-2f2de3091f6f' --define '_specdir %{_topdir}' --define '_sourcedir %{_specdir}' --define '_rpmdir %{_topdir}/RPMS' --define '_builddir %{_topdir}/BUILD' --target i486-pld-linux --define 'prep exit 0' /tmp/B.5f7a4b71-2252-48e9-9e4e-2f2de3091f6f/cups-filters.spec
Building target platforms: i486-pld-linux
checking BuildConflict-ing packages
no BuildConflicts found
checking BR
rpm: Building target platforms: i486-pld-linux
no BR needed
building RPM using: set -ex; : build-id: a370d466-09aa-42f8-9483-2b4804246e9b; TMPDIR=/tmp/B.5f7a4b71-2252-48e9-9e4e-2f2de3091f6f/BUILD/tmp exec nice -n 0 rpmbuild -bb --define '_smp_mflags -j9' --define '_pld_builder 1' --define '_topdir /tmp/B.5f7a4b71-2252-48e9-9e4e-2f2de3091f6f' --define '_specdir %{_topdir}' --define '_sourcedir %{_specdir}' --define '_rpmdir %{_topdir}/RPMS' --define '_builddir %{_topdir}/BUILD'  --target i486-pld-linux /tmp/B.5f7a4b71-2252-48e9-9e4e-2f2de3091f6f/cups-filters.spec
+ : build-id: a370d466-09aa-42f8-9483-2b4804246e9b
+ TMPDIR=/tmp/B.5f7a4b71-2252-48e9-9e4e-2f2de3091f6f/BUILD/tmp
+ exec nice -n 0 rpmbuild -bb --define '_smp_mflags -j9' --define '_pld_builder 1' --define '_topdir /tmp/B.5f7a4b71-2252-48e9-9e4e-2f2de3091f6f' --define '_specdir %{_topdir}' --define '_sourcedir %{_specdir}' --define '_rpmdir %{_topdir}/RPMS' --define '_builddir %{_topdir}/BUILD' --target i486-pld-linux /tmp/B.5f7a4b71-2252-48e9-9e4e-2f2de3091f6f/cups-filters.spec
Building target platforms: i486-pld-linux
Executing(%prep): /bin/sh -e /tmp/B.5f7a4b71-2252-48e9-9e4e-2f2de3091f6f/BUILD/tmp/rpm-tmp.25788
+ umask 022
+ cd /tmp/B.5f7a4b71-2252-48e9-9e4e-2f2de3091f6f/BUILD
+ cd /tmp/B.5f7a4b71-2252-48e9-9e4e-2f2de3091f6f/BUILD
+ rm -rf cups-filters-1.0.47
+ /usr/bin/xz -dc /tmp/B.5f7a4b71-2252-48e9-9e4e-2f2de3091f6f/cups-filters-1.0.47.tar.xz
+ /bin/tar -xf -
+ STATUS=0 
+ '[' 0 -ne 0 ']'
+ cd cups-filters-1.0.47
+ /bin/id -u
+ '[' 2001 '=' 0 ']'
+ /bin/id -u
+ '[' 2001 '=' 0 ']'
+ /bin/chmod -Rf a+rX,u+w,g-w,o-w .
+ echo 'Patch #0 (cups-filters-dbus.patch):'
Patch #0 (cups-filters-dbus.patch):
+ '[' -f /tmp/B.5f7a4b71-2252-48e9-9e4e-2f2de3091f6f/cups-filters-dbus.patch ']'
+ /bin/cat /tmp/B.5f7a4b71-2252-48e9-9e4e-2f2de3091f6f/cups-filters-dbus.patch
+ /usr/bin/patch -s -p1
+ echo 'Patch #1 (cups-filters-php.patch):'
Patch #1 (cups-filters-php.patch):
+ '[' -f /tmp/B.5f7a4b71-2252-48e9-9e4e-2f2de3091f6f/cups-filters-php.patch ']'
+ /bin/cat /tmp/B.5f7a4b71-2252-48e9-9e4e-2f2de3091f6f/cups-filters-php.patch
+ /usr/bin/patch -s -p1
+ exit 0
Executing(%build): /bin/sh -e /tmp/B.5f7a4b71-2252-48e9-9e4e-2f2de3091f6f/BUILD/tmp/rpm-tmp.25788
TMP=/home/users/builder/tmp
HOME=/home/users/builder
PATH=/home/users/builder/GNUstep/Tools:/usr/local/bin:/usr/bin:/bin:/home/users/builder/bin
TMPDIR=/tmp/B.5f7a4b71-2252-48e9-9e4e-2f2de3091f6f/BUILD/tmp
+ umask 022
+ cd /tmp/B.5f7a4b71-2252-48e9-9e4e-2f2de3091f6f/BUILD
+ cd cups-filters-1.0.47
+ aclocal
+ autoconf
+ automake -a -c -f --foreign
Makefile.am:112: warning: source file 'cupsfilters/attr.c' is in a subdirectory,
Makefile.am:112: but option 'subdir-objects' is disabled
automake: warning: possible forward-incompatibility.
automake: At least a source file is in a subdirectory, but the 'subdir-objects'
automake: automake option hasn't been enabled.  For now, the corresponding output
automake: object file(s) will be placed in the top-level directory.  However,
automake: this behaviour will change in future Automake versions: they will
automake: unconditionally cause object files to be placed in the same subdirectory
automake: of the corresponding sources.
automake: You are advised to start using 'subdir-objects' option throughout your
automake: project, to avoid future incompatibilities.
Makefile.am:112: warning: source file 'cupsfilters/check.c' is in a subdirectory,
Makefile.am:112: but option 'subdir-objects' is disabled
Makefile.am:112: warning: source file 'cupsfilters/cmyk.c' is in a subdirectory,
Makefile.am:112: but option 'subdir-objects' is disabled
Makefile.am:112: warning: source file 'cupsfilters/colord.c' is in a subdirectory,
Makefile.am:112: but option 'subdir-objects' is disabled
Makefile.am:112: warning: source file 'cupsfilters/dither.c' is in a subdirectory,
Makefile.am:112: but option 'subdir-objects' is disabled
Makefile.am:112: warning: source file 'cupsfilters/image.c' is in a subdirectory,
Makefile.am:112: but option 'subdir-objects' is disabled
Makefile.am:112: warning: source file 'cupsfilters/image-bmp.c' is in a subdirectory,
Makefile.am:112: but option 'subdir-objects' is disabled
Makefile.am:112: warning: source file 'cupsfilters/image-colorspace.c' is in a subdirectory,
Makefile.am:112: but option 'subdir-objects' is disabled
Makefile.am:112: warning: source file 'cupsfilters/image-gif.c' is in a subdirectory,
Makefile.am:112: but option 'subdir-objects' is disabled
Makefile.am:112: warning: source file 'cupsfilters/image-jpeg.c' is in a subdirectory,
Makefile.am:112: but option 'subdir-objects' is disabled
Makefile.am:112: warning: source file 'cupsfilters/image-photocd.c' is in a subdirectory,
Makefile.am:112: but option 'subdir-objects' is disabled
Makefile.am:112: warning: source file 'cupsfilters/image-pix.c' is in a subdirectory,
Makefile.am:112: but option 'subdir-objects' is disabled
Makefile.am:112: warning: source file 'cupsfilters/image-png.c' is in a subdirectory,
Makefile.am:112: but option 'subdir-objects' is disabled
Makefile.am:112: warning: source file 'cupsfilters/image-pnm.c' is in a subdirectory,
Makefile.am:112: but option 'subdir-objects' is disabled
Makefile.am:112: warning: source file 'cupsfilters/image-sgi.c' is in a subdirectory,
Makefile.am:112: but option 'subdir-objects' is disabled
Makefile.am:112: warning: source file 'cupsfilters/image-sgilib.c' is in a subdirectory,
Makefile.am:112: but option 'subdir-objects' is disabled
Makefile.am:112: warning: source file 'cupsfilters/image-sun.c' is in a subdirectory,
Makefile.am:112: but option 'subdir-objects' is disabled
Makefile.am:112: warning: source file 'cupsfilters/image-tiff.c' is in a subdirectory,
Makefile.am:112: but option 'subdir-objects' is disabled
Makefile.am:112: warning: source file 'cupsfilters/image-zoom.c' is in a subdirectory,
Makefile.am:112: but option 'subdir-objects' is disabled
Makefile.am:112: warning: source file 'cupsfilters/lut.c' is in a subdirectory,
Makefile.am:112: but option 'subdir-objects' is disabled
Makefile.am:112: warning: source file 'cupsfilters/pack.c' is in a subdirectory,
Makefile.am:112: but option 'subdir-objects' is disabled
Makefile.am:112: warning: source file 'cupsfilters/raster.c' is in a subdirectory,
Makefile.am:112: but option 'subdir-objects' is disabled
Makefile.am:112: warning: source file 'cupsfilters/rgb.c' is in a subdirectory,
Makefile.am:112: but option 'subdir-objects' is disabled
Makefile.am:112: warning: source file 'cupsfilters/srgb.c' is in a subdirectory,
Makefile.am:112: but option 'subdir-objects' is disabled
Makefile.am:274: warning: source file 'fontembed/aglfn13.c' is in a subdirectory,
Makefile.am:274: but option 'subdir-objects' is disabled
Makefile.am:274: warning: source file 'fontembed/dynstring.c' is in a subdirectory,
Makefile.am:274: but option 'subdir-objects' is disabled
Makefile.am:274: warning: source file 'fontembed/embed.c' is in a subdirectory,
Makefile.am:274: but option 'subdir-objects' is disabled
Makefile.am:274: warning: source file 'fontembed/embed_sfnt.c' is in a subdirectory,
Makefile.am:274: but option 'subdir-objects' is disabled
Makefile.am:274: warning: source file 'fontembed/embed_pdf.c' is in a subdirectory,
Makefile.am:274: but option 'subdir-objects' is disabled
Makefile.am:274: warning: source file 'fontembed/fontfile.c' is in a subdirectory,
Makefile.am:274: but option 'subdir-objects' is disabled
Makefile.am:274: warning: source file 'fontembed/frequent.c' is in a subdirectory,
Makefile.am:274: but option 'subdir-objects' is disabled
Makefile.am:274: warning: source file 'fontembed/sfnt.c' is in a subdirectory,
Makefile.am:274: but option 'subdir-objects' is disabled
Makefile.am:274: warning: source file 'fontembed/sfnt_subset.c' is in a subdirectory,
Makefile.am:274: but option 'subdir-objects' is disabled
Makefile.am:740: warning: source file 'scripting/php/phpcups.c' is in a subdirectory,
Makefile.am:740: but option 'subdir-objects' is disabled
Makefile.am:440: warning: source file 'filter/banner.c' is in a subdirectory,
Makefile.am:440: but option 'subdir-objects' is disabled
Makefile.am:440: warning: source file 'filter/bannertopdf.c' is in a subdirectory,
Makefile.am:440: but option 'subdir-objects' is disabled
Makefile.am:440: warning: source file 'filter/pdf.cxx' is in a subdirectory,
Makefile.am:440: but option 'subdir-objects' is disabled
Makefile.am:448: warning: source file 'filter/getline.c' is in a subdirectory,
Makefile.am:448: but option 'subdir-objects' is disabled
Makefile.am:471: warning: source file 'filter/commandtoescpx.c' is in a subdirectory,
Makefile.am:471: but option 'subdir-objects' is disabled
Makefile.am:480: warning: source file 'filter/commandtopclx.c' is in a subdirectory,
Makefile.am:480: but option 'subdir-objects' is disabled
Makefile.am:697: warning: source file 'utils/cups-browsed.c' is in a subdirectory,
Makefile.am:697: but option 'subdir-objects' is disabled
Makefile.am:489: warning: source file 'filter/foomatic-rip/foomaticrip.c' is in a subdirectory,
Makefile.am:489: but option 'subdir-objects' is disabled
Makefile.am:489: warning: source file 'filter/foomatic-rip/options.c' is in a subdirectory,
Makefile.am:489: but option 'subdir-objects' is disabled
Makefile.am:489: warning: source file 'filter/foomatic-rip/pdf.c' is in a subdirectory,
Makefile.am:489: but option 'subdir-objects' is disabled
Makefile.am:489: warning: source file 'filter/foomatic-rip/postscript.c' is in a subdirectory,
Makefile.am:489: but option 'subdir-objects' is disabled
Makefile.am:489: warning: source file 'filter/foomatic-rip/process.c' is in a subdirectory,
Makefile.am:489: but option 'subdir-objects' is disabled
Makefile.am:489: warning: source file 'filter/foomatic-rip/renderer.c' is in a subdirectory,
Makefile.am:489: but option 'subdir-objects' is disabled
Makefile.am:489: warning: source file 'filter/foomatic-rip/spooler.c' is in a subdirectory,
Makefile.am:489: but option 'subdir-objects' is disabled
Makefile.am:489: warning: source file 'filter/foomatic-rip/util.c' is in a subdirectory,
Makefile.am:489: but option 'subdir-objects' is disabled
Makefile.am:514: warning: source file 'filter/gstoraster.c' is in a subdirectory,
Makefile.am:514: but option 'subdir-objects' is disabled
Makefile.am:527: warning: source file 'filter/common.c' is in a subdirectory,
Makefile.am:527: but option 'subdir-objects' is disabled
Makefile.am:527: warning: source file 'filter/imagetopdf.c' is in a subdirectory,
Makefile.am:527: but option 'subdir-objects' is disabled
Makefile.am:545: warning: source file 'filter/common.c' is in a subdirectory,
Makefile.am:545: but option 'subdir-objects' is disabled
Makefile.am:545: warning: source file 'filter/imagetoraster.c' is in a subdirectory,
Makefile.am:545: but option 'subdir-objects' is disabled
Makefile.am:34: warning: source file 'backend/ieee1284.c' is in a subdirectory,
Makefile.am:34: but option 'subdir-objects' is disabled
Makefile.am:34: warning: source file 'backend/parallel.c' is in a subdirectory,
Makefile.am:34: but option 'subdir-objects' is disabled
Makefile.am:566: warning: source file 'filter/pdftoijs.cxx' is in a subdirectory,
Makefile.am:566: but option 'subdir-objects' is disabled
Makefile.am:579: warning: source file 'filter/common.c' is in a subdirectory,
Makefile.am:579: but option 'subdir-objects' is disabled
Makefile.am:579: warning: source file 'filter/pdftoippprinter.c' is in a subdirectory,
Makefile.am:579: but option 'subdir-objects' is disabled
Makefile.am:583: warning: source file 'filter/strcasestr.c' is in a subdirectory,
Makefile.am:583: but option 'subdir-objects' is disabled
Makefile.am:325: warning: source file 'filter/pdftoopvp/oprs/OPRS.cxx' is in a subdirectory,
Makefile.am:325: but option 'subdir-objects' is disabled
Makefile.am:325: warning: source file 'filter/pdftoopvp/oprs/OPVPSplashClip.cxx' is in a subdirectory,
Makefile.am:325: but option 'subdir-objects' is disabled
Makefile.am:325: warning: source file 'filter/pdftoopvp/oprs/OPVPSplash.cxx' is in a subdirectory,
Makefile.am:325: but option 'subdir-objects' is disabled
Makefile.am:325: warning: source file 'filter/pdftoopvp/oprs/OPVPSplashPath.cxx' is in a subdirectory,
Makefile.am:325: but option 'subdir-objects' is disabled
Makefile.am:325: warning: source file 'filter/pdftoopvp/oprs/OPVPSplashState.cxx' is in a subdirectory,
Makefile.am:325: but option 'subdir-objects' is disabled
Makefile.am:325: warning: source file 'filter/pdftoopvp/oprs/OPVPSplashXPath.cxx' is in a subdirectory,
Makefile.am:325: but option 'subdir-objects' is disabled
Makefile.am:325: warning: source file 'filter/pdftoopvp/oprs/OPVPWrapper.cxx' is in a subdirectory,
Makefile.am:325: but option 'subdir-objects' is disabled
Makefile.am:325: warning: source file 'filter/pdftoopvp/oprs/OPVPWrapper_0_2.cxx' is in a subdirectory,
Makefile.am:325: but option 'subdir-objects' is disabled
Makefile.am:325: warning: source file 'filter/pdftoopvp/OPVPOutputDev.cxx' is in a subdirectory,
Makefile.am:325: but option 'subdir-objects' is disabled
Makefile.am:325: warning: source file 'filter/pdftoopvp/pdftoopvp.cxx' is in a subdirectory,
Makefile.am:325: but option 'subdir-objects' is disabled
Makefile.am:373: warning: source file 'filter/pdftopdf/pdftopdf.cc' is in a subdirectory,
Makefile.am:373: but option 'subdir-objects' is disabled
Makefile.am:373: warning: source file 'filter/pdftopdf/pdftopdf_jcl.cc' is in a subdirectory,
Makefile.am:373: but option 'subdir-objects' is disabled
Makefile.am:373: warning: source file 'filter/pdftopdf/pdftopdf_processor.cc' is in a subdirectory,
Makefile.am:373: but option 'subdir-objects' is disabled
Makefile.am:373: warning: source file 'filter/pdftopdf/qpdf_pdftopdf_processor.cc' is in a subdirectory,
Makefile.am:373: but option 'subdir-objects' is disabled
Makefile.am:373: warning: source file 'filter/pdftopdf/pptypes.cc' is in a subdirectory,
Makefile.am:373: but option 'subdir-objects' is disabled
Makefile.am:373: warning: source file 'filter/pdftopdf/nup.cc' is in a subdirectory,
Makefile.am:373: but option 'subdir-objects' is disabled
Makefile.am:373: warning: source file 'filter/pdftopdf/intervalset.cc' is in a subdirectory,
Makefile.am:373: but option 'subdir-objects' is disabled
Makefile.am:373: warning: source file 'filter/pdftopdf/qpdf_tools.cc' is in a subdirectory,
Makefile.am:373: but option 'subdir-objects' is disabled
Makefile.am:373: warning: source file 'filter/pdftopdf/qpdf_xobject.cc' is in a subdirectory,
Makefile.am:373: but option 'subdir-objects' is disabled
Makefile.am:373: warning: source file 'filter/pdftopdf/qpdf_pdftopdf.cc' is in a subdirectory,
Makefile.am:373: but option 'subdir-objects' is disabled
Makefile.am:373: warning: source file 'filter/pdftopdf/qpdf_cm.cc' is in a subdirectory,
Makefile.am:373: but option 'subdir-objects' is disabled
Makefile.am:588: warning: source file 'filter/common.c' is in a subdirectory,
Makefile.am:588: but option 'subdir-objects' is disabled
Makefile.am:588: warning: source file 'filter/pdftops.c' is in a subdirectory,
Makefile.am:588: but option 'subdir-objects' is disabled
Makefile.am:592: warning: source file 'filter/strcasestr.c' is in a subdirectory,
Makefile.am:592: but option 'subdir-objects' is disabled
Makefile.am:597: warning: source file 'filter/pdftoraster.cxx' is in a subdirectory,
Makefile.am:597: but option 'subdir-objects' is disabled
Makefile.am:618: warning: source file 'filter/rastertoescpx.c' is in a subdirectory,
Makefile.am:618: but option 'subdir-objects' is disabled
Makefile.am:629: warning: source file 'filter/pcl-common.c' is in a subdirectory,
Makefile.am:629: but option 'subdir-objects' is disabled
Makefile.am:629: warning: source file 'filter/rastertopclx.c' is in a subdirectory,
Makefile.am:629: but option 'subdir-objects' is disabled
Makefile.am:41: warning: source file 'backend/serial.c' is in a subdirectory,
Makefile.am:41: but option 'subdir-objects' is disabled
Makefile.am:47: warning: source file 'backend/ieee1284.c' is in a subdirectory,
Makefile.am:47: but option 'subdir-objects' is disabled
Makefile.am:47: warning: source file 'backend/test1284.c' is in a subdirectory,
Makefile.am:47: but option 'subdir-objects' is disabled
Makefile.am:303: warning: source file 'fontembed/test_analyze.c' is in a subdirectory,
Makefile.am:303: but option 'subdir-objects' is disabled
Makefile.am:306: warning: source file 'fontembed/test_pdf.c' is in a subdirectory,
Makefile.am:306: but option 'subdir-objects' is disabled
Makefile.am:644: warning: source file 'filter/pdfutils.c' is in a subdirectory,
Makefile.am:644: but option 'subdir-objects' is disabled
Makefile.am:644: warning: source file 'filter/test_pdf1.c' is in a subdirectory,
Makefile.am:644: but option 'subdir-objects' is disabled
Makefile.am:653: warning: source file 'filter/pdfutils.c' is in a subdirectory,
Makefile.am:653: but option 'subdir-objects' is disabled
Makefile.am:653: warning: source file 'filter/test_pdf2.c' is in a subdirectory,
Makefile.am:653: but option 'subdir-objects' is disabled
Makefile.am:309: warning: source file 'fontembed/test_ps.c' is in a subdirectory,
Makefile.am:309: but option 'subdir-objects' is disabled
Makefile.am:159: warning: source file 'cupsfilters/testcmyk.c' is in a subdirectory,
Makefile.am:159: but option 'subdir-objects' is disabled
Makefile.am:166: warning: source file 'cupsfilters/testdither.c' is in a subdirectory,
Makefile.am:166: but option 'subdir-objects' is disabled
Makefile.am:173: warning: source file 'cupsfilters/testimage.c' is in a subdirectory,
Makefile.am:173: but option 'subdir-objects' is disabled
Makefile.am:187: warning: source file 'cupsfilters/testrgb.c' is in a subdirectory,
Makefile.am:187: but option 'subdir-objects' is disabled
Makefile.am:662: warning: source file 'filter/common.c' is in a subdirectory,
Makefile.am:662: but option 'subdir-objects' is disabled
Makefile.am:662: warning: source file 'filter/pdfutils.c' is in a subdirectory,
Makefile.am:662: but option 'subdir-objects' is disabled
Makefile.am:662: warning: source file 'filter/textcommon.c' is in a subdirectory,
Makefile.am:662: but option 'subdir-objects' is disabled
Makefile.am:662: warning: source file 'filter/texttopdf.c' is in a subdirectory,
Makefile.am:662: but option 'subdir-objects' is disabled
Makefile.am:300: warning: source file 'fontembed/main.c' is in a subdirectory,
Makefile.am:300: but option 'subdir-objects' is disabled
Makefile.am:558: warning: source file 'filter/urftopdf.cpp' is in a subdirectory,
Makefile.am:558: but option 'subdir-objects' is disabled
+ ./configure 'LDFLAGS=-Wl,--as-needed -Wl,--no-copy-dt-needed-entries -Wl,-z,relro -Wl,-z,combreloc ' 'CFLAGS=-O2 -fwrapv -pipe -Wformat -Werror=format-security -gdwarf-4 -fno-debug-types-section -fvar-tracking-assignments -g2 -Wp,-D_FORTIFY_SOURCE=2 -fstack-protector --param=ssp-buffer-size=4 -fomit-frame-pointer -march=i486 -fasynchronous-unwind-tables -gdwarf-4 -fno-debug-types-section -fvar-tracking-assignments -g2 ' 'CXXFLAGS=-O2 -fwrapv -pipe -Wformat -Werror=format-security -gdwarf-4 -fno-debug-types-section -fvar-tracking-assignments -g2 -Wp,-D_FORTIFY_SOURCE=2 -fstack-protector --param=ssp-buffer-size=4 -fomit-frame-pointer -march=i486 -fasynchronous-unwind-tables -gdwarf-4 -fno-debug-types-section -fvar-tracking-assignments -g2 ' 'FFLAGS=-O2 -fwrapv -pipe -Wformat -Werror=format-security -gdwarf-4 -fno-debug-types-section -fvar-tracking-assignments -g2 -Wp,-D_FORTIFY_SOURCE=2 -fstack-protector --param=ssp-buffer-size=4 -fomit-frame-pointer -march=i486 -fasynchronous-unwind-tables -gdwarf-4 -fno-debug-types-section -fvar-tracking-assignments -g2 ' 'FCFLAGS=-O2 -fwrapv -pipe -Wformat -Werror=format-security -gdwarf-4 -fno-debug-types-section -fvar-tracking-assignments -g2 -Wp,-D_FORTIFY_SOURCE=2 -fstack-protector --param=ssp-buffer-size=4 -fomit-frame-pointer -march=i486 -fasynchronous-unwind-tables -gdwarf-4 -fno-debug-types-section -fvar-tracking-assignments -g2 ' 'CPPFLAGS=' 'CC=i486-pld-linux-gcc' 'CXX=i486-pld-linux-g++' '--host=i486-pld-linux' '--build=i486-pld-linux' '--prefix=/usr' '--exec-prefix=/usr' '--bindir=/usr/bin' '--sbindir=/usr/sbin' '--sysconfdir=/etc' '--datadir=/usr/share' '--includedir=/usr/include' '--libdir=/usr/lib' '--libexecdir=/usr/lib' '--localstatedir=/var' '--sharedstatedir=/var/lib' '--mandir=/usr/share/man' '--infodir=/usr/share/info' '--x-libraries=/usr/lib' --enable-dbus --disable-silent-rules --with-php '--with-pdftops=hybrid' '--with-rcdir=/etc/rc.d/init.d' '--with-rclevels=' '--with-test-font-path=/usr/share/fonts/TTF/DejaVuSans.ttf'
checking for a BSD-compatible install... /usr/bin/install -c
checking whether build environment is sane... yes
checking for a thread-safe mkdir -p... /bin/mkdir -p
checking for mawk... mawk
checking whether make sets $(MAKE)... yes
checking whether make supports nested variables... yes
checking whether make supports nested variables... (cached) yes
checking for i486-pld-linux-gcc... i486-pld-linux-gcc
checking whether the C compiler works... yes
checking for C compiler default output file name... a.out
checking for suffix of executables... 
checking whether we are cross compiling... no
checking for suffix of object files... o
checking whether we are using the GNU C compiler... yes
checking whether i486-pld-linux-gcc accepts -g... yes
checking for i486-pld-linux-gcc option to accept ISO C89... none needed
checking whether i486-pld-linux-gcc understands -c and -o together... yes
checking for style of include used by make... GNU
checking dependency style of i486-pld-linux-gcc... gcc3
checking whether we are using the GNU C++ compiler... yes
checking whether i486-pld-linux-g++ accepts -g... yes
checking dependency style of i486-pld-linux-g++... gcc3
checking how to run the C preprocessor... i486-pld-linux-gcc -E
checking whether ln -s works... yes
checking whether make sets $(MAKE)... (cached) yes
checking build system type... i486-pld-linux-gnu
checking host system type... i486-pld-linux-gnu
checking how to print strings... print -r
checking for a sed that does not truncate output... /bin/sed
checking for grep that handles long lines and -e... /bin/grep
checking for egrep... /bin/grep -E
checking for fgrep... /bin/grep -F
checking for ld used by i486-pld-linux-gcc... /usr/bin/ld
checking if the linker (/usr/bin/ld) is GNU ld... yes
checking for BSD- or MS-compatible name lister (nm)... /usr/bin/nm -B
checking the name lister (/usr/bin/nm -B) interface... BSD nm
checking the maximum length of command line arguments... 1572864
checking whether the shell understands some XSI constructs... yes
checking whether the shell understands "+="... yes
checking how to convert i486-pld-linux-gnu file names to i486-pld-linux-gnu format... func_convert_file_noop
checking how to convert i486-pld-linux-gnu file names to toolchain format... func_convert_file_noop
checking for /usr/bin/ld option to reload object files... -r
checking for i486-pld-linux-objdump... no
checking for objdump... objdump
checking how to recognize dependent libraries... pass_all
checking for i486-pld-linux-dlltool... no
checking for dlltool... no
checking how to associate runtime and link libraries... print -r --
checking for i486-pld-linux-ar... no
checking for ar... ar
checking for archiver @FILE support... @
checking for i486-pld-linux-strip... no
checking for strip... strip
checking for i486-pld-linux-ranlib... no
checking for ranlib... ranlib
checking command to parse /usr/bin/nm -B output from i486-pld-linux-gcc object... ok
checking for sysroot... no
checking for i486-pld-linux-mt... no
checking for mt... no
checking if : is a manifest tool... no
checking for ANSI C header files... no
checking for sys/types.h... yes
checking for sys/stat.h... yes
checking for stdlib.h... yes
checking for string.h... yes
checking for memory.h... yes
checking for strings.h... yes
checking for inttypes.h... yes
checking for stdint.h... yes
checking for unistd.h... yes
checking for dlfcn.h... yes
checking for objdir... .libs
checking if i486-pld-linux-gcc supports -fno-rtti -fno-exceptions... no
checking for i486-pld-linux-gcc option to produce PIC... -fPIC -DPIC
checking if i486-pld-linux-gcc PIC flag -fPIC -DPIC works... yes
checking if i486-pld-linux-gcc static flag -static works... yes
checking if i486-pld-linux-gcc supports -c -o file.o... yes
checking if i486-pld-linux-gcc supports -c -o file.o... (cached) yes
checking whether the i486-pld-linux-gcc linker (/usr/bin/ld) supports shared libraries... yes
checking whether -lc should be explicitly linked in... no
checking dynamic linker characteristics... GNU/Linux ld.so
checking how to hardcode library paths into programs... immediate
checking whether stripping libraries is possible... yes
checking if libtool supports shared libraries... yes
checking whether to build shared libraries... yes
checking whether to build static libraries... yes
checking how to run the C++ preprocessor... i486-pld-linux-g++ -E
checking for ld used by i486-pld-linux-g++... /usr/bin/ld
checking if the linker (/usr/bin/ld) is GNU ld... yes
checking whether the i486-pld-linux-g++ linker (/usr/bin/ld) supports shared libraries... yes
checking for i486-pld-linux-g++ option to produce PIC... -fPIC -DPIC
checking if i486-pld-linux-g++ PIC flag -fPIC -DPIC works... yes
checking if i486-pld-linux-g++ static flag -static works... yes
checking if i486-pld-linux-g++ supports -c -o file.o... yes
checking if i486-pld-linux-g++ supports -c -o file.o... (cached) yes
checking whether the i486-pld-linux-g++ linker (/usr/bin/ld) supports shared libraries... yes
checking dynamic linker characteristics... (cached) GNU/Linux ld.so
checking how to hardcode library paths into programs... immediate
checking for i486-pld-linux-pkg-config... no
checking for pkg-config... /usr/bin/pkg-config
checking pkg-config is at least version 0.20... yes
checking for cups-config... /usr/bin/cups-config
checking for DBUS... yes
checking for library containing dlopen... -ldl
checking for sigaction... yes
checking for waitpid... yes
checking for wait3... yes
checking for strtoll... yes
checking for open_memstream... yes
checking for getline... yes
checking for strcasestr... yes
checking for library containing pow... none required
checking for stdlib.h... (cached) yes
checking for sys/stat.h... (cached) yes
checking for sys/types.h... (cached) yes
checking for unistd.h... (cached) yes
checking zlib.h usability... yes
checking zlib.h presence... yes
checking for zlib.h... yes
checking endian.h usability... yes
checking endian.h presence... yes
checking for endian.h... yes
checking dirent.h usability... yes
checking dirent.h presence... yes
checking for dirent.h... yes
checking sys/ioctl.h usability... yes
checking sys/ioctl.h presence... yes
checking for sys/ioctl.h... yes
checking jpeglib.h usability... yes
checking jpeglib.h presence... yes
checking for jpeglib.h... yes
checking for library containing jpeg_destroy_decompress... -ljpeg
checking for LIBPNG... yes
checking tiff.h usability... yes
checking tiff.h presence... yes
checking for tiff.h... yes
checking for library containing TIFFReadScanline... -ltiff
checking for pkg-config... /usr/bin/pkg-config
checking for Avahi... yes
checking for GLIB... yes
checking for AVAHI_GLIB... yes
checking for LCMS... yes
checking for FREETYPE... yes
checking for FONTCONFIG... yes
checking for IJS... yes
checking for POPPLER... yes
checking for ZLIB... yes
checking for LIBQPDF... yes
checking poppler/cpp/poppler-version.h usability... yes
checking poppler/cpp/poppler-version.h presence... yes
checking for poppler/cpp/poppler-version.h... yes
checking for DBUS... yes
checking for special C compiler options needed for large files... no
checking for _FILE_OFFSET_BITS value needed for large files... 64
checking for long long... yes
checking for gs... /usr/bin/gs
checking whether gs supports the ps2write device... yes
checking for pdftops... /usr/bin/pdftops
checking whether pdftops supports -origpagesizes... yes
checking whether pdftops supports -r... yes
checking for pdftocairo... /usr/bin/pdftocairo
checking for acroread... ./configure[18584]: acroread: not found
no
checking for php-config... /usr/bin/php-config
checking for a sed that does not truncate output... (cached) /bin/sed
checking that generated files are newer than configure... done
configure: creating ./config.status
config.status: creating libcupsfilters.pc
config.status: creating libfontembed.pc
config.status: creating Makefile
config.status: creating filter/gstopxl
config.status: creating utils/cups-browsed
config.status: creating utils/cups-browsed.conf
config.status: creating filter/foomatic-rip/foomatic-rip.1
config.status: creating config.h
config.status: executing depfiles commands
config.status: executing libtool commands
configure:
==============================================================================
Environment settings:
	CFLAGS:          -O2 -fwrapv -pipe -Wformat -Werror=format-security -gdwarf-4 -fno-debug-types-section -fvar-tracking-assignments -g2 -Wp,-D_FORTIFY_SOURCE=2 -fstack-protector --param=ssp-buffer-size=4 -fomit-frame-pointer -march=i486 -fasynchronous-unwind-tables -gdwarf-4 -fno-debug-types-section -fvar-tracking-assignments -g2  -Wall -pedantic -std=gnu99 -D_GNU_SOURCE
	CXXFLAGS:        -O2 -fwrapv -pipe -Wformat -Werror=format-security -gdwarf-4 -fno-debug-types-section -fvar-tracking-assignments -g2 -Wp,-D_FORTIFY_SOURCE=2 -fstack-protector --param=ssp-buffer-size=4 -fomit-frame-pointer -march=i486 -fasynchronous-unwind-tables -gdwarf-4 -fno-debug-types-section -fvar-tracking-assignments -g2  -Wall -pedantic -D_GNU_SOURCE
	LDFLAGS:         -Wl,--as-needed -Wl,--no-copy-dt-needed-entries -Wl,-z,relro -Wl,-z,combreloc 
Build configuration:
	cups-config:     system
	font directory:  /etc/fonts/conf.d
	init directory:  /etc/rc.d/init.d
	cups dom socket: /var/run/cups/cups.sock
	gs-path:         system
	imagefilters:    yes
	jpeg:            yes
	pdftocairo-path: system
	pdftops:         hybrid
	pdftops-path:    system
	png:             yes
	php:             yes
	php-config:      system
	test-font:       /usr/share/fonts/TTF/DejaVuSans.ttf
	tiff:            yes
	dbus:            -DHAVE_DBUS
	avahi:           yes
	dbus:            yes
	browsing:        dnssd cups
	werror:          no
==============================================================================

+ /usr/bin/make -j9
(CDPATH="${ZSH_VERSION+.}:" && cd . && /bin/sh /tmp/B.5f7a4b71-2252-48e9-9e4e-2f2de3091f6f/BUILD/cups-filters-1.0.47/missing autoheader)
rm -f stamp-h1
touch config.h.in
cd . && /bin/sh ./config.status config.h
config.status: creating config.h
/usr/bin/make  all-am
make[1]: Entering directory '/tmp/B.5f7a4b71-2252-48e9-9e4e-2f2de3091f6f/BUILD/cups-filters-1.0.47'
/bin/sh ./libtool  --tag=CC   --mode=compile i486-pld-linux-gcc -DHAVE_CONFIG_H -I.      -I/usr/include/libpng16   -I/usr/include/dbus-1.0 -I/usr/lib/dbus-1.0/include  -DHAVE_DBUS -O2 -fwrapv -pipe -Wformat -Werror=format-security -gdwarf-4 -fno-debug-types-section -fvar-tracking-assignments -g2 -Wp,-D_FORTIFY_SOURCE=2 -fstack-protector --param=ssp-buffer-size=4 -fomit-frame-pointer -march=i486 -fasynchronous-unwind-tables -gdwarf-4 -fno-debug-types-section -fvar-tracking-assignments -g2  -Wall -pedantic -std=gnu99 -D_GNU_SOURCE -MT libcupsfilters_la-attr.lo -MD -MP -MF .deps/libcupsfilters_la-attr.Tpo -c -o libcupsfilters_la-attr.lo `test -f 'cupsfilters/attr.c' || echo './'`cupsfilters/attr.c
/bin/sh ./libtool  --tag=CC   --mode=compile i486-pld-linux-gcc -DHAVE_CONFIG_H -I.      -I/usr/include/libpng16   -I/usr/include/dbus-1.0 -I/usr/lib/dbus-1.0/include  -DHAVE_DBUS -O2 -fwrapv -pipe -Wformat -Werror=format-security -gdwarf-4 -fno-debug-types-section -fvar-tracking-assignments -g2 -Wp,-D_FORTIFY_SOURCE=2 -fstack-protector --param=ssp-buffer-size=4 -fomit-frame-pointer -march=i486 -fasynchronous-unwind-tables -gdwarf-4 -fno-debug-types-section -fvar-tracking-assignments -g2  -Wall -pedantic -std=gnu99 -D_GNU_SOURCE -MT libcupsfilters_la-check.lo -MD -MP -MF .deps/libcupsfilters_la-check.Tpo -c -o libcupsfilters_la-check.lo `test -f 'cupsfilters/check.c' || echo './'`cupsfilters/check.c
/bin/sh ./libtool  --tag=CC   --mode=compile i486-pld-linux-gcc -DHAVE_CONFIG_H -I.      -I/usr/include/libpng16   -I/usr/include/dbus-1.0 -I/usr/lib/dbus-1.0/include  -DHAVE_DBUS -O2 -fwrapv -pipe -Wformat -Werror=format-security -gdwarf-4 -fno-debug-types-section -fvar-tracking-assignments -g2 -Wp,-D_FORTIFY_SOURCE=2 -fstack-protector --param=ssp-buffer-size=4 -fomit-frame-pointer -march=i486 -fasynchronous-unwind-tables -gdwarf-4 -fno-debug-types-section -fvar-tracking-assignments -g2  -Wall -pedantic -std=gnu99 -D_GNU_SOURCE -MT libcupsfilters_la-cmyk.lo -MD -MP -MF .deps/libcupsfilters_la-cmyk.Tpo -c -o libcupsfilters_la-cmyk.lo `test -f 'cupsfilters/cmyk.c' || echo './'`cupsfilters/cmyk.c
/bin/sh ./libtool  --tag=CC   --mode=compile i486-pld-linux-gcc -DHAVE_CONFIG_H -I.      -I/usr/include/libpng16   -I/usr/include/dbus-1.0 -I/usr/lib/dbus-1.0/include  -DHAVE_DBUS -O2 -fwrapv -pipe -Wformat -Werror=format-security -gdwarf-4 -fno-debug-types-section -fvar-tracking-assignments -g2 -Wp,-D_FORTIFY_SOURCE=2 -fstack-protector --param=ssp-buffer-size=4 -fomit-frame-pointer -march=i486 -fasynchronous-unwind-tables -gdwarf-4 -fno-debug-types-section -fvar-tracking-assignments -g2  -Wall -pedantic -std=gnu99 -D_GNU_SOURCE -MT libcupsfilters_la-colord.lo -MD -MP -MF .deps/libcupsfilters_la-colord.Tpo -c -o libcupsfilters_la-colord.lo `test -f 'cupsfilters/colord.c' || echo './'`cupsfilters/colord.c
/bin/sh ./libtool  --tag=CC   --mode=compile i486-pld-linux-gcc -DHAVE_CONFIG_H -I.      -I/usr/include/libpng16   -I/usr/include/dbus-1.0 -I/usr/lib/dbus-1.0/include  -DHAVE_DBUS -O2 -fwrapv -pipe -Wformat -Werror=format-security -gdwarf-4 -fno-debug-types-section -fvar-tracking-assignments -g2 -Wp,-D_FORTIFY_SOURCE=2 -fstack-protector --param=ssp-buffer-size=4 -fomit-frame-pointer -march=i486 -fasynchronous-unwind-tables -gdwarf-4 -fno-debug-types-section -fvar-tracking-assignments -g2  -Wall -pedantic -std=gnu99 -D_GNU_SOURCE -MT libcupsfilters_la-dither.lo -MD -MP -MF .deps/libcupsfilters_la-dither.Tpo -c -o libcupsfilters_la-dither.lo `test -f 'cupsfilters/dither.c' || echo './'`cupsfilters/dither.c
/bin/sh ./libtool  --tag=CC   --mode=compile i486-pld-linux-gcc -DHAVE_CONFIG_H -I.      -I/usr/include/libpng16   -I/usr/include/dbus-1.0 -I/usr/lib/dbus-1.0/include  -DHAVE_DBUS -O2 -fwrapv -pipe -Wformat -Werror=format-security -gdwarf-4 -fno-debug-types-section -fvar-tracking-assignments -g2 -Wp,-D_FORTIFY_SOURCE=2 -fstack-protector --param=ssp-buffer-size=4 -fomit-frame-pointer -march=i486 -fasynchronous-unwind-tables -gdwarf-4 -fno-debug-types-section -fvar-tracking-assignments -g2  -Wall -pedantic -std=gnu99 -D_GNU_SOURCE -MT libcupsfilters_la-image.lo -MD -MP -MF .deps/libcupsfilters_la-image.Tpo -c -o libcupsfilters_la-image.lo `test -f 'cupsfilters/image.c' || echo './'`cupsfilters/image.c
/bin/sh ./libtool  --tag=CC   --mode=compile i486-pld-linux-gcc -DHAVE_CONFIG_H -I.      -I/usr/include/libpng16   -I/usr/include/dbus-1.0 -I/usr/lib/dbus-1.0/include  -DHAVE_DBUS -O2 -fwrapv -pipe -Wformat -Werror=format-security -gdwarf-4 -fno-debug-types-section -fvar-tracking-assignments -g2 -Wp,-D_FORTIFY_SOURCE=2 -fstack-protector --param=ssp-buffer-size=4 -fomit-frame-pointer -march=i486 -fasynchronous-unwind-tables -gdwarf-4 -fno-debug-types-section -fvar-tracking-assignments -g2  -Wall -pedantic -std=gnu99 -D_GNU_SOURCE -MT libcupsfilters_la-image-bmp.lo -MD -MP -MF .deps/libcupsfilters_la-image-bmp.Tpo -c -o libcupsfilters_la-image-bmp.lo `test -f 'cupsfilters/image-bmp.c' || echo './'`cupsfilters/image-bmp.c
/bin/sh ./libtool  --tag=CC   --mode=compile i486-pld-linux-gcc -DHAVE_CONFIG_H -I.      -I/usr/include/libpng16   -I/usr/include/dbus-1.0 -I/usr/lib/dbus-1.0/include  -DHAVE_DBUS -O2 -fwrapv -pipe -Wformat -Werror=format-security -gdwarf-4 -fno-debug-types-section -fvar-tracking-assignments -g2 -Wp,-D_FORTIFY_SOURCE=2 -fstack-protector --param=ssp-buffer-size=4 -fomit-frame-pointer -march=i486 -fasynchronous-unwind-tables -gdwarf-4 -fno-debug-types-section -fvar-tracking-assignments -g2  -Wall -pedantic -std=gnu99 -D_GNU_SOURCE -MT libcupsfilters_la-image-colorspace.lo -MD -MP -MF .deps/libcupsfilters_la-image-colorspace.Tpo -c -o libcupsfilters_la-image-colorspace.lo `test -f 'cupsfilters/image-colorspace.c' || echo './'`cupsfilters/image-colorspace.c
/bin/sh ./libtool  --tag=CC   --mode=compile i486-pld-linux-gcc -DHAVE_CONFIG_H -I.      -I/usr/include/libpng16   -I/usr/include/dbus-1.0 -I/usr/lib/dbus-1.0/include  -DHAVE_DBUS -O2 -fwrapv -pipe -Wformat -Werror=format-security -gdwarf-4 -fno-debug-types-section -fvar-tracking-assignments -g2 -Wp,-D_FORTIFY_SOURCE=2 -fstack-protector --param=ssp-buffer-size=4 -fomit-frame-pointer -march=i486 -fasynchronous-unwind-tables -gdwarf-4 -fno-debug-types-section -fvar-tracking-assignments -g2  -Wall -pedantic -std=gnu99 -D_GNU_SOURCE -MT libcupsfilters_la-image-gif.lo -MD -MP -MF .deps/libcupsfilters_la-image-gif.Tpo -c -o libcupsfilters_la-image-gif.lo `test -f 'cupsfilters/image-gif.c' || echo './'`cupsfilters/image-gif.c
libtool: compile:  i486-pld-linux-gcc -DHAVE_CONFIG_H -I. -I/usr/include/libpng16 -I/usr/include/dbus-1.0 -I/usr/lib/dbus-1.0/include -DHAVE_DBUS -O2 -fwrapv -pipe -Wformat -Werror=format-security -gdwarf-4 -fno-debug-types-section -fvar-tracking-assignments -g2 -Wp,-D_FORTIFY_SOURCE=2 -fstack-protector --param=ssp-buffer-size=4 -fomit-frame-pointer -march=i486 -fasynchronous-unwind-tables -gdwarf-4 -fno-debug-types-section -fvar-tracking-assignments -g2 -Wall -pedantic -std=gnu99 -D_GNU_SOURCE -MT libcupsfilters_la-dither.lo -MD -MP -MF .deps/libcupsfilters_la-dither.Tpo -c cupsfilters/dither.c  -fPIC -DPIC -o .libs/libcupsfilters_la-dither.o
libtool: compile:  i486-pld-linux-gcc -DHAVE_CONFIG_H -I. -I/usr/include/libpng16 -I/usr/include/dbus-1.0 -I/usr/lib/dbus-1.0/include -DHAVE_DBUS -O2 -fwrapv -pipe -Wformat -Werror=format-security -gdwarf-4 -fno-debug-types-section -fvar-tracking-assignments -g2 -Wp,-D_FORTIFY_SOURCE=2 -fstack-protector --param=ssp-buffer-size=4 -fomit-frame-pointer -march=i486 -fasynchronous-unwind-tables -gdwarf-4 -fno-debug-types-section -fvar-tracking-assignments -g2 -Wall -pedantic -std=gnu99 -D_GNU_SOURCE -MT libcupsfilters_la-colord.lo -MD -MP -MF .deps/libcupsfilters_la-colord.Tpo -c cupsfilters/colord.c  -fPIC -DPIC -o .libs/libcupsfilters_la-colord.o
libtool: compile:  i486-pld-linux-gcc -DHAVE_CONFIG_H -I. -I/usr/include/libpng16 -I/usr/include/dbus-1.0 -I/usr/lib/dbus-1.0/include -DHAVE_DBUS -O2 -fwrapv -pipe -Wformat -Werror=format-security -gdwarf-4 -fno-debug-types-section -fvar-tracking-assignments -g2 -Wp,-D_FORTIFY_SOURCE=2 -fstack-protector --param=ssp-buffer-size=4 -fomit-frame-pointer -march=i486 -fasynchronous-unwind-tables -gdwarf-4 -fno-debug-types-section -fvar-tracking-assignments -g2 -Wall -pedantic -std=gnu99 -D_GNU_SOURCE -MT libcupsfilters_la-check.lo -MD -MP -MF .deps/libcupsfilters_la-check.Tpo -c cupsfilters/check.c  -fPIC -DPIC -o .libs/libcupsfilters_la-check.o
libtool: compile:  i486-pld-linux-gcc -DHAVE_CONFIG_H -I. -I/usr/include/libpng16 -I/usr/include/dbus-1.0 -I/usr/lib/dbus-1.0/include -DHAVE_DBUS -O2 -fwrapv -pipe -Wformat -Werror=format-security -gdwarf-4 -fno-debug-types-section -fvar-tracking-assignments -g2 -Wp,-D_FORTIFY_SOURCE=2 -fstack-protector --param=ssp-buffer-size=4 -fomit-frame-pointer -march=i486 -fasynchronous-unwind-tables -gdwarf-4 -fno-debug-types-section -fvar-tracking-assignments -g2 -Wall -pedantic -std=gnu99 -D_GNU_SOURCE -MT libcupsfilters_la-image-bmp.lo -MD -MP -MF .deps/libcupsfilters_la-image-bmp.Tpo -c cupsfilters/image-bmp.c  -fPIC -DPIC -o .libs/libcupsfilters_la-image-bmp.o
libtool: compile:  i486-pld-linux-gcc -DHAVE_CONFIG_H -I. -I/usr/include/libpng16 -I/usr/include/dbus-1.0 -I/usr/lib/dbus-1.0/include -DHAVE_DBUS -O2 -fwrapv -pipe -Wformat -Werror=format-security -gdwarf-4 -fno-debug-types-section -fvar-tracking-assignments -g2 -Wp,-D_FORTIFY_SOURCE=2 -fstack-protector --param=ssp-buffer-size=4 -fomit-frame-pointer -march=i486 -fasynchronous-unwind-tables -gdwarf-4 -fno-debug-types-section -fvar-tracking-assignments -g2 -Wall -pedantic -std=gnu99 -D_GNU_SOURCE -MT libcupsfilters_la-image-colorspace.lo -MD -MP -MF .deps/libcupsfilters_la-image-colorspace.Tpo -c cupsfilters/image-colorspace.c  -fPIC -DPIC -o .libs/libcupsfilters_la-image-colorspace.o
libtool: compile:  i486-pld-linux-gcc -DHAVE_CONFIG_H -I. -I/usr/include/libpng16 -I/usr/include/dbus-1.0 -I/usr/lib/dbus-1.0/include -DHAVE_DBUS -O2 -fwrapv -pipe -Wformat -Werror=format-security -gdwarf-4 -fno-debug-types-section -fvar-tracking-assignments -g2 -Wp,-D_FORTIFY_SOURCE=2 -fstack-protector --param=ssp-buffer-size=4 -fomit-frame-pointer -march=i486 -fasynchronous-unwind-tables -gdwarf-4 -fno-debug-types-section -fvar-tracking-assignments -g2 -Wall -pedantic -std=gnu99 -D_GNU_SOURCE -MT libcupsfilters_la-cmyk.lo -MD -MP -MF .deps/libcupsfilters_la-cmyk.Tpo -c cupsfilters/cmyk.c  -fPIC -DPIC -o .libs/libcupsfilters_la-cmyk.o
libtool: compile:  i486-pld-linux-gcc -DHAVE_CONFIG_H -I. -I/usr/include/libpng16 -I/usr/include/dbus-1.0 -I/usr/lib/dbus-1.0/include -DHAVE_DBUS -O2 -fwrapv -pipe -Wformat -Werror=format-security -gdwarf-4 -fno-debug-types-section -fvar-tracking-assignments -g2 -Wp,-D_FORTIFY_SOURCE=2 -fstack-protector --param=ssp-buffer-size=4 -fomit-frame-pointer -march=i486 -fasynchronous-unwind-tables -gdwarf-4 -fno-debug-types-section -fvar-tracking-assignments -g2 -Wall -pedantic -std=gnu99 -D_GNU_SOURCE -MT libcupsfilters_la-image-gif.lo -MD -MP -MF .deps/libcupsfilters_la-image-gif.Tpo -c cupsfilters/image-gif.c  -fPIC -DPIC -o .libs/libcupsfilters_la-image-gif.o
libtool: compile:  i486-pld-linux-gcc -DHAVE_CONFIG_H -I. -I/usr/include/libpng16 -I/usr/include/dbus-1.0 -I/usr/lib/dbus-1.0/include -DHAVE_DBUS -O2 -fwrapv -pipe -Wformat -Werror=format-security -gdwarf-4 -fno-debug-types-section -fvar-tracking-assignments -g2 -Wp,-D_FORTIFY_SOURCE=2 -fstack-protector --param=ssp-buffer-size=4 -fomit-frame-pointer -march=i486 -fasynchronous-unwind-tables -gdwarf-4 -fno-debug-types-section -fvar-tracking-assignments -g2 -Wall -pedantic -std=gnu99 -D_GNU_SOURCE -MT libcupsfilters_la-attr.lo -MD -MP -MF .deps/libcupsfilters_la-attr.Tpo -c cupsfilters/attr.c  -fPIC -DPIC -o .libs/libcupsfilters_la-attr.o
libtool: compile:  i486-pld-linux-gcc -DHAVE_CONFIG_H -I. -I/usr/include/libpng16 -I/usr/include/dbus-1.0 -I/usr/lib/dbus-1.0/include -DHAVE_DBUS -O2 -fwrapv -pipe -Wformat -Werror=format-security -gdwarf-4 -fno-debug-types-section -fvar-tracking-assignments -g2 -Wp,-D_FORTIFY_SOURCE=2 -fstack-protector --param=ssp-buffer-size=4 -fomit-frame-pointer -march=i486 -fasynchronous-unwind-tables -gdwarf-4 -fno-debug-types-section -fvar-tracking-assignments -g2 -Wall -pedantic -std=gnu99 -D_GNU_SOURCE -MT libcupsfilters_la-image.lo -MD -MP -MF .deps/libcupsfilters_la-image.Tpo -c cupsfilters/image.c  -fPIC -DPIC -o .libs/libcupsfilters_la-image.o
In file included from cupsfilters/dither.c:27:0:
./config.h:56:0: warning: "HAVE_DBUS" redefined [enabled by default]
 #define HAVE_DBUS /**/
 ^
<command-line>:0:0: note: this is the location of the previous definition
In file included from cupsfilters/image-private.h:27:0,
                 from cupsfilters/image.c:40:
./config.h:56:0: warning: "HAVE_DBUS" redefined [enabled by default]
 #define HAVE_DBUS /**/
 ^
<command-line>:0:0: note: this is the location of the previous definition
In file included from cupsfilters/image-private.h:27:0,
                 from cupsfilters/image-bmp.c:29:
./config.h:56:0: warning: "HAVE_DBUS" redefined [enabled by default]
 #define HAVE_DBUS /**/
 ^
<command-line>:0:0: note: this is the location of the previous definition
In file included from cupsfilters/attr.c:26:0:
./config.h:56:0: warning: "HAVE_DBUS" redefined [enabled by default]
 #define HAVE_DBUS /**/
 ^
<command-line>:0:0: note: this is the location of the previous definition
In file included from cupsfilters/image-private.h:27:0,
                 from cupsfilters/image-colorspace.c:64:
./config.h:56:0: warning: "HAVE_DBUS" redefined [enabled by default]
 #define HAVE_DBUS /**/
 ^
<command-line>:0:0: note: this is the location of the previous definition
In file included from cupsfilters/image-private.h:27:0,
                 from cupsfilters/image-gif.c:31:
./config.h:56:0: warning: "HAVE_DBUS" redefined [enabled by default]
 #define HAVE_DBUS /**/
 ^
<command-line>:0:0: note: this is the location of the previous definition
In file included from cupsfilters/cmyk.c:37:0:
./config.h:56:0: warning: "HAVE_DBUS" redefined [enabled by default]
 #define HAVE_DBUS /**/
 ^
<command-line>:0:0: note: this is the location of the previous definition
cupsfilters/image.c: In function 'get_tile':
cupsfilters/image.c:761:11: warning: ignoring return value of 'read', declared with attribute warn_unused_result [-Wunused-result]
       read(img->cachefile, ic->pixels, bpp * CUPS_TILE_SIZE * CUPS_TILE_SIZE);
           ^
cupsfilters/image.c: In function 'flush_tile':
cupsfilters/image.c:669:8: warning: ignoring return value of 'write', declared with attribute warn_unused_result [-Wunused-result]
   write(img->cachefile, tile->ic->pixels, bpp * CUPS_TILE_SIZE * CUPS_TILE_SIZE);
        ^
cupsfilters/image.c: In function 'cupsImageOpen':
cupsfilters/image.c:333:8: warning: ignoring return value of 'fread', declared with attribute warn_unused_result [-Wunused-result]
   fread(header2, 1, sizeof(header2), fp);
        ^
cupsfilters/image-bmp.c: In function '_cupsImageReadBMP':
cupsfilters/image-bmp.c:172:10: warning: ignoring return value of 'fread', declared with attribute warn_unused_result [-Wunused-result]
     fread(colormap, colors_used, 4, fp);
          ^
cupsfilters/image-gif.c: In function '_cupsImageReadGIF':
cupsfilters/image-gif.c:100:8: warning: ignoring return value of 'fread', declared with attribute warn_unused_result [-Wunused-result]
   fread(buf, 13, 1, fp);
        ^
cupsfilters/image-gif.c:137:16: warning: ignoring return value of 'fread', declared with attribute warn_unused_result [-Wunused-result]
           fread(buf, 9, 1, fp);
                ^
libtool: compile:  i486-pld-linux-gcc -DHAVE_CONFIG_H -I. -I/usr/include/libpng16 -I/usr/include/dbus-1.0 -I/usr/lib/dbus-1.0/include -DHAVE_DBUS -O2 -fwrapv -pipe -Wformat -Werror=format-security -gdwarf-4 -fno-debug-types-section -fvar-tracking-assignments -g2 -Wp,-D_FORTIFY_SOURCE=2 -fstack-protector --param=ssp-buffer-size=4 -fomit-frame-pointer -march=i486 -fasynchronous-unwind-tables -gdwarf-4 -fno-debug-types-section -fvar-tracking-assignments -g2 -Wall -pedantic -std=gnu99 -D_GNU_SOURCE -MT libcupsfilters_la-check.lo -MD -MP -MF .deps/libcupsfilters_la-check.Tpo -c cupsfilters/check.c -o libcupsfilters_la-check.o >/dev/null 2>&1
libtool: compile:  i486-pld-linux-gcc -DHAVE_CONFIG_H -I. -I/usr/include/libpng16 -I/usr/include/dbus-1.0 -I/usr/lib/dbus-1.0/include -DHAVE_DBUS -O2 -fwrapv -pipe -Wformat -Werror=format-security -gdwarf-4 -fno-debug-types-section -fvar-tracking-assignments -g2 -Wp,-D_FORTIFY_SOURCE=2 -fstack-protector --param=ssp-buffer-size=4 -fomit-frame-pointer -march=i486 -fasynchronous-unwind-tables -gdwarf-4 -fno-debug-types-section -fvar-tracking-assignments -g2 -Wall -pedantic -std=gnu99 -D_GNU_SOURCE -MT libcupsfilters_la-attr.lo -MD -MP -MF .deps/libcupsfilters_la-attr.Tpo -c cupsfilters/attr.c -o libcupsfilters_la-attr.o >/dev/null 2>&1
libtool: compile:  i486-pld-linux-gcc -DHAVE_CONFIG_H -I. -I/usr/include/libpng16 -I/usr/include/dbus-1.0 -I/usr/lib/dbus-1.0/include -DHAVE_DBUS -O2 -fwrapv -pipe -Wformat -Werror=format-security -gdwarf-4 -fno-debug-types-section -fvar-tracking-assignments -g2 -Wp,-D_FORTIFY_SOURCE=2 -fstack-protector --param=ssp-buffer-size=4 -fomit-frame-pointer -march=i486 -fasynchronous-unwind-tables -gdwarf-4 -fno-debug-types-section -fvar-tracking-assignments -g2 -Wall -pedantic -std=gnu99 -D_GNU_SOURCE -MT libcupsfilters_la-dither.lo -MD -MP -MF .deps/libcupsfilters_la-dither.Tpo -c cupsfilters/dither.c -o libcupsfilters_la-dither.o >/dev/null 2>&1
libtool: compile:  i486-pld-linux-gcc -DHAVE_CONFIG_H -I. -I/usr/include/libpng16 -I/usr/include/dbus-1.0 -I/usr/lib/dbus-1.0/include -DHAVE_DBUS -O2 -fwrapv -pipe -Wformat -Werror=format-security -gdwarf-4 -fno-debug-types-section -fvar-tracking-assignments -g2 -Wp,-D_FORTIFY_SOURCE=2 -fstack-protector --param=ssp-buffer-size=4 -fomit-frame-pointer -march=i486 -fasynchronous-unwind-tables -gdwarf-4 -fno-debug-types-section -fvar-tracking-assignments -g2 -Wall -pedantic -std=gnu99 -D_GNU_SOURCE -MT libcupsfilters_la-colord.lo -MD -MP -MF .deps/libcupsfilters_la-colord.Tpo -c cupsfilters/colord.c -o libcupsfilters_la-colord.o >/dev/null 2>&1
libtool: compile:  i486-pld-linux-gcc -DHAVE_CONFIG_H -I. -I/usr/include/libpng16 -I/usr/include/dbus-1.0 -I/usr/lib/dbus-1.0/include -DHAVE_DBUS -O2 -fwrapv -pipe -Wformat -Werror=format-security -gdwarf-4 -fno-debug-types-section -fvar-tracking-assignments -g2 -Wp,-D_FORTIFY_SOURCE=2 -fstack-protector --param=ssp-buffer-size=4 -fomit-frame-pointer -march=i486 -fasynchronous-unwind-tables -gdwarf-4 -fno-debug-types-section -fvar-tracking-assignments -g2 -Wall -pedantic -std=gnu99 -D_GNU_SOURCE -MT libcupsfilters_la-image-bmp.lo -MD -MP -MF .deps/libcupsfilters_la-image-bmp.Tpo -c cupsfilters/image-bmp.c -o libcupsfilters_la-image-bmp.o >/dev/null 2>&1
mv -f .deps/libcupsfilters_la-check.Tpo .deps/libcupsfilters_la-check.Plo
mv -f .deps/libcupsfilters_la-attr.Tpo .deps/libcupsfilters_la-attr.Plo
/bin/sh ./libtool  --tag=CC   --mode=compile i486-pld-linux-gcc -DHAVE_CONFIG_H -I.      -I/usr/include/libpng16   -I/usr/include/dbus-1.0 -I/usr/lib/dbus-1.0/include  -DHAVE_DBUS -O2 -fwrapv -pipe -Wformat -Werror=format-security -gdwarf-4 -fno-debug-types-section -fvar-tracking-assignments -g2 -Wp,-D_FORTIFY_SOURCE=2 -fstack-protector --param=ssp-buffer-size=4 -fomit-frame-pointer -march=i486 -fasynchronous-unwind-tables -gdwarf-4 -fno-debug-types-section -fvar-tracking-assignments -g2  -Wall -pedantic -std=gnu99 -D_GNU_SOURCE -MT libcupsfilters_la-image-jpeg.lo -MD -MP -MF .deps/libcupsfilters_la-image-jpeg.Tpo -c -o libcupsfilters_la-image-jpeg.lo `test -f 'cupsfilters/image-jpeg.c' || echo './'`cupsfilters/image-jpeg.c
/bin/sh ./libtool  --tag=CC   --mode=compile i486-pld-linux-gcc -DHAVE_CONFIG_H -I.      -I/usr/include/libpng16   -I/usr/include/dbus-1.0 -I/usr/lib/dbus-1.0/include  -DHAVE_DBUS -O2 -fwrapv -pipe -Wformat -Werror=format-security -gdwarf-4 -fno-debug-types-section -fvar-tracking-assignments -g2 -Wp,-D_FORTIFY_SOURCE=2 -fstack-protector --param=ssp-buffer-size=4 -fomit-frame-pointer -march=i486 -fasynchronous-unwind-tables -gdwarf-4 -fno-debug-types-section -fvar-tracking-assignments -g2  -Wall -pedantic -std=gnu99 -D_GNU_SOURCE -MT libcupsfilters_la-image-photocd.lo -MD -MP -MF .deps/libcupsfilters_la-image-photocd.Tpo -c -o libcupsfilters_la-image-photocd.lo `test -f 'cupsfilters/image-photocd.c' || echo './'`cupsfilters/image-photocd.c
libtool: compile:  i486-pld-linux-gcc -DHAVE_CONFIG_H -I. -I/usr/include/libpng16 -I/usr/include/dbus-1.0 -I/usr/lib/dbus-1.0/include -DHAVE_DBUS -O2 -fwrapv -pipe -Wformat -Werror=format-security -gdwarf-4 -fno-debug-types-section -fvar-tracking-assignments -g2 -Wp,-D_FORTIFY_SOURCE=2 -fstack-protector --param=ssp-buffer-size=4 -fomit-frame-pointer -march=i486 -fasynchronous-unwind-tables -gdwarf-4 -fno-debug-types-section -fvar-tracking-assignments -g2 -Wall -pedantic -std=gnu99 -D_GNU_SOURCE -MT libcupsfilters_la-image-photocd.lo -MD -MP -MF .deps/libcupsfilters_la-image-photocd.Tpo -c cupsfilters/image-photocd.c  -fPIC -DPIC -o .libs/libcupsfilters_la-image-photocd.o
libtool: compile:  i486-pld-linux-gcc -DHAVE_CONFIG_H -I. -I/usr/include/libpng16 -I/usr/include/dbus-1.0 -I/usr/lib/dbus-1.0/include -DHAVE_DBUS -O2 -fwrapv -pipe -Wformat -Werror=format-security -gdwarf-4 -fno-debug-types-section -fvar-tracking-assignments -g2 -Wp,-D_FORTIFY_SOURCE=2 -fstack-protector --param=ssp-buffer-size=4 -fomit-frame-pointer -march=i486 -fasynchronous-unwind-tables -gdwarf-4 -fno-debug-types-section -fvar-tracking-assignments -g2 -Wall -pedantic -std=gnu99 -D_GNU_SOURCE -MT libcupsfilters_la-image-jpeg.lo -MD -MP -MF .deps/libcupsfilters_la-image-jpeg.Tpo -c cupsfilters/image-jpeg.c  -fPIC -DPIC -o .libs/libcupsfilters_la-image-jpeg.o
libtool: compile:  i486-pld-linux-gcc -DHAVE_CONFIG_H -I. -I/usr/include/libpng16 -I/usr/include/dbus-1.0 -I/usr/lib/dbus-1.0/include -DHAVE_DBUS -O2 -fwrapv -pipe -Wformat -Werror=format-security -gdwarf-4 -fno-debug-types-section -fvar-tracking-assignments -g2 -Wp,-D_FORTIFY_SOURCE=2 -fstack-protector --param=ssp-buffer-size=4 -fomit-frame-pointer -march=i486 -fasynchronous-unwind-tables -gdwarf-4 -fno-debug-types-section -fvar-tracking-assignments -g2 -Wall -pedantic -std=gnu99 -D_GNU_SOURCE -MT libcupsfilters_la-image-gif.lo -MD -MP -MF .deps/libcupsfilters_la-image-gif.Tpo -c cupsfilters/image-gif.c -o libcupsfilters_la-image-gif.o >/dev/null 2>&1
mv -f .deps/libcupsfilters_la-dither.Tpo .deps/libcupsfilters_la-dither.Plo
libtool: compile:  i486-pld-linux-gcc -DHAVE_CONFIG_H -I. -I/usr/include/libpng16 -I/usr/include/dbus-1.0 -I/usr/lib/dbus-1.0/include -DHAVE_DBUS -O2 -fwrapv -pipe -Wformat -Werror=format-security -gdwarf-4 -fno-debug-types-section -fvar-tracking-assignments -g2 -Wp,-D_FORTIFY_SOURCE=2 -fstack-protector --param=ssp-buffer-size=4 -fomit-frame-pointer -march=i486 -fasynchronous-unwind-tables -gdwarf-4 -fno-debug-types-section -fvar-tracking-assignments -g2 -Wall -pedantic -std=gnu99 -D_GNU_SOURCE -MT libcupsfilters_la-image.lo -MD -MP -MF .deps/libcupsfilters_la-image.Tpo -c cupsfilters/image.c -o libcupsfilters_la-image.o >/dev/null 2>&1
/bin/sh ./libtool  --tag=CC   --mode=compile i486-pld-linux-gcc -DHAVE_CONFIG_H -I.      -I/usr/include/libpng16   -I/usr/include/dbus-1.0 -I/usr/lib/dbus-1.0/include  -DHAVE_DBUS -O2 -fwrapv -pipe -Wformat -Werror=format-security -gdwarf-4 -fno-debug-types-section -fvar-tracking-assignments -g2 -Wp,-D_FORTIFY_SOURCE=2 -fstack-protector --param=ssp-buffer-size=4 -fomit-frame-pointer -march=i486 -fasynchronous-unwind-tables -gdwarf-4 -fno-debug-types-section -fvar-tracking-assignments -g2  -Wall -pedantic -std=gnu99 -D_GNU_SOURCE -MT libcupsfilters_la-image-pix.lo -MD -MP -MF .deps/libcupsfilters_la-image-pix.Tpo -c -o libcupsfilters_la-image-pix.lo `test -f 'cupsfilters/image-pix.c' || echo './'`cupsfilters/image-pix.c
libtool: compile:  i486-pld-linux-gcc -DHAVE_CONFIG_H -I. -I/usr/include/libpng16 -I/usr/include/dbus-1.0 -I/usr/lib/dbus-1.0/include -DHAVE_DBUS -O2 -fwrapv -pipe -Wformat -Werror=format-security -gdwarf-4 -fno-debug-types-section -fvar-tracking-assignments -g2 -Wp,-D_FORTIFY_SOURCE=2 -fstack-protector --param=ssp-buffer-size=4 -fomit-frame-pointer -march=i486 -fasynchronous-unwind-tables -gdwarf-4 -fno-debug-types-section -fvar-tracking-assignments -g2 -Wall -pedantic -std=gnu99 -D_GNU_SOURCE -MT libcupsfilters_la-image-pix.lo -MD -MP -MF .deps/libcupsfilters_la-image-pix.Tpo -c cupsfilters/image-pix.c  -fPIC -DPIC -o .libs/libcupsfilters_la-image-pix.o
In file included from cupsfilters/image-private.h:27:0,
                 from cupsfilters/image-photocd.c:30:
./config.h:56:0: warning: "HAVE_DBUS" redefined [enabled by default]
 #define HAVE_DBUS /**/
 ^
<command-line>:0:0: note: this is the location of the previous definition
In file included from cupsfilters/image-private.h:27:0,
                 from cupsfilters/image-jpeg.c:26:
./config.h:56:0: warning: "HAVE_DBUS" redefined [enabled by default]
 #define HAVE_DBUS /**/
 ^
<command-line>:0:0: note: this is the location of the previous definition
In file included from cupsfilters/image-private.h:27:0,
                 from cupsfilters/image-pix.c:27:
./config.h:56:0: warning: "HAVE_DBUS" redefined [enabled by default]
 #define HAVE_DBUS /**/
 ^
<command-line>:0:0: note: this is the location of the previous definition
mv -f .deps/libcupsfilters_la-colord.Tpo .deps/libcupsfilters_la-colord.Plo
/bin/sh ./libtool  --tag=CC   --mode=compile i486-pld-linux-gcc -DHAVE_CONFIG_H -I.      -I/usr/include/libpng16   -I/usr/include/dbus-1.0 -I/usr/lib/dbus-1.0/include  -DHAVE_DBUS -O2 -fwrapv -pipe -Wformat -Werror=format-security -gdwarf-4 -fno-debug-types-section -fvar-tracking-assignments -g2 -Wp,-D_FORTIFY_SOURCE=2 -fstack-protector --param=ssp-buffer-size=4 -fomit-frame-pointer -march=i486 -fasynchronous-unwind-tables -gdwarf-4 -fno-debug-types-section -fvar-tracking-assignments -g2  -Wall -pedantic -std=gnu99 -D_GNU_SOURCE -MT libcupsfilters_la-image-png.lo -MD -MP -MF .deps/libcupsfilters_la-image-png.Tpo -c -o libcupsfilters_la-image-png.lo `test -f 'cupsfilters/image-png.c' || echo './'`cupsfilters/image-png.c
mv -f .deps/libcupsfilters_la-image-bmp.Tpo .deps/libcupsfilters_la-image-bmp.Plo
libtool: compile:  i486-pld-linux-gcc -DHAVE_CONFIG_H -I. -I/usr/include/libpng16 -I/usr/include/dbus-1.0 -I/usr/lib/dbus-1.0/include -DHAVE_DBUS -O2 -fwrapv -pipe -Wformat -Werror=format-security -gdwarf-4 -fno-debug-types-section -fvar-tracking-assignments -g2 -Wp,-D_FORTIFY_SOURCE=2 -fstack-protector --param=ssp-buffer-size=4 -fomit-frame-pointer -march=i486 -fasynchronous-unwind-tables -gdwarf-4 -fno-debug-types-section -fvar-tracking-assignments -g2 -Wall -pedantic -std=gnu99 -D_GNU_SOURCE -MT libcupsfilters_la-image-photocd.lo -MD -MP -MF .deps/libcupsfilters_la-image-photocd.Tpo -c cupsfilters/image-photocd.c -o libcupsfilters_la-image-photocd.o >/dev/null 2>&1
/bin/sh ./libtool  --tag=CC   --mode=compile i486-pld-linux-gcc -DHAVE_CONFIG_H -I.      -I/usr/include/libpng16   -I/usr/include/dbus-1.0 -I/usr/lib/dbus-1.0/include  -DHAVE_DBUS -O2 -fwrapv -pipe -Wformat -Werror=format-security -gdwarf-4 -fno-debug-types-section -fvar-tracking-assignments -g2 -Wp,-D_FORTIFY_SOURCE=2 -fstack-protector --param=ssp-buffer-size=4 -fomit-frame-pointer -march=i486 -fasynchronous-unwind-tables -gdwarf-4 -fno-debug-types-section -fvar-tracking-assignments -g2  -Wall -pedantic -std=gnu99 -D_GNU_SOURCE -MT libcupsfilters_la-image-pnm.lo -MD -MP -MF .deps/libcupsfilters_la-image-pnm.Tpo -c -o libcupsfilters_la-image-pnm.lo `test -f 'cupsfilters/image-pnm.c' || echo './'`cupsfilters/image-pnm.c
libtool: compile:  i486-pld-linux-gcc -DHAVE_CONFIG_H -I. -I/usr/include/libpng16 -I/usr/include/dbus-1.0 -I/usr/lib/dbus-1.0/include -DHAVE_DBUS -O2 -fwrapv -pipe -Wformat -Werror=format-security -gdwarf-4 -fno-debug-types-section -fvar-tracking-assignments -g2 -Wp,-D_FORTIFY_SOURCE=2 -fstack-protector --param=ssp-buffer-size=4 -fomit-frame-pointer -march=i486 -fasynchronous-unwind-tables -gdwarf-4 -fno-debug-types-section -fvar-tracking-assignments -g2 -Wall -pedantic -std=gnu99 -D_GNU_SOURCE -MT libcupsfilters_la-image-jpeg.lo -MD -MP -MF .deps/libcupsfilters_la-image-jpeg.Tpo -c cupsfilters/image-jpeg.c -o libcupsfilters_la-image-jpeg.o >/dev/null 2>&1
libtool: compile:  i486-pld-linux-gcc -DHAVE_CONFIG_H -I. -I/usr/include/libpng16 -I/usr/include/dbus-1.0 -I/usr/lib/dbus-1.0/include -DHAVE_DBUS -O2 -fwrapv -pipe -Wformat -Werror=format-security -gdwarf-4 -fno-debug-types-section -fvar-tracking-assignments -g2 -Wp,-D_FORTIFY_SOURCE=2 -fstack-protector --param=ssp-buffer-size=4 -fomit-frame-pointer -march=i486 -fasynchronous-unwind-tables -gdwarf-4 -fno-debug-types-section -fvar-tracking-assignments -g2 -Wall -pedantic -std=gnu99 -D_GNU_SOURCE -MT libcupsfilters_la-image-png.lo -MD -MP -MF .deps/libcupsfilters_la-image-png.Tpo -c cupsfilters/image-png.c  -fPIC -DPIC -o .libs/libcupsfilters_la-image-png.o
libtool: compile:  i486-pld-linux-gcc -DHAVE_CONFIG_H -I. -I/usr/include/libpng16 -I/usr/include/dbus-1.0 -I/usr/lib/dbus-1.0/include -DHAVE_DBUS -O2 -fwrapv -pipe -Wformat -Werror=format-security -gdwarf-4 -fno-debug-types-section -fvar-tracking-assignments -g2 -Wp,-D_FORTIFY_SOURCE=2 -fstack-protector --param=ssp-buffer-size=4 -fomit-frame-pointer -march=i486 -fasynchronous-unwind-tables -gdwarf-4 -fno-debug-types-section -fvar-tracking-assignments -g2 -Wall -pedantic -std=gnu99 -D_GNU_SOURCE -MT libcupsfilters_la-image-pix.lo -MD -MP -MF .deps/libcupsfilters_la-image-pix.Tpo -c cupsfilters/image-pix.c -o libcupsfilters_la-image-pix.o >/dev/null 2>&1
libtool: compile:  i486-pld-linux-gcc -DHAVE_CONFIG_H -I. -I/usr/include/libpng16 -I/usr/include/dbus-1.0 -I/usr/lib/dbus-1.0/include -DHAVE_DBUS -O2 -fwrapv -pipe -Wformat -Werror=format-security -gdwarf-4 -fno-debug-types-section -fvar-tracking-assignments -g2 -Wp,-D_FORTIFY_SOURCE=2 -fstack-protector --param=ssp-buffer-size=4 -fomit-frame-pointer -march=i486 -fasynchronous-unwind-tables -gdwarf-4 -fno-debug-types-section -fvar-tracking-assignments -g2 -Wall -pedantic -std=gnu99 -D_GNU_SOURCE -MT libcupsfilters_la-image-pnm.lo -MD -MP -MF .deps/libcupsfilters_la-image-pnm.Tpo -c cupsfilters/image-pnm.c  -fPIC -DPIC -o .libs/libcupsfilters_la-image-pnm.o
In file included from cupsfilters/image-private.h:27:0,
                 from cupsfilters/image-png.c:26:
./config.h:56:0: warning: "HAVE_DBUS" redefined [enabled by default]
 #define HAVE_DBUS /**/
 ^
<command-line>:0:0: note: this is the location of the previous definition
In file included from cupsfilters/image-private.h:27:0,
                 from cupsfilters/image-pnm.c:26:
./config.h:56:0: warning: "HAVE_DBUS" redefined [enabled by default]
 #define HAVE_DBUS /**/
 ^
<command-line>:0:0: note: this is the location of the previous definition
cupsfilters/image-pnm.c: In function '_cupsImageReadPNM':
cupsfilters/image-pnm.c:205:16: warning: ignoring return value of 'fread', declared with attribute warn_unused_result [-Wunused-result]
           fread(out, (img->xsize + 7) / 8, 1, fp);
                ^
cupsfilters/image-pnm.c:226:16: warning: ignoring return value of 'fread', declared with attribute warn_unused_result [-Wunused-result]
           fread(in, img->xsize, 1, fp);
                ^
cupsfilters/image-pnm.c:230:16: warning: ignoring return value of 'fread', declared with attribute warn_unused_result [-Wunused-result]
           fread(in, img->xsize, 3, fp);
                ^
mv -f .deps/libcupsfilters_la-image-gif.Tpo .deps/libcupsfilters_la-image-gif.Plo
/bin/sh ./libtool  --tag=CC   --mode=compile i486-pld-linux-gcc -DHAVE_CONFIG_H -I.      -I/usr/include/libpng16   -I/usr/include/dbus-1.0 -I/usr/lib/dbus-1.0/include  -DHAVE_DBUS -O2 -fwrapv -pipe -Wformat -Werror=format-security -gdwarf-4 -fno-debug-types-section -fvar-tracking-assignments -g2 -Wp,-D_FORTIFY_SOURCE=2 -fstack-protector --param=ssp-buffer-size=4 -fomit-frame-pointer -march=i486 -fasynchronous-unwind-tables -gdwarf-4 -fno-debug-types-section -fvar-tracking-assignments -g2  -Wall -pedantic -std=gnu99 -D_GNU_SOURCE -MT libcupsfilters_la-image-sgi.lo -MD -MP -MF .deps/libcupsfilters_la-image-sgi.Tpo -c -o libcupsfilters_la-image-sgi.lo `test -f 'cupsfilters/image-sgi.c' || echo './'`cupsfilters/image-sgi.c
mv -f .deps/libcupsfilters_la-image.Tpo .deps/libcupsfilters_la-image.Plo
/bin/sh ./libtool  --tag=CC   --mode=compile i486-pld-linux-gcc -DHAVE_CONFIG_H -I.      -I/usr/include/libpng16   -I/usr/include/dbus-1.0 -I/usr/lib/dbus-1.0/include  -DHAVE_DBUS -O2 -fwrapv -pipe -Wformat -Werror=format-security -gdwarf-4 -fno-debug-types-section -fvar-tracking-assignments -g2 -Wp,-D_FORTIFY_SOURCE=2 -fstack-protector --param=ssp-buffer-size=4 -fomit-frame-pointer -march=i486 -fasynchronous-unwind-tables -gdwarf-4 -fno-debug-types-section -fvar-tracking-assignments -g2  -Wall -pedantic -std=gnu99 -D_GNU_SOURCE -MT libcupsfilters_la-image-sgilib.lo -MD -MP -MF .deps/libcupsfilters_la-image-sgilib.Tpo -c -o libcupsfilters_la-image-sgilib.lo `test -f 'cupsfilters/image-sgilib.c' || echo './'`cupsfilters/image-sgilib.c
libtool: compile:  i486-pld-linux-gcc -DHAVE_CONFIG_H -I. -I/usr/include/libpng16 -I/usr/include/dbus-1.0 -I/usr/lib/dbus-1.0/include -DHAVE_DBUS -O2 -fwrapv -pipe -Wformat -Werror=format-security -gdwarf-4 -fno-debug-types-section -fvar-tracking-assignments -g2 -Wp,-D_FORTIFY_SOURCE=2 -fstack-protector --param=ssp-buffer-size=4 -fomit-frame-pointer -march=i486 -fasynchronous-unwind-tables -gdwarf-4 -fno-debug-types-section -fvar-tracking-assignments -g2 -Wall -pedantic -std=gnu99 -D_GNU_SOURCE -MT libcupsfilters_la-image-sgi.lo -MD -MP -MF .deps/libcupsfilters_la-image-sgi.Tpo -c cupsfilters/image-sgi.c  -fPIC -DPIC -o .libs/libcupsfilters_la-image-sgi.o
mv -f .deps/libcupsfilters_la-image-jpeg.Tpo .deps/libcupsfilters_la-image-jpeg.Plo
/bin/sh ./libtool  --tag=CC   --mode=compile i486-pld-linux-gcc -DHAVE_CONFIG_H -I.      -I/usr/include/libpng16   -I/usr/include/dbus-1.0 -I/usr/lib/dbus-1.0/include  -DHAVE_DBUS -O2 -fwrapv -pipe -Wformat -Werror=format-security -gdwarf-4 -fno-debug-types-section -fvar-tracking-assignments -g2 -Wp,-D_FORTIFY_SOURCE=2 -fstack-protector --param=ssp-buffer-size=4 -fomit-frame-pointer -march=i486 -fasynchronous-unwind-tables -gdwarf-4 -fno-debug-types-section -fvar-tracking-assignments -g2  -Wall -pedantic -std=gnu99 -D_GNU_SOURCE -MT libcupsfilters_la-image-sun.lo -MD -MP -MF .deps/libcupsfilters_la-image-sun.Tpo -c -o libcupsfilters_la-image-sun.lo `test -f 'cupsfilters/image-sun.c' || echo './'`cupsfilters/image-sun.c
libtool: compile:  i486-pld-linux-gcc -DHAVE_CONFIG_H -I. -I/usr/include/libpng16 -I/usr/include/dbus-1.0 -I/usr/lib/dbus-1.0/include -DHAVE_DBUS -O2 -fwrapv -pipe -Wformat -Werror=format-security -gdwarf-4 -fno-debug-types-section -fvar-tracking-assignments -g2 -Wp,-D_FORTIFY_SOURCE=2 -fstack-protector --param=ssp-buffer-size=4 -fomit-frame-pointer -march=i486 -fasynchronous-unwind-tables -gdwarf-4 -fno-debug-types-section -fvar-tracking-assignments -g2 -Wall -pedantic -std=gnu99 -D_GNU_SOURCE -MT libcupsfilters_la-image-sgilib.lo -MD -MP -MF .deps/libcupsfilters_la-image-sgilib.Tpo -c cupsfilters/image-sgilib.c  -fPIC -DPIC -o .libs/libcupsfilters_la-image-sgilib.o
mv -f .deps/libcupsfilters_la-image-photocd.Tpo .deps/libcupsfilters_la-image-photocd.Plo
/bin/sh ./libtool  --tag=CC   --mode=compile i486-pld-linux-gcc -DHAVE_CONFIG_H -I.      -I/usr/include/libpng16   -I/usr/include/dbus-1.0 -I/usr/lib/dbus-1.0/include  -DHAVE_DBUS -O2 -fwrapv -pipe -Wformat -Werror=format-security -gdwarf-4 -fno-debug-types-section -fvar-tracking-assignments -g2 -Wp,-D_FORTIFY_SOURCE=2 -fstack-protector --param=ssp-buffer-size=4 -fomit-frame-pointer -march=i486 -fasynchronous-unwind-tables -gdwarf-4 -fno-debug-types-section -fvar-tracking-assignments -g2  -Wall -pedantic -std=gnu99 -D_GNU_SOURCE -MT libcupsfilters_la-image-tiff.lo -MD -MP -MF .deps/libcupsfilters_la-image-tiff.Tpo -c -o libcupsfilters_la-image-tiff.lo `test -f 'cupsfilters/image-tiff.c' || echo './'`cupsfilters/image-tiff.c
mv -f .deps/libcupsfilters_la-image-pix.Tpo .deps/libcupsfilters_la-image-pix.Plo
/bin/sh ./libtool  --tag=CC   --mode=compile i486-pld-linux-gcc -DHAVE_CONFIG_H -I.      -I/usr/include/libpng16   -I/usr/include/dbus-1.0 -I/usr/lib/dbus-1.0/include  -DHAVE_DBUS -O2 -fwrapv -pipe -Wformat -Werror=format-security -gdwarf-4 -fno-debug-types-section -fvar-tracking-assignments -g2 -Wp,-D_FORTIFY_SOURCE=2 -fstack-protector --param=ssp-buffer-size=4 -fomit-frame-pointer -march=i486 -fasynchronous-unwind-tables -gdwarf-4 -fno-debug-types-section -fvar-tracking-assignments -g2  -Wall -pedantic -std=gnu99 -D_GNU_SOURCE -MT libcupsfilters_la-image-zoom.lo -MD -MP -MF .deps/libcupsfilters_la-image-zoom.Tpo -c -o libcupsfilters_la-image-zoom.lo `test -f 'cupsfilters/image-zoom.c' || echo './'`cupsfilters/image-zoom.c
libtool: compile:  i486-pld-linux-gcc -DHAVE_CONFIG_H -I. -I/usr/include/libpng16 -I/usr/include/dbus-1.0 -I/usr/lib/dbus-1.0/include -DHAVE_DBUS -O2 -fwrapv -pipe -Wformat -Werror=format-security -gdwarf-4 -fno-debug-types-section -fvar-tracking-assignments -g2 -Wp,-D_FORTIFY_SOURCE=2 -fstack-protector --param=ssp-buffer-size=4 -fomit-frame-pointer -march=i486 -fasynchronous-unwind-tables -gdwarf-4 -fno-debug-types-section -fvar-tracking-assignments -g2 -Wall -pedantic -std=gnu99 -D_GNU_SOURCE -MT libcupsfilters_la-image-sun.lo -MD -MP -MF .deps/libcupsfilters_la-image-sun.Tpo -c cupsfilters/image-sun.c  -fPIC -DPIC -o .libs/libcupsfilters_la-image-sun.o
libtool: compile:  i486-pld-linux-gcc -DHAVE_CONFIG_H -I. -I/usr/include/libpng16 -I/usr/include/dbus-1.0 -I/usr/lib/dbus-1.0/include -DHAVE_DBUS -O2 -fwrapv -pipe -Wformat -Werror=format-security -gdwarf-4 -fno-debug-types-section -fvar-tracking-assignments -g2 -Wp,-D_FORTIFY_SOURCE=2 -fstack-protector --param=ssp-buffer-size=4 -fomit-frame-pointer -march=i486 -fasynchronous-unwind-tables -gdwarf-4 -fno-debug-types-section -fvar-tracking-assignments -g2 -Wall -pedantic -std=gnu99 -D_GNU_SOURCE -MT libcupsfilters_la-image-tiff.lo -MD -MP -MF .deps/libcupsfilters_la-image-tiff.Tpo -c cupsfilters/image-tiff.c  -fPIC -DPIC -o .libs/libcupsfilters_la-image-tiff.o
In file included from cupsfilters/image-private.h:27:0,
                 from cupsfilters/image-sgi.c:26:
./config.h:56:0: warning: "HAVE_DBUS" redefined [enabled by default]
 #define HAVE_DBUS /**/
 ^
<command-line>:0:0: note: this is the location of the previous definition
libtool: compile:  i486-pld-linux-gcc -DHAVE_CONFIG_H -I. -I/usr/include/libpng16 -I/usr/include/dbus-1.0 -I/usr/lib/dbus-1.0/include -DHAVE_DBUS -O2 -fwrapv -pipe -Wformat -Werror=format-security -gdwarf-4 -fno-debug-types-section -fvar-tracking-assignments -g2 -Wp,-D_FORTIFY_SOURCE=2 -fstack-protector --param=ssp-buffer-size=4 -fomit-frame-pointer -march=i486 -fasynchronous-unwind-tables -gdwarf-4 -fno-debug-types-section -fvar-tracking-assignments -g2 -Wall -pedantic -std=gnu99 -D_GNU_SOURCE -MT libcupsfilters_la-image-pnm.lo -MD -MP -MF .deps/libcupsfilters_la-image-pnm.Tpo -c cupsfilters/image-pnm.c -o libcupsfilters_la-image-pnm.o >/dev/null 2>&1
libtool: compile:  i486-pld-linux-gcc -DHAVE_CONFIG_H -I. -I/usr/include/libpng16 -I/usr/include/dbus-1.0 -I/usr/lib/dbus-1.0/include -DHAVE_DBUS -O2 -fwrapv -pipe -Wformat -Werror=format-security -gdwarf-4 -fno-debug-types-section -fvar-tracking-assignments -g2 -Wp,-D_FORTIFY_SOURCE=2 -fstack-protector --param=ssp-buffer-size=4 -fomit-frame-pointer -march=i486 -fasynchronous-unwind-tables -gdwarf-4 -fno-debug-types-section -fvar-tracking-assignments -g2 -Wall -pedantic -std=gnu99 -D_GNU_SOURCE -MT libcupsfilters_la-image-png.lo -MD -MP -MF .deps/libcupsfilters_la-image-png.Tpo -c cupsfilters/image-png.c -o libcupsfilters_la-image-png.o >/dev/null 2>&1
cupsfilters/image-sgilib.c: In function 'getshort':
cupsfilters/image-sgilib.c:569:8: warning: ignoring return value of 'fread', declared with attribute warn_unused_result [-Wunused-result]
   fread(b, 2, 1, fp);
        ^
cupsfilters/image-sgilib.c: In function 'getlong':
cupsfilters/image-sgilib.c:554:8: warning: ignoring return value of 'fread', declared with attribute warn_unused_result [-Wunused-result]
   fread(b, 4, 1, fp);
        ^
libtool: compile:  i486-pld-linux-gcc -DHAVE_CONFIG_H -I. -I/usr/include/libpng16 -I/usr/include/dbus-1.0 -I/usr/lib/dbus-1.0/include -DHAVE_DBUS -O2 -fwrapv -pipe -Wformat -Werror=format-security -gdwarf-4 -fno-debug-types-section -fvar-tracking-assignments -g2 -Wp,-D_FORTIFY_SOURCE=2 -fstack-protector --param=ssp-buffer-size=4 -fomit-frame-pointer -march=i486 -fasynchronous-unwind-tables -gdwarf-4 -fno-debug-types-section -fvar-tracking-assignments -g2 -Wall -pedantic -std=gnu99 -D_GNU_SOURCE -MT libcupsfilters_la-image-colorspace.lo -MD -MP -MF .deps/libcupsfilters_la-image-colorspace.Tpo -c cupsfilters/image-colorspace.c -o libcupsfilters_la-image-colorspace.o >/dev/null 2>&1
libtool: compile:  i486-pld-linux-gcc -DHAVE_CONFIG_H -I. -I/usr/include/libpng16 -I/usr/include/dbus-1.0 -I/usr/lib/dbus-1.0/include -DHAVE_DBUS -O2 -fwrapv -pipe -Wformat -Werror=format-security -gdwarf-4 -fno-debug-types-section -fvar-tracking-assignments -g2 -Wp,-D_FORTIFY_SOURCE=2 -fstack-protector --param=ssp-buffer-size=4 -fomit-frame-pointer -march=i486 -fasynchronous-unwind-tables -gdwarf-4 -fno-debug-types-section -fvar-tracking-assignments -g2 -Wall -pedantic -std=gnu99 -D_GNU_SOURCE -MT libcupsfilters_la-image-zoom.lo -MD -MP -MF .deps/libcupsfilters_la-image-zoom.Tpo -c cupsfilters/image-zoom.c  -fPIC -DPIC -o .libs/libcupsfilters_la-image-zoom.o
In file included from cupsfilters/image-private.h:27:0,
                 from cupsfilters/image-sun.c:27:
./config.h:56:0: warning: "HAVE_DBUS" redefined [enabled by default]
 #define HAVE_DBUS /**/
 ^
<command-line>:0:0: note: this is the location of the previous definition
In file included from cupsfilters/image-private.h:27:0,
                 from cupsfilters/image-tiff.c:26:
./config.h:56:0: warning: "HAVE_DBUS" redefined [enabled by default]
 #define HAVE_DBUS /**/
 ^
<command-line>:0:0: note: this is the location of the previous definition
cupsfilters/image-sun.c: In function '_cupsImageReadSunRaster':
cupsfilters/image-sun.c:131:10: warning: ignoring return value of 'fread', declared with attribute warn_unused_result [-Wunused-result]
     fread(cmap[0], 1, ras_maplength / 3, fp);
          ^
cupsfilters/image-sun.c:132:10: warning: ignoring return value of 'fread', declared with attribute warn_unused_result [-Wunused-result]
     fread(cmap[1], 1, ras_maplength / 3, fp);
          ^
cupsfilters/image-sun.c:133:10: warning: ignoring return value of 'fread', declared with attribute warn_unused_result [-Wunused-result]
     fread(cmap[2], 1, ras_maplength / 3, fp);
          ^
cupsfilters/image-sun.c:194:12: warning: ignoring return value of 'fread', declared with attribute warn_unused_result [-Wunused-result]
       fread(p, scanwidth, 1, fp);
            ^
In file included from cupsfilters/image-private.h:27:0,
                 from cupsfilters/image-zoom.c:32:
./config.h:56:0: warning: "HAVE_DBUS" redefined [enabled by default]
 #define HAVE_DBUS /**/
 ^
<command-line>:0:0: note: this is the location of the previous definition
libtool: compile:  i486-pld-linux-gcc -DHAVE_CONFIG_H -I. -I/usr/include/libpng16 -I/usr/include/dbus-1.0 -I/usr/lib/dbus-1.0/include -DHAVE_DBUS -O2 -fwrapv -pipe -Wformat -Werror=format-security -gdwarf-4 -fno-debug-types-section -fvar-tracking-assignments -g2 -Wp,-D_FORTIFY_SOURCE=2 -fstack-protector --param=ssp-buffer-size=4 -fomit-frame-pointer -march=i486 -fasynchronous-unwind-tables -gdwarf-4 -fno-debug-types-section -fvar-tracking-assignments -g2 -Wall -pedantic -std=gnu99 -D_GNU_SOURCE -MT libcupsfilters_la-cmyk.lo -MD -MP -MF .deps/libcupsfilters_la-cmyk.Tpo -c cupsfilters/cmyk.c -o libcupsfilters_la-cmyk.o >/dev/null 2>&1
libtool: compile:  i486-pld-linux-gcc -DHAVE_CONFIG_H -I. -I/usr/include/libpng16 -I/usr/include/dbus-1.0 -I/usr/lib/dbus-1.0/include -DHAVE_DBUS -O2 -fwrapv -pipe -Wformat -Werror=format-security -gdwarf-4 -fno-debug-types-section -fvar-tracking-assignments -g2 -Wp,-D_FORTIFY_SOURCE=2 -fstack-protector --param=ssp-buffer-size=4 -fomit-frame-pointer -march=i486 -fasynchronous-unwind-tables -gdwarf-4 -fno-debug-types-section -fvar-tracking-assignments -g2 -Wall -pedantic -std=gnu99 -D_GNU_SOURCE -MT libcupsfilters_la-image-sgi.lo -MD -MP -MF .deps/libcupsfilters_la-image-sgi.Tpo -c cupsfilters/image-sgi.c -o libcupsfilters_la-image-sgi.o >/dev/null 2>&1
libtool: compile:  i486-pld-linux-gcc -DHAVE_CONFIG_H -I. -I/usr/include/libpng16 -I/usr/include/dbus-1.0 -I/usr/lib/dbus-1.0/include -DHAVE_DBUS -O2 -fwrapv -pipe -Wformat -Werror=format-security -gdwarf-4 -fno-debug-types-section -fvar-tracking-assignments -g2 -Wp,-D_FORTIFY_SOURCE=2 -fstack-protector --param=ssp-buffer-size=4 -fomit-frame-pointer -march=i486 -fasynchronous-unwind-tables -gdwarf-4 -fno-debug-types-section -fvar-tracking-assignments -g2 -Wall -pedantic -std=gnu99 -D_GNU_SOURCE -MT libcupsfilters_la-image-sun.lo -MD -MP -MF .deps/libcupsfilters_la-image-sun.Tpo -c cupsfilters/image-sun.c -o libcupsfilters_la-image-sun.o >/dev/null 2>&1
libtool: compile:  i486-pld-linux-gcc -DHAVE_CONFIG_H -I. -I/usr/include/libpng16 -I/usr/include/dbus-1.0 -I/usr/lib/dbus-1.0/include -DHAVE_DBUS -O2 -fwrapv -pipe -Wformat -Werror=format-security -gdwarf-4 -fno-debug-types-section -fvar-tracking-assignments -g2 -Wp,-D_FORTIFY_SOURCE=2 -fstack-protector --param=ssp-buffer-size=4 -fomit-frame-pointer -march=i486 -fasynchronous-unwind-tables -gdwarf-4 -fno-debug-types-section -fvar-tracking-assignments -g2 -Wall -pedantic -std=gnu99 -D_GNU_SOURCE -MT libcupsfilters_la-image-zoom.lo -MD -MP -MF .deps/libcupsfilters_la-image-zoom.Tpo -c cupsfilters/image-zoom.c -o libcupsfilters_la-image-zoom.o >/dev/null 2>&1
mv -f .deps/libcupsfilters_la-image-png.Tpo .deps/libcupsfilters_la-image-png.Plo
/bin/sh ./libtool  --tag=CC   --mode=compile i486-pld-linux-gcc -DHAVE_CONFIG_H -I.      -I/usr/include/libpng16   -I/usr/include/dbus-1.0 -I/usr/lib/dbus-1.0/include  -DHAVE_DBUS -O2 -fwrapv -pipe -Wformat -Werror=format-security -gdwarf-4 -fno-debug-types-section -fvar-tracking-assignments -g2 -Wp,-D_FORTIFY_SOURCE=2 -fstack-protector --param=ssp-buffer-size=4 -fomit-frame-pointer -march=i486 -fasynchronous-unwind-tables -gdwarf-4 -fno-debug-types-section -fvar-tracking-assignments -g2  -Wall -pedantic -std=gnu99 -D_GNU_SOURCE -MT libcupsfilters_la-lut.lo -MD -MP -MF .deps/libcupsfilters_la-lut.Tpo -c -o libcupsfilters_la-lut.lo `test -f 'cupsfilters/lut.c' || echo './'`cupsfilters/lut.c
libtool: compile:  i486-pld-linux-gcc -DHAVE_CONFIG_H -I. -I/usr/include/libpng16 -I/usr/include/dbus-1.0 -I/usr/lib/dbus-1.0/include -DHAVE_DBUS -O2 -fwrapv -pipe -Wformat -Werror=format-security -gdwarf-4 -fno-debug-types-section -fvar-tracking-assignments -g2 -Wp,-D_FORTIFY_SOURCE=2 -fstack-protector --param=ssp-buffer-size=4 -fomit-frame-pointer -march=i486 -fasynchronous-unwind-tables -gdwarf-4 -fno-debug-types-section -fvar-tracking-assignments -g2 -Wall -pedantic -std=gnu99 -D_GNU_SOURCE -MT libcupsfilters_la-lut.lo -MD -MP -MF .deps/libcupsfilters_la-lut.Tpo -c cupsfilters/lut.c  -fPIC -DPIC -o .libs/libcupsfilters_la-lut.o
mv -f .deps/libcupsfilters_la-image-pnm.Tpo .deps/libcupsfilters_la-image-pnm.Plo
/bin/sh ./libtool  --tag=CC   --mode=compile i486-pld-linux-gcc -DHAVE_CONFIG_H -I.      -I/usr/include/libpng16   -I/usr/include/dbus-1.0 -I/usr/lib/dbus-1.0/include  -DHAVE_DBUS -O2 -fwrapv -pipe -Wformat -Werror=format-security -gdwarf-4 -fno-debug-types-section -fvar-tracking-assignments -g2 -Wp,-D_FORTIFY_SOURCE=2 -fstack-protector --param=ssp-buffer-size=4 -fomit-frame-pointer -march=i486 -fasynchronous-unwind-tables -gdwarf-4 -fno-debug-types-section -fvar-tracking-assignments -g2  -Wall -pedantic -std=gnu99 -D_GNU_SOURCE -MT libcupsfilters_la-pack.lo -MD -MP -MF .deps/libcupsfilters_la-pack.Tpo -c -o libcupsfilters_la-pack.lo `test -f 'cupsfilters/pack.c' || echo './'`cupsfilters/pack.c
libtool: compile:  i486-pld-linux-gcc -DHAVE_CONFIG_H -I. -I/usr/include/libpng16 -I/usr/include/dbus-1.0 -I/usr/lib/dbus-1.0/include -DHAVE_DBUS -O2 -fwrapv -pipe -Wformat -Werror=format-security -gdwarf-4 -fno-debug-types-section -fvar-tracking-assignments -g2 -Wp,-D_FORTIFY_SOURCE=2 -fstack-protector --param=ssp-buffer-size=4 -fomit-frame-pointer -march=i486 -fasynchronous-unwind-tables -gdwarf-4 -fno-debug-types-section -fvar-tracking-assignments -g2 -Wall -pedantic -std=gnu99 -D_GNU_SOURCE -MT libcupsfilters_la-image-sgilib.lo -MD -MP -MF .deps/libcupsfilters_la-image-sgilib.Tpo -c cupsfilters/image-sgilib.c -o libcupsfilters_la-image-sgilib.o >/dev/null 2>&1
libtool: compile:  i486-pld-linux-gcc -DHAVE_CONFIG_H -I. -I/usr/include/libpng16 -I/usr/include/dbus-1.0 -I/usr/lib/dbus-1.0/include -DHAVE_DBUS -O2 -fwrapv -pipe -Wformat -Werror=format-security -gdwarf-4 -fno-debug-types-section -fvar-tracking-assignments -g2 -Wp,-D_FORTIFY_SOURCE=2 -fstack-protector --param=ssp-buffer-size=4 -fomit-frame-pointer -march=i486 -fasynchronous-unwind-tables -gdwarf-4 -fno-debug-types-section -fvar-tracking-assignments -g2 -Wall -pedantic -std=gnu99 -D_GNU_SOURCE -MT libcupsfilters_la-pack.lo -MD -MP -MF .deps/libcupsfilters_la-pack.Tpo -c cupsfilters/pack.c  -fPIC -DPIC -o .libs/libcupsfilters_la-pack.o
mv -f .deps/libcupsfilters_la-image-sgi.Tpo .deps/libcupsfilters_la-image-sgi.Plo
mv -f .deps/libcupsfilters_la-image-zoom.Tpo .deps/libcupsfilters_la-image-zoom.Plo
libtool: compile:  i486-pld-linux-gcc -DHAVE_CONFIG_H -I. -I/usr/include/libpng16 -I/usr/include/dbus-1.0 -I/usr/lib/dbus-1.0/include -DHAVE_DBUS -O2 -fwrapv -pipe -Wformat -Werror=format-security -gdwarf-4 -fno-debug-types-section -fvar-tracking-assignments -g2 -Wp,-D_FORTIFY_SOURCE=2 -fstack-protector --param=ssp-buffer-size=4 -fomit-frame-pointer -march=i486 -fasynchronous-unwind-tables -gdwarf-4 -fno-debug-types-section -fvar-tracking-assignments -g2 -Wall -pedantic -std=gnu99 -D_GNU_SOURCE -MT libcupsfilters_la-lut.lo -MD -MP -MF .deps/libcupsfilters_la-lut.Tpo -c cupsfilters/lut.c -o libcupsfilters_la-lut.o >/dev/null 2>&1
/bin/sh ./libtool  --tag=CC   --mode=compile i486-pld-linux-gcc -DHAVE_CONFIG_H -I.      -I/usr/include/libpng16   -I/usr/include/dbus-1.0 -I/usr/lib/dbus-1.0/include  -DHAVE_DBUS -O2 -fwrapv -pipe -Wformat -Werror=format-security -gdwarf-4 -fno-debug-types-section -fvar-tracking-assignments -g2 -Wp,-D_FORTIFY_SOURCE=2 -fstack-protector --param=ssp-buffer-size=4 -fomit-frame-pointer -march=i486 -fasynchronous-unwind-tables -gdwarf-4 -fno-debug-types-section -fvar-tracking-assignments -g2  -Wall -pedantic -std=gnu99 -D_GNU_SOURCE -MT libcupsfilters_la-raster.lo -MD -MP -MF .deps/libcupsfilters_la-raster.Tpo -c -o libcupsfilters_la-raster.lo `test -f 'cupsfilters/raster.c' || echo './'`cupsfilters/raster.c
/bin/sh ./libtool  --tag=CC   --mode=compile i486-pld-linux-gcc -DHAVE_CONFIG_H -I.      -I/usr/include/libpng16   -I/usr/include/dbus-1.0 -I/usr/lib/dbus-1.0/include  -DHAVE_DBUS -O2 -fwrapv -pipe -Wformat -Werror=format-security -gdwarf-4 -fno-debug-types-section -fvar-tracking-assignments -g2 -Wp,-D_FORTIFY_SOURCE=2 -fstack-protector --param=ssp-buffer-size=4 -fomit-frame-pointer -march=i486 -fasynchronous-unwind-tables -gdwarf-4 -fno-debug-types-section -fvar-tracking-assignments -g2  -Wall -pedantic -std=gnu99 -D_GNU_SOURCE -MT libcupsfilters_la-rgb.lo -MD -MP -MF .deps/libcupsfilters_la-rgb.Tpo -c -o libcupsfilters_la-rgb.lo `test -f 'cupsfilters/rgb.c' || echo './'`cupsfilters/rgb.c
libtool: compile:  i486-pld-linux-gcc -DHAVE_CONFIG_H -I. -I/usr/include/libpng16 -I/usr/include/dbus-1.0 -I/usr/lib/dbus-1.0/include -DHAVE_DBUS -O2 -fwrapv -pipe -Wformat -Werror=format-security -gdwarf-4 -fno-debug-types-section -fvar-tracking-assignments -g2 -Wp,-D_FORTIFY_SOURCE=2 -fstack-protector --param=ssp-buffer-size=4 -fomit-frame-pointer -march=i486 -fasynchronous-unwind-tables -gdwarf-4 -fno-debug-types-section -fvar-tracking-assignments -g2 -Wall -pedantic -std=gnu99 -D_GNU_SOURCE -MT libcupsfilters_la-raster.lo -MD -MP -MF .deps/libcupsfilters_la-raster.Tpo -c cupsfilters/raster.c  -fPIC -DPIC -o .libs/libcupsfilters_la-raster.o
libtool: compile:  i486-pld-linux-gcc -DHAVE_CONFIG_H -I. -I/usr/include/libpng16 -I/usr/include/dbus-1.0 -I/usr/lib/dbus-1.0/include -DHAVE_DBUS -O2 -fwrapv -pipe -Wformat -Werror=format-security -gdwarf-4 -fno-debug-types-section -fvar-tracking-assignments -g2 -Wp,-D_FORTIFY_SOURCE=2 -fstack-protector --param=ssp-buffer-size=4 -fomit-frame-pointer -march=i486 -fasynchronous-unwind-tables -gdwarf-4 -fno-debug-types-section -fvar-tracking-assignments -g2 -Wall -pedantic -std=gnu99 -D_GNU_SOURCE -MT libcupsfilters_la-rgb.lo -MD -MP -MF .deps/libcupsfilters_la-rgb.Tpo -c cupsfilters/rgb.c  -fPIC -DPIC -o .libs/libcupsfilters_la-rgb.o
mv -f .deps/libcupsfilters_la-image-sun.Tpo .deps/libcupsfilters_la-image-sun.Plo
/bin/sh ./libtool  --tag=CC   --mode=compile i486-pld-linux-gcc -DHAVE_CONFIG_H -I.      -I/usr/include/libpng16   -I/usr/include/dbus-1.0 -I/usr/lib/dbus-1.0/include  -DHAVE_DBUS -O2 -fwrapv -pipe -Wformat -Werror=format-security -gdwarf-4 -fno-debug-types-section -fvar-tracking-assignments -g2 -Wp,-D_FORTIFY_SOURCE=2 -fstack-protector --param=ssp-buffer-size=4 -fomit-frame-pointer -march=i486 -fasynchronous-unwind-tables -gdwarf-4 -fno-debug-types-section -fvar-tracking-assignments -g2  -Wall -pedantic -std=gnu99 -D_GNU_SOURCE -MT libcupsfilters_la-srgb.lo -MD -MP -MF .deps/libcupsfilters_la-srgb.Tpo -c -o libcupsfilters_la-srgb.lo `test -f 'cupsfilters/srgb.c' || echo './'`cupsfilters/srgb.c
In file included from cupsfilters/raster.c:25:0:
./config.h:56:0: warning: "HAVE_DBUS" redefined [enabled by default]
 #define HAVE_DBUS /**/
 ^
<command-line>:0:0: note: this is the location of the previous definition
libtool: compile:  i486-pld-linux-gcc -DHAVE_CONFIG_H -I. -I/usr/include/libpng16 -I/usr/include/dbus-1.0 -I/usr/lib/dbus-1.0/include -DHAVE_DBUS -O2 -fwrapv -pipe -Wformat -Werror=format-security -gdwarf-4 -fno-debug-types-section -fvar-tracking-assignments -g2 -Wp,-D_FORTIFY_SOURCE=2 -fstack-protector --param=ssp-buffer-size=4 -fomit-frame-pointer -march=i486 -fasynchronous-unwind-tables -gdwarf-4 -fno-debug-types-section -fvar-tracking-assignments -g2 -Wall -pedantic -std=gnu99 -D_GNU_SOURCE -MT libcupsfilters_la-srgb.lo -MD -MP -MF .deps/libcupsfilters_la-srgb.Tpo -c cupsfilters/srgb.c  -fPIC -DPIC -o .libs/libcupsfilters_la-srgb.o
libtool: compile:  i486-pld-linux-gcc -DHAVE_CONFIG_H -I. -I/usr/include/libpng16 -I/usr/include/dbus-1.0 -I/usr/lib/dbus-1.0/include -DHAVE_DBUS -O2 -fwrapv -pipe -Wformat -Werror=format-security -gdwarf-4 -fno-debug-types-section -fvar-tracking-assignments -g2 -Wp,-D_FORTIFY_SOURCE=2 -fstack-protector --param=ssp-buffer-size=4 -fomit-frame-pointer -march=i486 -fasynchronous-unwind-tables -gdwarf-4 -fno-debug-types-section -fvar-tracking-assignments -g2 -Wall -pedantic -std=gnu99 -D_GNU_SOURCE -MT libcupsfilters_la-pack.lo -MD -MP -MF .deps/libcupsfilters_la-pack.Tpo -c cupsfilters/pack.c -o libcupsfilters_la-pack.o >/dev/null 2>&1
mv -f .deps/libcupsfilters_la-lut.Tpo .deps/libcupsfilters_la-lut.Plo
/bin/sh ./libtool  --tag=CC   --mode=compile i486-pld-linux-gcc -DHAVE_CONFIG_H -I.     -O2 -fwrapv -pipe -Wformat -Werror=format-security -gdwarf-4 -fno-debug-types-section -fvar-tracking-assignments -g2 -Wp,-D_FORTIFY_SOURCE=2 -fstack-protector --param=ssp-buffer-size=4 -fomit-frame-pointer -march=i486 -fasynchronous-unwind-tables -gdwarf-4 -fno-debug-types-section -fvar-tracking-assignments -g2  -Wall -pedantic -std=gnu99 -D_GNU_SOURCE -MT aglfn13.lo -MD -MP -MF .deps/aglfn13.Tpo -c -o aglfn13.lo `test -f 'fontembed/aglfn13.c' || echo './'`fontembed/aglfn13.c
libtool: compile:  i486-pld-linux-gcc -DHAVE_CONFIG_H -I. -I/usr/include/libpng16 -I/usr/include/dbus-1.0 -I/usr/lib/dbus-1.0/include -DHAVE_DBUS -O2 -fwrapv -pipe -Wformat -Werror=format-security -gdwarf-4 -fno-debug-types-section -fvar-tracking-assignments -g2 -Wp,-D_FORTIFY_SOURCE=2 -fstack-protector --param=ssp-buffer-size=4 -fomit-frame-pointer -march=i486 -fasynchronous-unwind-tables -gdwarf-4 -fno-debug-types-section -fvar-tracking-assignments -g2 -Wall -pedantic -std=gnu99 -D_GNU_SOURCE -MT libcupsfilters_la-srgb.lo -MD -MP -MF .deps/libcupsfilters_la-srgb.Tpo -c cupsfilters/srgb.c -o libcupsfilters_la-srgb.o >/dev/null 2>&1
libtool: compile:  i486-pld-linux-gcc -DHAVE_CONFIG_H -I. -O2 -fwrapv -pipe -Wformat -Werror=format-security -gdwarf-4 -fno-debug-types-section -fvar-tracking-assignments -g2 -Wp,-D_FORTIFY_SOURCE=2 -fstack-protector --param=ssp-buffer-size=4 -fomit-frame-pointer -march=i486 -fasynchronous-unwind-tables -gdwarf-4 -fno-debug-types-section -fvar-tracking-assignments -g2 -Wall -pedantic -std=gnu99 -D_GNU_SOURCE -MT aglfn13.lo -MD -MP -MF .deps/aglfn13.Tpo -c fontembed/aglfn13.c  -fPIC -DPIC -o .libs/aglfn13.o
mv -f .deps/libcupsfilters_la-image-colorspace.Tpo .deps/libcupsfilters_la-image-colorspace.Plo
/bin/sh ./libtool  --tag=CC   --mode=compile i486-pld-linux-gcc -DHAVE_CONFIG_H -I.     -O2 -fwrapv -pipe -Wformat -Werror=format-security -gdwarf-4 -fno-debug-types-section -fvar-tracking-assignments -g2 -Wp,-D_FORTIFY_SOURCE=2 -fstack-protector --param=ssp-buffer-size=4 -fomit-frame-pointer -march=i486 -fasynchronous-unwind-tables -gdwarf-4 -fno-debug-types-section -fvar-tracking-assignments -g2  -Wall -pedantic -std=gnu99 -D_GNU_SOURCE -MT dynstring.lo -MD -MP -MF .deps/dynstring.Tpo -c -o dynstring.lo `test -f 'fontembed/dynstring.c' || echo './'`fontembed/dynstring.c
libtool: compile:  i486-pld-linux-gcc -DHAVE_CONFIG_H -I. -O2 -fwrapv -pipe -Wformat -Werror=format-security -gdwarf-4 -fno-debug-types-section -fvar-tracking-assignments -g2 -Wp,-D_FORTIFY_SOURCE=2 -fstack-protector --param=ssp-buffer-size=4 -fomit-frame-pointer -march=i486 -fasynchronous-unwind-tables -gdwarf-4 -fno-debug-types-section -fvar-tracking-assignments -g2 -Wall -pedantic -std=gnu99 -D_GNU_SOURCE -MT aglfn13.lo -MD -MP -MF .deps/aglfn13.Tpo -c fontembed/aglfn13.c -o aglfn13.o >/dev/null 2>&1
libtool: compile:  i486-pld-linux-gcc -DHAVE_CONFIG_H -I. -O2 -fwrapv -pipe -Wformat -Werror=format-security -gdwarf-4 -fno-debug-types-section -fvar-tracking-assignments -g2 -Wp,-D_FORTIFY_SOURCE=2 -fstack-protector --param=ssp-buffer-size=4 -fomit-frame-pointer -march=i486 -fasynchronous-unwind-tables -gdwarf-4 -fno-debug-types-section -fvar-tracking-assignments -g2 -Wall -pedantic -std=gnu99 -D_GNU_SOURCE -MT dynstring.lo -MD -MP -MF .deps/dynstring.Tpo -c fontembed/dynstring.c  -fPIC -DPIC -o .libs/dynstring.o
mv -f .deps/libcupsfilters_la-image-sgilib.Tpo .deps/libcupsfilters_la-image-sgilib.Plo
mv -f .deps/libcupsfilters_la-srgb.Tpo .deps/libcupsfilters_la-srgb.Plo
/bin/sh ./libtool  --tag=CC   --mode=compile i486-pld-linux-gcc -DHAVE_CONFIG_H -I.     -O2 -fwrapv -pipe -Wformat -Werror=format-security -gdwarf-4 -fno-debug-types-section -fvar-tracking-assignments -g2 -Wp,-D_FORTIFY_SOURCE=2 -fstack-protector --param=ssp-buffer-size=4 -fomit-frame-pointer -march=i486 -fasynchronous-unwind-tables -gdwarf-4 -fno-debug-types-section -fvar-tracking-assignments -g2  -Wall -pedantic -std=gnu99 -D_GNU_SOURCE -MT embed.lo -MD -MP -MF .deps/embed.Tpo -c -o embed.lo `test -f 'fontembed/embed.c' || echo './'`fontembed/embed.c
/bin/sh ./libtool  --tag=CC   --mode=compile i486-pld-linux-gcc -DHAVE_CONFIG_H -I.     -O2 -fwrapv -pipe -Wformat -Werror=format-security -gdwarf-4 -fno-debug-types-section -fvar-tracking-assignments -g2 -Wp,-D_FORTIFY_SOURCE=2 -fstack-protector --param=ssp-buffer-size=4 -fomit-frame-pointer -march=i486 -fasynchronous-unwind-tables -gdwarf-4 -fno-debug-types-section -fvar-tracking-assignments -g2  -Wall -pedantic -std=gnu99 -D_GNU_SOURCE -MT embed_sfnt.lo -MD -MP -MF .deps/embed_sfnt.Tpo -c -o embed_sfnt.lo `test -f 'fontembed/embed_sfnt.c' || echo './'`fontembed/embed_sfnt.c
mv -f .deps/aglfn13.Tpo .deps/aglfn13.Plo
libtool: compile:  i486-pld-linux-gcc -DHAVE_CONFIG_H -I. -O2 -fwrapv -pipe -Wformat -Werror=format-security -gdwarf-4 -fno-debug-types-section -fvar-tracking-assignments -g2 -Wp,-D_FORTIFY_SOURCE=2 -fstack-protector --param=ssp-buffer-size=4 -fomit-frame-pointer -march=i486 -fasynchronous-unwind-tables -gdwarf-4 -fno-debug-types-section -fvar-tracking-assignments -g2 -Wall -pedantic -std=gnu99 -D_GNU_SOURCE -MT embed.lo -MD -MP -MF .deps/embed.Tpo -c fontembed/embed.c  -fPIC -DPIC -o .libs/embed.o
/bin/sh ./libtool  --tag=CC   --mode=compile i486-pld-linux-gcc -DHAVE_CONFIG_H -I.     -O2 -fwrapv -pipe -Wformat -Werror=format-security -gdwarf-4 -fno-debug-types-section -fvar-tracking-assignments -g2 -Wp,-D_FORTIFY_SOURCE=2 -fstack-protector --param=ssp-buffer-size=4 -fomit-frame-pointer -march=i486 -fasynchronous-unwind-tables -gdwarf-4 -fno-debug-types-section -fvar-tracking-assignments -g2  -Wall -pedantic -std=gnu99 -D_GNU_SOURCE -MT embed_pdf.lo -MD -MP -MF .deps/embed_pdf.Tpo -c -o embed_pdf.lo `test -f 'fontembed/embed_pdf.c' || echo './'`fontembed/embed_pdf.c
libtool: compile:  i486-pld-linux-gcc -DHAVE_CONFIG_H -I. -O2 -fwrapv -pipe -Wformat -Werror=format-security -gdwarf-4 -fno-debug-types-section -fvar-tracking-assignments -g2 -Wp,-D_FORTIFY_SOURCE=2 -fstack-protector --param=ssp-buffer-size=4 -fomit-frame-pointer -march=i486 -fasynchronous-unwind-tables -gdwarf-4 -fno-debug-types-section -fvar-tracking-assignments -g2 -Wall -pedantic -std=gnu99 -D_GNU_SOURCE -MT embed_sfnt.lo -MD -MP -MF .deps/embed_sfnt.Tpo -c fontembed/embed_sfnt.c  -fPIC -DPIC -o .libs/embed_sfnt.o
mv -f .deps/libcupsfilters_la-pack.Tpo .deps/libcupsfilters_la-pack.Plo
In file included from fontembed/embed.h:5:0,
                 from fontembed/embed.c:1:
fontembed/fontfile.h:13:4: warning: ISO C99 doesn't support unnamed structs/unions [-Wpedantic]
   };
    ^
In file included from fontembed/embed.h:5:0,
                 from fontembed/embed_sfnt.c:1:
fontembed/fontfile.h:13:4: warning: ISO C99 doesn't support unnamed structs/unions [-Wpedantic]
   };
    ^
/bin/sh ./libtool  --tag=CC   --mode=compile i486-pld-linux-gcc -DHAVE_CONFIG_H -I.     -O2 -fwrapv -pipe -Wformat -Werror=format-security -gdwarf-4 -fno-debug-types-section -fvar-tracking-assignments -g2 -Wp,-D_FORTIFY_SOURCE=2 -fstack-protector --param=ssp-buffer-size=4 -fomit-frame-pointer -march=i486 -fasynchronous-unwind-tables -gdwarf-4 -fno-debug-types-section -fvar-tracking-assignments -g2  -Wall -pedantic -std=gnu99 -D_GNU_SOURCE -MT fontfile.lo -MD -MP -MF .deps/fontfile.Tpo -c -o fontfile.lo `test -f 'fontembed/fontfile.c' || echo './'`fontembed/fontfile.c
libtool: compile:  i486-pld-linux-gcc -DHAVE_CONFIG_H -I. -O2 -fwrapv -pipe -Wformat -Werror=format-security -gdwarf-4 -fno-debug-types-section -fvar-tracking-assignments -g2 -Wp,-D_FORTIFY_SOURCE=2 -fstack-protector --param=ssp-buffer-size=4 -fomit-frame-pointer -march=i486 -fasynchronous-unwind-tables -gdwarf-4 -fno-debug-types-section -fvar-tracking-assignments -g2 -Wall -pedantic -std=gnu99 -D_GNU_SOURCE -MT dynstring.lo -MD -MP -MF .deps/dynstring.Tpo -c fontembed/dynstring.c -o dynstring.o >/dev/null 2>&1
libtool: compile:  i486-pld-linux-gcc -DHAVE_CONFIG_H -I. -O2 -fwrapv -pipe -Wformat -Werror=format-security -gdwarf-4 -fno-debug-types-section -fvar-tracking-assignments -g2 -Wp,-D_FORTIFY_SOURCE=2 -fstack-protector --param=ssp-buffer-size=4 -fomit-frame-pointer -march=i486 -fasynchronous-unwind-tables -gdwarf-4 -fno-debug-types-section -fvar-tracking-assignments -g2 -Wall -pedantic -std=gnu99 -D_GNU_SOURCE -MT embed_pdf.lo -MD -MP -MF .deps/embed_pdf.Tpo -c fontembed/embed_pdf.c  -fPIC -DPIC -o .libs/embed_pdf.o
libtool: compile:  i486-pld-linux-gcc -DHAVE_CONFIG_H -I. -I/usr/include/libpng16 -I/usr/include/dbus-1.0 -I/usr/lib/dbus-1.0/include -DHAVE_DBUS -O2 -fwrapv -pipe -Wformat -Werror=format-security -gdwarf-4 -fno-debug-types-section -fvar-tracking-assignments -g2 -Wp,-D_FORTIFY_SOURCE=2 -fstack-protector --param=ssp-buffer-size=4 -fomit-frame-pointer -march=i486 -fasynchronous-unwind-tables -gdwarf-4 -fno-debug-types-section -fvar-tracking-assignments -g2 -Wall -pedantic -std=gnu99 -D_GNU_SOURCE -MT libcupsfilters_la-rgb.lo -MD -MP -MF .deps/libcupsfilters_la-rgb.Tpo -c cupsfilters/rgb.c -o libcupsfilters_la-rgb.o >/dev/null 2>&1
In file included from fontembed/embed.h:5:0,
                 from fontembed/embed_pdf.c:1:
fontembed/fontfile.h:13:4: warning: ISO C99 doesn't support unnamed structs/unions [-Wpedantic]
   };
    ^
libtool: compile:  i486-pld-linux-gcc -DHAVE_CONFIG_H -I. -O2 -fwrapv -pipe -Wformat -Werror=format-security -gdwarf-4 -fno-debug-types-section -fvar-tracking-assignments -g2 -Wp,-D_FORTIFY_SOURCE=2 -fstack-protector --param=ssp-buffer-size=4 -fomit-frame-pointer -march=i486 -fasynchronous-unwind-tables -gdwarf-4 -fno-debug-types-section -fvar-tracking-assignments -g2 -Wall -pedantic -std=gnu99 -D_GNU_SOURCE -MT fontfile.lo -MD -MP -MF .deps/fontfile.Tpo -c fontembed/fontfile.c  -fPIC -DPIC -o .libs/fontfile.o
libtool: compile:  i486-pld-linux-gcc -DHAVE_CONFIG_H -I. -O2 -fwrapv -pipe -Wformat -Werror=format-security -gdwarf-4 -fno-debug-types-section -fvar-tracking-assignments -g2 -Wp,-D_FORTIFY_SOURCE=2 -fstack-protector --param=ssp-buffer-size=4 -fomit-frame-pointer -march=i486 -fasynchronous-unwind-tables -gdwarf-4 -fno-debug-types-section -fvar-tracking-assignments -g2 -Wall -pedantic -std=gnu99 -D_GNU_SOURCE -MT embed.lo -MD -MP -MF .deps/embed.Tpo -c fontembed/embed.c -o embed.o >/dev/null 2>&1
In file included from fontembed/fontfile.c:1:0:
fontembed/fontfile.h:13:4: warning: ISO C99 doesn't support unnamed structs/unions [-Wpedantic]
   };
    ^
mv -f .deps/dynstring.Tpo .deps/dynstring.Plo
libtool: compile:  i486-pld-linux-gcc -DHAVE_CONFIG_H -I. -O2 -fwrapv -pipe -Wformat -Werror=format-security -gdwarf-4 -fno-debug-types-section -fvar-tracking-assignments -g2 -Wp,-D_FORTIFY_SOURCE=2 -fstack-protector --param=ssp-buffer-size=4 -fomit-frame-pointer -march=i486 -fasynchronous-unwind-tables -gdwarf-4 -fno-debug-types-section -fvar-tracking-assignments -g2 -Wall -pedantic -std=gnu99 -D_GNU_SOURCE -MT fontfile.lo -MD -MP -MF .deps/fontfile.Tpo -c fontembed/fontfile.c -o fontfile.o >/dev/null 2>&1
mv -f .deps/libcupsfilters_la-cmyk.Tpo .deps/libcupsfilters_la-cmyk.Plo
/bin/sh ./libtool  --tag=CC   --mode=compile i486-pld-linux-gcc -DHAVE_CONFIG_H -I.     -O2 -fwrapv -pipe -Wformat -Werror=format-security -gdwarf-4 -fno-debug-types-section -fvar-tracking-assignments -g2 -Wp,-D_FORTIFY_SOURCE=2 -fstack-protector --param=ssp-buffer-size=4 -fomit-frame-pointer -march=i486 -fasynchronous-unwind-tables -gdwarf-4 -fno-debug-types-section -fvar-tracking-assignments -g2  -Wall -pedantic -std=gnu99 -D_GNU_SOURCE -MT frequent.lo -MD -MP -MF .deps/frequent.Tpo -c -o frequent.lo `test -f 'fontembed/frequent.c' || echo './'`fontembed/frequent.c
/bin/sh ./libtool  --tag=CC   --mode=compile i486-pld-linux-gcc -DHAVE_CONFIG_H -I.     -O2 -fwrapv -pipe -Wformat -Werror=format-security -gdwarf-4 -fno-debug-types-section -fvar-tracking-assignments -g2 -Wp,-D_FORTIFY_SOURCE=2 -fstack-protector --param=ssp-buffer-size=4 -fomit-frame-pointer -march=i486 -fasynchronous-unwind-tables -gdwarf-4 -fno-debug-types-section -fvar-tracking-assignments -g2  -Wall -pedantic -std=gnu99 -D_GNU_SOURCE -MT sfnt.lo -MD -MP -MF .deps/sfnt.Tpo -c -o sfnt.lo `test -f 'fontembed/sfnt.c' || echo './'`fontembed/sfnt.c
libtool: compile:  i486-pld-linux-gcc -DHAVE_CONFIG_H -I. -O2 -fwrapv -pipe -Wformat -Werror=format-security -gdwarf-4 -fno-debug-types-section -fvar-tracking-assignments -g2 -Wp,-D_FORTIFY_SOURCE=2 -fstack-protector --param=ssp-buffer-size=4 -fomit-frame-pointer -march=i486 -fasynchronous-unwind-tables -gdwarf-4 -fno-debug-types-section -fvar-tracking-assignments -g2 -Wall -pedantic -std=gnu99 -D_GNU_SOURCE -MT frequent.lo -MD -MP -MF .deps/frequent.Tpo -c fontembed/frequent.c  -fPIC -DPIC -o .libs/frequent.o
mv -f .deps/embed.Tpo .deps/embed.Plo
libtool: compile:  i486-pld-linux-gcc -DHAVE_CONFIG_H -I. -O2 -fwrapv -pipe -Wformat -Werror=format-security -gdwarf-4 -fno-debug-types-section -fvar-tracking-assignments -g2 -Wp,-D_FORTIFY_SOURCE=2 -fstack-protector --param=ssp-buffer-size=4 -fomit-frame-pointer -march=i486 -fasynchronous-unwind-tables -gdwarf-4 -fno-debug-types-section -fvar-tracking-assignments -g2 -Wall -pedantic -std=gnu99 -D_GNU_SOURCE -MT sfnt.lo -MD -MP -MF .deps/sfnt.Tpo -c fontembed/sfnt.c  -fPIC -DPIC -o .libs/sfnt.o
/bin/sh ./libtool  --tag=CC   --mode=compile i486-pld-linux-gcc -DHAVE_CONFIG_H -I.     -O2 -fwrapv -pipe -Wformat -Werror=format-security -gdwarf-4 -fno-debug-types-section -fvar-tracking-assignments -g2 -Wp,-D_FORTIFY_SOURCE=2 -fstack-protector --param=ssp-buffer-size=4 -fomit-frame-pointer -march=i486 -fasynchronous-unwind-tables -gdwarf-4 -fno-debug-types-section -fvar-tracking-assignments -g2  -Wall -pedantic -std=gnu99 -D_GNU_SOURCE -MT sfnt_subset.lo -MD -MP -MF .deps/sfnt_subset.Tpo -c -o sfnt_subset.lo `test -f 'fontembed/sfnt_subset.c' || echo './'`fontembed/sfnt_subset.c
mv -f .deps/libcupsfilters_la-rgb.Tpo .deps/libcupsfilters_la-rgb.Plo
mv -f .deps/fontfile.Tpo .deps/fontfile.Plo
libtool: compile:  i486-pld-linux-gcc -DHAVE_CONFIG_H -I. -O2 -fwrapv -pipe -Wformat -Werror=format-security -gdwarf-4 -fno-debug-types-section -fvar-tracking-assignments -g2 -Wp,-D_FORTIFY_SOURCE=2 -fstack-protector --param=ssp-buffer-size=4 -fomit-frame-pointer -march=i486 -fasynchronous-unwind-tables -gdwarf-4 -fno-debug-types-section -fvar-tracking-assignments -g2 -Wall -pedantic -std=gnu99 -D_GNU_SOURCE -MT frequent.lo -MD -MP -MF .deps/frequent.Tpo -c fontembed/frequent.c -o frequent.o >/dev/null 2>&1
/bin/sh ./libtool  --tag=CC   --mode=compile i486-pld-linux-gcc -DHAVE_CONFIG_H -I.     -I/usr/include/php -I/usr/include/php/main -I/usr/include/php/TSRM -I/usr/include/php/Zend -I/usr/include/php/ext -I/usr/include/php/ext/date/lib -O2 -fwrapv -pipe -Wformat -Werror=format-security -gdwarf-4 -fno-debug-types-section -fvar-tracking-assignments -g2 -Wp,-D_FORTIFY_SOURCE=2 -fstack-protector --param=ssp-buffer-size=4 -fomit-frame-pointer -march=i486 -fasynchronous-unwind-tables -gdwarf-4 -fno-debug-types-section -fvar-tracking-assignments -g2  -Wall -pedantic -std=gnu99 -D_GNU_SOURCE -MT libphpcups_la-phpcups.lo -MD -MP -MF .deps/libphpcups_la-phpcups.Tpo -c -o libphpcups_la-phpcups.lo `test -f 'scripting/php/phpcups.c' || echo './'`scripting/php/phpcups.c
i486-pld-linux-gcc -DHAVE_CONFIG_H -I.     -O2 -fwrapv -pipe -Wformat -Werror=format-security -gdwarf-4 -fno-debug-types-section -fvar-tracking-assignments -g2 -Wp,-D_FORTIFY_SOURCE=2 -fstack-protector --param=ssp-buffer-size=4 -fomit-frame-pointer -march=i486 -fasynchronous-unwind-tables -gdwarf-4 -fno-debug-types-section -fvar-tracking-assignments -g2  -Wall -pedantic -std=gnu99 -D_GNU_SOURCE -MT main.o -MD -MP -MF .deps/main.Tpo -c -o main.o `test -f 'fontembed/main.c' || echo './'`fontembed/main.c
libtool: compile:  i486-pld-linux-gcc -DHAVE_CONFIG_H -I. -O2 -fwrapv -pipe -Wformat -Werror=format-security -gdwarf-4 -fno-debug-types-section -fvar-tracking-assignments -g2 -Wp,-D_FORTIFY_SOURCE=2 -fstack-protector --param=ssp-buffer-size=4 -fomit-frame-pointer -march=i486 -fasynchronous-unwind-tables -gdwarf-4 -fno-debug-types-section -fvar-tracking-assignments -g2 -Wall -pedantic -std=gnu99 -D_GNU_SOURCE -MT sfnt_subset.lo -MD -MP -MF .deps/sfnt_subset.Tpo -c fontembed/sfnt_subset.c  -fPIC -DPIC -o .libs/sfnt_subset.o
libtool: compile:  i486-pld-linux-gcc -DHAVE_CONFIG_H -I. -O2 -fwrapv -pipe -Wformat -Werror=format-security -gdwarf-4 -fno-debug-types-section -fvar-tracking-assignments -g2 -Wp,-D_FORTIFY_SOURCE=2 -fstack-protector --param=ssp-buffer-size=4 -fomit-frame-pointer -march=i486 -fasynchronous-unwind-tables -gdwarf-4 -fno-debug-types-section -fvar-tracking-assignments -g2 -Wall -pedantic -std=gnu99 -D_GNU_SOURCE -MT embed_pdf.lo -MD -MP -MF .deps/embed_pdf.Tpo -c fontembed/embed_pdf.c -o embed_pdf.o >/dev/null 2>&1
libtool: compile:  i486-pld-linux-gcc -DHAVE_CONFIG_H -I. -I/usr/include/libpng16 -I/usr/include/dbus-1.0 -I/usr/lib/dbus-1.0/include -DHAVE_DBUS -O2 -fwrapv -pipe -Wformat -Werror=format-security -gdwarf-4 -fno-debug-types-section -fvar-tracking-assignments -g2 -Wp,-D_FORTIFY_SOURCE=2 -fstack-protector --param=ssp-buffer-size=4 -fomit-frame-pointer -march=i486 -fasynchronous-unwind-tables -gdwarf-4 -fno-debug-types-section -fvar-tracking-assignments -g2 -Wall -pedantic -std=gnu99 -D_GNU_SOURCE -MT libcupsfilters_la-image-tiff.lo -MD -MP -MF .deps/libcupsfilters_la-image-tiff.Tpo -c cupsfilters/image-tiff.c -o libcupsfilters_la-image-tiff.o >/dev/null 2>&1
libtool: compile:  i486-pld-linux-gcc -DHAVE_CONFIG_H -I. -I/usr/include/php -I/usr/include/php/main -I/usr/include/php/TSRM -I/usr/include/php/Zend -I/usr/include/php/ext -I/usr/include/php/ext/date/lib -O2 -fwrapv -pipe -Wformat -Werror=format-security -gdwarf-4 -fno-debug-types-section -fvar-tracking-assignments -g2 -Wp,-D_FORTIFY_SOURCE=2 -fstack-protector --param=ssp-buffer-size=4 -fomit-frame-pointer -march=i486 -fasynchronous-unwind-tables -gdwarf-4 -fno-debug-types-section -fvar-tracking-assignments -g2 -Wall -pedantic -std=gnu99 -D_GNU_SOURCE -MT libphpcups_la-phpcups.lo -MD -MP -MF .deps/libphpcups_la-phpcups.Tpo -c scripting/php/phpcups.c  -fPIC -DPIC -o .libs/libphpcups_la-phpcups.o
In file included from fontembed/embed.h:5:0,
                 from fontembed/main.c:6:
fontembed/fontfile.h:13:4: warning: ISO C99 doesn't support unnamed structs/unions [-Wpedantic]
   };
    ^
libtool: compile:  i486-pld-linux-gcc -DHAVE_CONFIG_H -I. -I/usr/include/libpng16 -I/usr/include/dbus-1.0 -I/usr/lib/dbus-1.0/include -DHAVE_DBUS -O2 -fwrapv -pipe -Wformat -Werror=format-security -gdwarf-4 -fno-debug-types-section -fvar-tracking-assignments -g2 -Wp,-D_FORTIFY_SOURCE=2 -fstack-protector --param=ssp-buffer-size=4 -fomit-frame-pointer -march=i486 -fasynchronous-unwind-tables -gdwarf-4 -fno-debug-types-section -fvar-tracking-assignments -g2 -Wall -pedantic -std=gnu99 -D_GNU_SOURCE -MT libcupsfilters_la-raster.lo -MD -MP -MF .deps/libcupsfilters_la-raster.Tpo -c cupsfilters/raster.c -o libcupsfilters_la-raster.o >/dev/null 2>&1
fontembed/main.c: In function 'example_write_fontdescr':
fontembed/main.c:92:7: warning: ISO C does not support the '%m' gnu_printf format [-Wformat=]
       fprintf(stderr,"Opening \"%s\" for writing failed: %m\n",outfile);
       ^
libtool: compile:  i486-pld-linux-gcc -DHAVE_CONFIG_H -I. -O2 -fwrapv -pipe -Wformat -Werror=format-security -gdwarf-4 -fno-debug-types-section -fvar-tracking-assignments -g2 -Wp,-D_FORTIFY_SOURCE=2 -fstack-protector --param=ssp-buffer-size=4 -fomit-frame-pointer -march=i486 -fasynchronous-unwind-tables -gdwarf-4 -fno-debug-types-section -fvar-tracking-assignments -g2 -Wall -pedantic -std=gnu99 -D_GNU_SOURCE -MT embed_sfnt.lo -MD -MP -MF .deps/embed_sfnt.Tpo -c fontembed/embed_sfnt.c -o embed_sfnt.o >/dev/null 2>&1
mv -f .deps/frequent.Tpo .deps/frequent.Plo
i486-pld-linux-gcc -DHAVE_CONFIG_H -I.     -O2 -fwrapv -pipe -Wformat -Werror=format-security -gdwarf-4 -fno-debug-types-section -fvar-tracking-assignments -g2 -Wp,-D_FORTIFY_SOURCE=2 -fstack-protector --param=ssp-buffer-size=4 -fomit-frame-pointer -march=i486 -fasynchronous-unwind-tables -gdwarf-4 -fno-debug-types-section -fvar-tracking-assignments -g2  -Wall -pedantic -std=gnu99 -D_GNU_SOURCE -MT parallel-ieee1284.o -MD -MP -MF .deps/parallel-ieee1284.Tpo -c -o parallel-ieee1284.o `test -f 'backend/ieee1284.c' || echo './'`backend/ieee1284.c
mv -f .deps/main.Tpo .deps/main.Po
i486-pld-linux-gcc -DHAVE_CONFIG_H -I.     -O2 -fwrapv -pipe -Wformat -Werror=format-security -gdwarf-4 -fno-debug-types-section -fvar-tracking-assignments -g2 -Wp,-D_FORTIFY_SOURCE=2 -fstack-protector --param=ssp-buffer-size=4 -fomit-frame-pointer -march=i486 -fasynchronous-unwind-tables -gdwarf-4 -fno-debug-types-section -fvar-tracking-assignments -g2  -Wall -pedantic -std=gnu99 -D_GNU_SOURCE -MT parallel-parallel.o -MD -MP -MF .deps/parallel-parallel.Tpo -c -o parallel-parallel.o `test -f 'backend/parallel.c' || echo './'`backend/parallel.c
libtool: compile:  i486-pld-linux-gcc -DHAVE_CONFIG_H -I. -O2 -fwrapv -pipe -Wformat -Werror=format-security -gdwarf-4 -fno-debug-types-section -fvar-tracking-assignments -g2 -Wp,-D_FORTIFY_SOURCE=2 -fstack-protector --param=ssp-buffer-size=4 -fomit-frame-pointer -march=i486 -fasynchronous-unwind-tables -gdwarf-4 -fno-debug-types-section -fvar-tracking-assignments -g2 -Wall -pedantic -std=gnu99 -D_GNU_SOURCE -MT sfnt_subset.lo -MD -MP -MF .deps/sfnt_subset.Tpo -c fontembed/sfnt_subset.c -o sfnt_subset.o >/dev/null 2>&1
scripting/php/phpcups.c:47:1: error: unknown type name 'function_entry'
 function_entry phpcups_functions[] =
 ^
scripting/php/phpcups.c:49:3: warning: braces around scalar initializer [enabled by default]
   PHP_FE(cups_cancel_job, NULL)
   ^
scripting/php/phpcups.c:49:3: warning: (near initialization for 'phpcups_functions[0]') [enabled by default]
scripting/php/phpcups.c:49:3: warning: initialization makes integer from pointer without a cast [enabled by default]
scripting/php/phpcups.c:49:3: warning: (near initialization for 'phpcups_functions[0]') [enabled by default]
scripting/php/phpcups.c:49:3: warning: excess elements in scalar initializer [enabled by default]
scripting/php/phpcups.c:49:3: warning: (near initialization for 'phpcups_functions[0]') [enabled by default]
scripting/php/phpcups.c:49:3: warning: excess elements in scalar initializer [enabled by default]
scripting/php/phpcups.c:49:3: warning: (near initialization for 'phpcups_functions[0]') [enabled by default]
In file included from /usr/include/php/main/php.h:38:0,
                 from scripting/php/phpcups.c:33:
/usr/include/php/Zend/zend_API.h:71:129: warning: excess elements in scalar initializer [enabled by default]
 #define ZEND_FENTRY(zend_name, name, arg_info, flags) { #zend_name, name, arg_info, (zend_uint) (sizeof(arg_info)/sizeof(struct _zend_arg_info)-1), flags },
                                                                                                                                 ^
/usr/include/php/Zend/zend_API.h:77:38: note: in expansion of macro 'ZEND_FENTRY'
 #define ZEND_FE(name, arg_info)      ZEND_FENTRY(name, ZEND_FN(name), arg_info, 0)
                                      ^
/usr/include/php/main/php.h:349:18: note: in expansion of macro 'ZEND_FE'
 #define PHP_FE   ZEND_FE
                  ^
scripting/php/phpcups.c:49:3: note: in expansion of macro 'PHP_FE'
   PHP_FE(cups_cancel_job, NULL)
   ^
/usr/include/php/Zend/zend_API.h:71:129: warning: (near initialization for 'phpcups_functions[0]') [enabled by default]
 #define ZEND_FENTRY(zend_name, name, arg_info, flags) { #zend_name, name, arg_info, (zend_uint) (sizeof(arg_info)/sizeof(struct _zend_arg_info)-1), flags },
                                                                                                                                 ^
/usr/include/php/Zend/zend_API.h:77:38: note: in expansion of macro 'ZEND_FENTRY'
 #define ZEND_FE(name, arg_info)      ZEND_FENTRY(name, ZEND_FN(name), arg_info, 0)
                                      ^
/usr/include/php/main/php.h:349:18: note: in expansion of macro 'ZEND_FE'
 #define PHP_FE   ZEND_FE
                  ^
scripting/php/phpcups.c:49:3: note: in expansion of macro 'PHP_FE'
   PHP_FE(cups_cancel_job, NULL)
   ^
/usr/include/php/Zend/zend_API.h:71:129: warning: excess elements in scalar initializer [enabled by default]
 #define ZEND_FENTRY(zend_name, name, arg_info, flags) { #zend_name, name, arg_info, (zend_uint) (sizeof(arg_info)/sizeof(struct _zend_arg_info)-1), flags },
                                                                                                                                 ^
/usr/include/php/Zend/zend_API.h:77:38: note: in expansion of macro 'ZEND_FENTRY'
 #define ZEND_FE(name, arg_info)      ZEND_FENTRY(name, ZEND_FN(name), arg_info, 0)
                                      ^
/usr/include/php/main/php.h:349:18: note: in expansion of macro 'ZEND_FE'
 #define PHP_FE   ZEND_FE
                  ^
scripting/php/phpcups.c:49:3: note: in expansion of macro 'PHP_FE'
   PHP_FE(cups_cancel_job, NULL)
   ^
/usr/include/php/Zend/zend_API.h:71:129: warning: (near initialization for 'phpcups_functions[0]') [enabled by default]
 #define ZEND_FENTRY(zend_name, name, arg_info, flags) { #zend_name, name, arg_info, (zend_uint) (sizeof(arg_info)/sizeof(struct _zend_arg_info)-1), flags },
                                                                                                                                 ^
/usr/include/php/Zend/zend_API.h:77:38: note: in expansion of macro 'ZEND_FENTRY'
 #define ZEND_FE(name, arg_info)      ZEND_FENTRY(name, ZEND_FN(name), arg_info, 0)
                                      ^
/usr/include/php/main/php.h:349:18: note: in expansion of macro 'ZEND_FE'
 #define PHP_FE   ZEND_FE
                  ^
scripting/php/phpcups.c:49:3: note: in expansion of macro 'PHP_FE'
   PHP_FE(cups_cancel_job, NULL)
   ^
scripting/php/phpcups.c:50:3: warning: braces around scalar initializer [enabled by default]
   PHP_FE(cups_get_dests, NULL)
   ^
scripting/php/phpcups.c:50:3: warning: (near initialization for 'phpcups_functions[1]') [enabled by default]
scripting/php/phpcups.c:50:3: warning: initialization makes integer from pointer without a cast [enabled by default]
scripting/php/phpcups.c:50:3: warning: (near initialization for 'phpcups_functions[1]') [enabled by default]
scripting/php/phpcups.c:50:3: warning: excess elements in scalar initializer [enabled by default]
scripting/php/phpcups.c:50:3: warning: (near initialization for 'phpcups_functions[1]') [enabled by default]
scripting/php/phpcups.c:50:3: warning: excess elements in scalar initializer [enabled by default]
scripting/php/phpcups.c:50:3: warning: (near initialization for 'phpcups_functions[1]') [enabled by default]
In file included from /usr/include/php/main/php.h:38:0,
                 from scripting/php/phpcups.c:33:
/usr/include/php/Zend/zend_API.h:71:129: warning: excess elements in scalar initializer [enabled by default]
 #define ZEND_FENTRY(zend_name, name, arg_info, flags) { #zend_name, name, arg_info, (zend_uint) (sizeof(arg_info)/sizeof(struct _zend_arg_info)-1), flags },
                                                                                                                                 ^
/usr/include/php/Zend/zend_API.h:77:38: note: in expansion of macro 'ZEND_FENTRY'
 #define ZEND_FE(name, arg_info)      ZEND_FENTRY(name, ZEND_FN(name), arg_info, 0)
                                      ^
/usr/include/php/main/php.h:349:18: note: in expansion of macro 'ZEND_FE'
 #define PHP_FE   ZEND_FE
                  ^
scripting/php/phpcups.c:50:3: note: in expansion of macro 'PHP_FE'
   PHP_FE(cups_get_dests, NULL)
   ^
/usr/include/php/Zend/zend_API.h:71:129: warning: (near initialization for 'phpcups_functions[1]') [enabled by default]
 #define ZEND_FENTRY(zend_name, name, arg_info, flags) { #zend_name, name, arg_info, (zend_uint) (sizeof(arg_info)/sizeof(struct _zend_arg_info)-1), flags },
                                                                                                                                 ^
/usr/include/php/Zend/zend_API.h:77:38: note: in expansion of macro 'ZEND_FENTRY'
 #define ZEND_FE(name, arg_info)      ZEND_FENTRY(name, ZEND_FN(name), arg_info, 0)
                                      ^
/usr/include/php/main/php.h:349:18: note: in expansion of macro 'ZEND_FE'
 #define PHP_FE   ZEND_FE
                  ^
scripting/php/phpcups.c:50:3: note: in expansion of macro 'PHP_FE'
   PHP_FE(cups_get_dests, NULL)
   ^
/usr/include/php/Zend/zend_API.h:71:129: warning: excess elements in scalar initializer [enabled by default]
 #define ZEND_FENTRY(zend_name, name, arg_info, flags) { #zend_name, name, arg_info, (zend_uint) (sizeof(arg_info)/sizeof(struct _zend_arg_info)-1), flags },
                                                                                                                                 ^
/usr/include/php/Zend/zend_API.h:77:38: note: in expansion of macro 'ZEND_FENTRY'
 #define ZEND_FE(name, arg_info)      ZEND_FENTRY(name, ZEND_FN(name), arg_info, 0)
                                      ^
/usr/include/php/main/php.h:349:18: note: in expansion of macro 'ZEND_FE'
 #define PHP_FE   ZEND_FE
                  ^
scripting/php/phpcups.c:50:3: note: in expansion of macro 'PHP_FE'
   PHP_FE(cups_get_dests, NULL)
   ^
/usr/include/php/Zend/zend_API.h:71:129: warning: (near initialization for 'phpcups_functions[1]') [enabled by default]
 #define ZEND_FENTRY(zend_name, name, arg_info, flags) { #zend_name, name, arg_info, (zend_uint) (sizeof(arg_info)/sizeof(struct _zend_arg_info)-1), flags },
                                                                                                                                 ^
/usr/include/php/Zend/zend_API.h:77:38: note: in expansion of macro 'ZEND_FENTRY'
 #define ZEND_FE(name, arg_info)      ZEND_FENTRY(name, ZEND_FN(name), arg_info, 0)
                                      ^
/usr/include/php/main/php.h:349:18: note: in expansion of macro 'ZEND_FE'
 #define PHP_FE   ZEND_FE
                  ^
scripting/php/phpcups.c:50:3: note: in expansion of macro 'PHP_FE'
   PHP_FE(cups_get_dests, NULL)
   ^
scripting/php/phpcups.c:51:3: warning: braces around scalar initializer [enabled by default]
   PHP_FE(cups_get_jobs, NULL)
   ^
scripting/php/phpcups.c:51:3: warning: (near initialization for 'phpcups_functions[2]') [enabled by default]
scripting/php/phpcups.c:51:3: warning: initialization makes integer from pointer without a cast [enabled by default]
scripting/php/phpcups.c:51:3: warning: (near initialization for 'phpcups_functions[2]') [enabled by default]
scripting/php/phpcups.c:51:3: warning: excess elements in scalar initializer [enabled by default]
scripting/php/phpcups.c:51:3: warning: (near initialization for 'phpcups_functions[2]') [enabled by default]
scripting/php/phpcups.c:51:3: warning: excess elements in scalar initializer [enabled by default]
scripting/php/phpcups.c:51:3: warning: (near initialization for 'phpcups_functions[2]') [enabled by default]
In file included from /usr/include/php/main/php.h:38:0,
                 from scripting/php/phpcups.c:33:
/usr/include/php/Zend/zend_API.h:71:129: warning: excess elements in scalar initializer [enabled by default]
 #define ZEND_FENTRY(zend_name, name, arg_info, flags) { #zend_name, name, arg_info, (zend_uint) (sizeof(arg_info)/sizeof(struct _zend_arg_info)-1), flags },
                                                                                                                                 ^
/usr/include/php/Zend/zend_API.h:77:38: note: in expansion of macro 'ZEND_FENTRY'
 #define ZEND_FE(name, arg_info)      ZEND_FENTRY(name, ZEND_FN(name), arg_info, 0)
                                      ^
/usr/include/php/main/php.h:349:18: note: in expansion of macro 'ZEND_FE'
 #define PHP_FE   ZEND_FE
                  ^
scripting/php/phpcups.c:51:3: note: in expansion of macro 'PHP_FE'
   PHP_FE(cups_get_jobs, NULL)
   ^
/usr/include/php/Zend/zend_API.h:71:129: warning: (near initialization for 'phpcups_functions[2]') [enabled by default]
 #define ZEND_FENTRY(zend_name, name, arg_info, flags) { #zend_name, name, arg_info, (zend_uint) (sizeof(arg_info)/sizeof(struct _zend_arg_info)-1), flags },
                                                                                                                                 ^
/usr/include/php/Zend/zend_API.h:77:38: note: in expansion of macro 'ZEND_FENTRY'
 #define ZEND_FE(name, arg_info)      ZEND_FENTRY(name, ZEND_FN(name), arg_info, 0)
                                      ^
/usr/include/php/main/php.h:349:18: note: in expansion of macro 'ZEND_FE'
 #define PHP_FE   ZEND_FE
                  ^
scripting/php/phpcups.c:51:3: note: in expansion of macro 'PHP_FE'
   PHP_FE(cups_get_jobs, NULL)
   ^
/usr/include/php/Zend/zend_API.h:71:129: warning: excess elements in scalar initializer [enabled by default]
 #define ZEND_FENTRY(zend_name, name, arg_info, flags) { #zend_name, name, arg_info, (zend_uint) (sizeof(arg_info)/sizeof(struct _zend_arg_info)-1), flags },
                                                                                                                                 ^
/usr/include/php/Zend/zend_API.h:77:38: note: in expansion of macro 'ZEND_FENTRY'
 #define ZEND_FE(name, arg_info)      ZEND_FENTRY(name, ZEND_FN(name), arg_info, 0)
                                      ^
/usr/include/php/main/php.h:349:18: note: in expansion of macro 'ZEND_FE'
 #define PHP_FE   ZEND_FE
                  ^
scripting/php/phpcups.c:51:3: note: in expansion of macro 'PHP_FE'
   PHP_FE(cups_get_jobs, NULL)
   ^
/usr/include/php/Zend/zend_API.h:71:129: warning: (near initialization for 'phpcups_functions[2]') [enabled by default]
 #define ZEND_FENTRY(zend_name, name, arg_info, flags) { #zend_name, name, arg_info, (zend_uint) (sizeof(arg_info)/sizeof(struct _zend_arg_info)-1), flags },
                                                                                                                                 ^
/usr/include/php/Zend/zend_API.h:77:38: note: in expansion of macro 'ZEND_FENTRY'
 #define ZEND_FE(name, arg_info)      ZEND_FENTRY(name, ZEND_FN(name), arg_info, 0)
                                      ^
/usr/include/php/main/php.h:349:18: note: in expansion of macro 'ZEND_FE'
 #define PHP_FE   ZEND_FE
                  ^
scripting/php/phpcups.c:51:3: note: in expansion of macro 'PHP_FE'
   PHP_FE(cups_get_jobs, NULL)
   ^
scripting/php/phpcups.c:52:3: warning: braces around scalar initializer [enabled by default]
   PHP_FE(cups_last_error, NULL)
   ^
scripting/php/phpcups.c:52:3: warning: (near initialization for 'phpcups_functions[3]') [enabled by default]
scripting/php/phpcups.c:52:3: warning: initialization makes integer from pointer without a cast [enabled by default]
scripting/php/phpcups.c:52:3: warning: (near initialization for 'phpcups_functions[3]') [enabled by default]
scripting/php/phpcups.c:52:3: warning: excess elements in scalar initializer [enabled by default]
scripting/php/phpcups.c:52:3: warning: (near initialization for 'phpcups_functions[3]') [enabled by default]
scripting/php/phpcups.c:52:3: warning: excess elements in scalar initializer [enabled by default]
scripting/php/phpcups.c:52:3: warning: (near initialization for 'phpcups_functions[3]') [enabled by default]
In file included from /usr/include/php/main/php.h:38:0,
                 from scripting/php/phpcups.c:33:
/usr/include/php/Zend/zend_API.h:71:129: warning: excess elements in scalar initializer [enabled by default]
 #define ZEND_FENTRY(zend_name, name, arg_info, flags) { #zend_name, name, arg_info, (zend_uint) (sizeof(arg_info)/sizeof(struct _zend_arg_info)-1), flags },
                                                                                                                                 ^
/usr/include/php/Zend/zend_API.h:77:38: note: in expansion of macro 'ZEND_FENTRY'
 #define ZEND_FE(name, arg_info)      ZEND_FENTRY(name, ZEND_FN(name), arg_info, 0)
                                      ^
/usr/include/php/main/php.h:349:18: note: in expansion of macro 'ZEND_FE'
 #define PHP_FE   ZEND_FE
                  ^
scripting/php/phpcups.c:52:3: note: in expansion of macro 'PHP_FE'
   PHP_FE(cups_last_error, NULL)
   ^
/usr/include/php/Zend/zend_API.h:71:129: warning: (near initialization for 'phpcups_functions[3]') [enabled by default]
 #define ZEND_FENTRY(zend_name, name, arg_info, flags) { #zend_name, name, arg_info, (zend_uint) (sizeof(arg_info)/sizeof(struct _zend_arg_info)-1), flags },
                                                                                                                                 ^
/usr/include/php/Zend/zend_API.h:77:38: note: in expansion of macro 'ZEND_FENTRY'
 #define ZEND_FE(name, arg_info)      ZEND_FENTRY(name, ZEND_FN(name), arg_info, 0)
                                      ^
/usr/include/php/main/php.h:349:18: note: in expansion of macro 'ZEND_FE'
 #define PHP_FE   ZEND_FE
                  ^
scripting/php/phpcups.c:52:3: note: in expansion of macro 'PHP_FE'
   PHP_FE(cups_last_error, NULL)
   ^
/usr/include/php/Zend/zend_API.h:71:129: warning: excess elements in scalar initializer [enabled by default]
 #define ZEND_FENTRY(zend_name, name, arg_info, flags) { #zend_name, name, arg_info, (zend_uint) (sizeof(arg_info)/sizeof(struct _zend_arg_info)-1), flags },
                                                                                                                                 ^
/usr/include/php/Zend/zend_API.h:77:38: note: in expansion of macro 'ZEND_FENTRY'
 #define ZEND_FE(name, arg_info)      ZEND_FENTRY(name, ZEND_FN(name), arg_info, 0)
                                      ^
/usr/include/php/main/php.h:349:18: note: in expansion of macro 'ZEND_FE'
 #define PHP_FE   ZEND_FE
                  ^
scripting/php/phpcups.c:52:3: note: in expansion of macro 'PHP_FE'
   PHP_FE(cups_last_error, NULL)
   ^
/usr/include/php/Zend/zend_API.h:71:129: warning: (near initialization for 'phpcups_functions[3]') [enabled by default]
 #define ZEND_FENTRY(zend_name, name, arg_info, flags) { #zend_name, name, arg_info, (zend_uint) (sizeof(arg_info)/sizeof(struct _zend_arg_info)-1), flags },
                                                                                                                                 ^
/usr/include/php/Zend/zend_API.h:77:38: note: in expansion of macro 'ZEND_FENTRY'
 #define ZEND_FE(name, arg_info)      ZEND_FENTRY(name, ZEND_FN(name), arg_info, 0)
                                      ^
/usr/include/php/main/php.h:349:18: note: in expansion of macro 'ZEND_FE'
 #define PHP_FE   ZEND_FE
                  ^
scripting/php/phpcups.c:52:3: note: in expansion of macro 'PHP_FE'
   PHP_FE(cups_last_error, NULL)
   ^
scripting/php/phpcups.c:53:3: warning: braces around scalar initializer [enabled by default]
   PHP_FE(cups_last_error_string, NULL)
   ^
scripting/php/phpcups.c:53:3: warning: (near initialization for 'phpcups_functions[4]') [enabled by default]
scripting/php/phpcups.c:53:3: warning: initialization makes integer from pointer without a cast [enabled by default]
scripting/php/phpcups.c:53:3: warning: (near initialization for 'phpcups_functions[4]') [enabled by default]
scripting/php/phpcups.c:53:3: warning: excess elements in scalar initializer [enabled by default]
scripting/php/phpcups.c:53:3: warning: (near initialization for 'phpcups_functions[4]') [enabled by default]
scripting/php/phpcups.c:53:3: warning: excess elements in scalar initializer [enabled by default]
scripting/php/phpcups.c:53:3: warning: (near initialization for 'phpcups_functions[4]') [enabled by default]
In file included from /usr/include/php/main/php.h:38:0,
                 from scripting/php/phpcups.c:33:
/usr/include/php/Zend/zend_API.h:71:129: warning: excess elements in scalar initializer [enabled by default]
 #define ZEND_FENTRY(zend_name, name, arg_info, flags) { #zend_name, name, arg_info, (zend_uint) (sizeof(arg_info)/sizeof(struct _zend_arg_info)-1), flags },
                                                                                                                                 ^
/usr/include/php/Zend/zend_API.h:77:38: note: in expansion of macro 'ZEND_FENTRY'
 #define ZEND_FE(name, arg_info)      ZEND_FENTRY(name, ZEND_FN(name), arg_info, 0)
                                      ^
/usr/include/php/main/php.h:349:18: note: in expansion of macro 'ZEND_FE'
 #define PHP_FE   ZEND_FE
                  ^
scripting/php/phpcups.c:53:3: note: in expansion of macro 'PHP_FE'
   PHP_FE(cups_last_error_string, NULL)
   ^
/usr/include/php/Zend/zend_API.h:71:129: warning: (near initialization for 'phpcups_functions[4]') [enabled by default]
 #define ZEND_FENTRY(zend_name, name, arg_info, flags) { #zend_name, name, arg_info, (zend_uint) (sizeof(arg_info)/sizeof(struct _zend_arg_info)-1), flags },
                                                                                                                                 ^
/usr/include/php/Zend/zend_API.h:77:38: note: in expansion of macro 'ZEND_FENTRY'
 #define ZEND_FE(name, arg_info)      ZEND_FENTRY(name, ZEND_FN(name), arg_info, 0)
                                      ^
/usr/include/php/main/php.h:349:18: note: in expansion of macro 'ZEND_FE'
 #define PHP_FE   ZEND_FE
                  ^
scripting/php/phpcups.c:53:3: note: in expansion of macro 'PHP_FE'
   PHP_FE(cups_last_error_string, NULL)
   ^
/usr/include/php/Zend/zend_API.h:71:129: warning: excess elements in scalar initializer [enabled by default]
 #define ZEND_FENTRY(zend_name, name, arg_info, flags) { #zend_name, name, arg_info, (zend_uint) (sizeof(arg_info)/sizeof(struct _zend_arg_info)-1), flags },
                                                                                                                                 ^
/usr/include/php/Zend/zend_API.h:77:38: note: in expansion of macro 'ZEND_FENTRY'
 #define ZEND_FE(name, arg_info)      ZEND_FENTRY(name, ZEND_FN(name), arg_info, 0)
                                      ^
/usr/include/php/main/php.h:349:18: note: in expansion of macro 'ZEND_FE'
 #define PHP_FE   ZEND_FE
                  ^
scripting/php/phpcups.c:53:3: note: in expansion of macro 'PHP_FE'
   PHP_FE(cups_last_error_string, NULL)
   ^
/usr/include/php/Zend/zend_API.h:71:129: warning: (near initialization for 'phpcups_functions[4]') [enabled by default]
 #define ZEND_FENTRY(zend_name, name, arg_info, flags) { #zend_name, name, arg_info, (zend_uint) (sizeof(arg_info)/sizeof(struct _zend_arg_info)-1), flags },
                                                                                                                                 ^
/usr/include/php/Zend/zend_API.h:77:38: note: in expansion of macro 'ZEND_FENTRY'
 #define ZEND_FE(name, arg_info)      ZEND_FENTRY(name, ZEND_FN(name), arg_info, 0)
                                      ^
/usr/include/php/main/php.h:349:18: note: in expansion of macro 'ZEND_FE'
 #define PHP_FE   ZEND_FE
                  ^
scripting/php/phpcups.c:53:3: note: in expansion of macro 'PHP_FE'
   PHP_FE(cups_last_error_string, NULL)
   ^
scripting/php/phpcups.c:54:3: warning: braces around scalar initializer [enabled by default]
   PHP_FE(cups_print_file, NULL)
   ^
scripting/php/phpcups.c:54:3: warning: (near initialization for 'phpcups_functions[5]') [enabled by default]
scripting/php/phpcups.c:54:3: warning: initialization makes integer from pointer without a cast [enabled by default]
scripting/php/phpcups.c:54:3: warning: (near initialization for 'phpcups_functions[5]') [enabled by default]
scripting/php/phpcups.c:54:3: warning: excess elements in scalar initializer [enabled by default]
scripting/php/phpcups.c:54:3: warning: (near initialization for 'phpcups_functions[5]') [enabled by default]
scripting/php/phpcups.c:54:3: warning: excess elements in scalar initializer [enabled by default]
scripting/php/phpcups.c:54:3: warning: (near initialization for 'phpcups_functions[5]') [enabled by default]
In file included from /usr/include/php/main/php.h:38:0,
                 from scripting/php/phpcups.c:33:
/usr/include/php/Zend/zend_API.h:71:129: warning: excess elements in scalar initializer [enabled by default]
 #define ZEND_FENTRY(zend_name, name, arg_info, flags) { #zend_name, name, arg_info, (zend_uint) (sizeof(arg_info)/sizeof(struct _zend_arg_info)-1), flags },
                                                                                                                                 ^
/usr/include/php/Zend/zend_API.h:77:38: note: in expansion of macro 'ZEND_FENTRY'
 #define ZEND_FE(name, arg_info)      ZEND_FENTRY(name, ZEND_FN(name), arg_info, 0)
                                      ^
/usr/include/php/main/php.h:349:18: note: in expansion of macro 'ZEND_FE'
 #define PHP_FE   ZEND_FE
                  ^
scripting/php/phpcups.c:54:3: note: in expansion of macro 'PHP_FE'
   PHP_FE(cups_print_file, NULL)
   ^
/usr/include/php/Zend/zend_API.h:71:129: warning: (near initialization for 'phpcups_functions[5]') [enabled by default]
 #define ZEND_FENTRY(zend_name, name, arg_info, flags) { #zend_name, name, arg_info, (zend_uint) (sizeof(arg_info)/sizeof(struct _zend_arg_info)-1), flags },
                                                                                                                                 ^
/usr/include/php/Zend/zend_API.h:77:38: note: in expansion of macro 'ZEND_FENTRY'
 #define ZEND_FE(name, arg_info)      ZEND_FENTRY(name, ZEND_FN(name), arg_info, 0)
                                      ^
/usr/include/php/main/php.h:349:18: note: in expansion of macro 'ZEND_FE'
 #define PHP_FE   ZEND_FE
                  ^
scripting/php/phpcups.c:54:3: note: in expansion of macro 'PHP_FE'
   PHP_FE(cups_print_file, NULL)
   ^
/usr/include/php/Zend/zend_API.h:71:129: warning: excess elements in scalar initializer [enabled by default]
 #define ZEND_FENTRY(zend_name, name, arg_info, flags) { #zend_name, name, arg_info, (zend_uint) (sizeof(arg_info)/sizeof(struct _zend_arg_info)-1), flags },
                                                                                                                                 ^
/usr/include/php/Zend/zend_API.h:77:38: note: in expansion of macro 'ZEND_FENTRY'
 #define ZEND_FE(name, arg_info)      ZEND_FENTRY(name, ZEND_FN(name), arg_info, 0)
                                      ^
/usr/include/php/main/php.h:349:18: note: in expansion of macro 'ZEND_FE'
 #define PHP_FE   ZEND_FE
                  ^
scripting/php/phpcups.c:54:3: note: in expansion of macro 'PHP_FE'
   PHP_FE(cups_print_file, NULL)
   ^
/usr/include/php/Zend/zend_API.h:71:129: warning: (near initialization for 'phpcups_functions[5]') [enabled by default]
 #define ZEND_FENTRY(zend_name, name, arg_info, flags) { #zend_name, name, arg_info, (zend_uint) (sizeof(arg_info)/sizeof(struct _zend_arg_info)-1), flags },
                                                                                                                                 ^
/usr/include/php/Zend/zend_API.h:77:38: note: in expansion of macro 'ZEND_FENTRY'
 #define ZEND_FE(name, arg_info)      ZEND_FENTRY(name, ZEND_FN(name), arg_info, 0)
                                      ^
/usr/include/php/main/php.h:349:18: note: in expansion of macro 'ZEND_FE'
 #define PHP_FE   ZEND_FE
                  ^
scripting/php/phpcups.c:54:3: note: in expansion of macro 'PHP_FE'
   PHP_FE(cups_print_file, NULL)
   ^
scripting/php/phpcups.c:55:3: warning: braces around scalar initializer [enabled by default]
   PHP_FE(cups_print_files, NULL)
   ^
scripting/php/phpcups.c:55:3: warning: (near initialization for 'phpcups_functions[6]') [enabled by default]
scripting/php/phpcups.c:55:3: warning: initialization makes integer from pointer without a cast [enabled by default]
scripting/php/phpcups.c:55:3: warning: (near initialization for 'phpcups_functions[6]') [enabled by default]
scripting/php/phpcups.c:55:3: warning: excess elements in scalar initializer [enabled by default]
scripting/php/phpcups.c:55:3: warning: (near initialization for 'phpcups_functions[6]') [enabled by default]
scripting/php/phpcups.c:55:3: warning: excess elements in scalar initializer [enabled by default]
scripting/php/phpcups.c:55:3: warning: (near initialization for 'phpcups_functions[6]') [enabled by default]
In file included from /usr/include/php/main/php.h:38:0,
                 from scripting/php/phpcups.c:33:
/usr/include/php/Zend/zend_API.h:71:129: warning: excess elements in scalar initializer [enabled by default]
 #define ZEND_FENTRY(zend_name, name, arg_info, flags) { #zend_name, name, arg_info, (zend_uint) (sizeof(arg_info)/sizeof(struct _zend_arg_info)-1), flags },
                                                                                                                                 ^
/usr/include/php/Zend/zend_API.h:77:38: note: in expansion of macro 'ZEND_FENTRY'
 #define ZEND_FE(name, arg_info)      ZEND_FENTRY(name, ZEND_FN(name), arg_info, 0)
                                      ^
/usr/include/php/main/php.h:349:18: note: in expansion of macro 'ZEND_FE'
 #define PHP_FE   ZEND_FE
                  ^
scripting/php/phpcups.c:55:3: note: in expansion of macro 'PHP_FE'
   PHP_FE(cups_print_files, NULL)
   ^
/usr/include/php/Zend/zend_API.h:71:129: warning: (near initialization for 'phpcups_functions[6]') [enabled by default]
 #define ZEND_FENTRY(zend_name, name, arg_info, flags) { #zend_name, name, arg_info, (zend_uint) (sizeof(arg_info)/sizeof(struct _zend_arg_info)-1), flags },
                                                                                                                                 ^
/usr/include/php/Zend/zend_API.h:77:38: note: in expansion of macro 'ZEND_FENTRY'
 #define ZEND_FE(name, arg_info)      ZEND_FENTRY(name, ZEND_FN(name), arg_info, 0)
                                      ^
/usr/include/php/main/php.h:349:18: note: in expansion of macro 'ZEND_FE'
 #define PHP_FE   ZEND_FE
                  ^
scripting/php/phpcups.c:55:3: note: in expansion of macro 'PHP_FE'
   PHP_FE(cups_print_files, NULL)
   ^
/usr/include/php/Zend/zend_API.h:71:129: warning: excess elements in scalar initializer [enabled by default]
 #define ZEND_FENTRY(zend_name, name, arg_info, flags) { #zend_name, name, arg_info, (zend_uint) (sizeof(arg_info)/sizeof(struct _zend_arg_info)-1), flags },
                                                                                                                                 ^
/usr/include/php/Zend/zend_API.h:77:38: note: in expansion of macro 'ZEND_FENTRY'
 #define ZEND_FE(name, arg_info)      ZEND_FENTRY(name, ZEND_FN(name), arg_info, 0)
                                      ^
/usr/include/php/main/php.h:349:18: note: in expansion of macro 'ZEND_FE'
 #define PHP_FE   ZEND_FE
                  ^
scripting/php/phpcups.c:55:3: note: in expansion of macro 'PHP_FE'
   PHP_FE(cups_print_files, NULL)
   ^
/usr/include/php/Zend/zend_API.h:71:129: warning: (near initialization for 'phpcups_functions[6]') [enabled by default]
 #define ZEND_FENTRY(zend_name, name, arg_info, flags) { #zend_name, name, arg_info, (zend_uint) (sizeof(arg_info)/sizeof(struct _zend_arg_info)-1), flags },
                                                                                                                                 ^
/usr/include/php/Zend/zend_API.h:77:38: note: in expansion of macro 'ZEND_FENTRY'
 #define ZEND_FE(name, arg_info)      ZEND_FENTRY(name, ZEND_FN(name), arg_info, 0)
                                      ^
/usr/include/php/main/php.h:349:18: note: in expansion of macro 'ZEND_FE'
 #define PHP_FE   ZEND_FE
                  ^
scripting/php/phpcups.c:55:3: note: in expansion of macro 'PHP_FE'
   PHP_FE(cups_print_files, NULL)
   ^
scripting/php/phpcups.c:56:3: warning: braces around scalar initializer [enabled by default]
   {NULL, NULL, NULL}
   ^
scripting/php/phpcups.c:56:3: warning: (near initialization for 'phpcups_functions[7]') [enabled by default]
scripting/php/phpcups.c:56:3: warning: initialization makes integer from pointer without a cast [enabled by default]
scripting/php/phpcups.c:56:3: warning: (near initialization for 'phpcups_functions[7]') [enabled by default]
scripting/php/phpcups.c:56:3: warning: excess elements in scalar initializer [enabled by default]
scripting/php/phpcups.c:56:3: warning: (near initialization for 'phpcups_functions[7]') [enabled by default]
scripting/php/phpcups.c:56:3: warning: excess elements in scalar initializer [enabled by default]
scripting/php/phpcups.c:56:3: warning: (near initialization for 'phpcups_functions[7]') [enabled by default]
scripting/php/phpcups.c:68:3: warning: initialization from incompatible pointer type [enabled by default]
   phpcups_functions,
   ^
scripting/php/phpcups.c:68:3: warning: (near initialization for 'phpcups_module_entry.functions') [enabled by default]
Makefile:2525: recipe for target 'libphpcups_la-phpcups.lo' failed
make[1]: *** [libphpcups_la-phpcups.lo] Error 1
make[1]: *** Waiting for unfinished jobs....
mv -f .deps/embed_pdf.Tpo .deps/embed_pdf.Plo
mv -f .deps/parallel-parallel.Tpo .deps/parallel-parallel.Po
mv -f .deps/parallel-ieee1284.Tpo .deps/parallel-ieee1284.Po
mv -f .deps/sfnt_subset.Tpo .deps/sfnt_subset.Plo
mv -f .deps/embed_sfnt.Tpo .deps/embed_sfnt.Plo
libtool: compile:  i486-pld-linux-gcc -DHAVE_CONFIG_H -I. -O2 -fwrapv -pipe -Wformat -Werror=format-security -gdwarf-4 -fno-debug-types-section -fvar-tracking-assignments -g2 -Wp,-D_FORTIFY_SOURCE=2 -fstack-protector --param=ssp-buffer-size=4 -fomit-frame-pointer -march=i486 -fasynchronous-unwind-tables -gdwarf-4 -fno-debug-types-section -fvar-tracking-assignments -g2 -Wall -pedantic -std=gnu99 -D_GNU_SOURCE -MT sfnt.lo -MD -MP -MF .deps/sfnt.Tpo -c fontembed/sfnt.c -o sfnt.o >/dev/null 2>&1
mv -f .deps/libcupsfilters_la-raster.Tpo .deps/libcupsfilters_la-raster.Plo
mv -f .deps/libcupsfilters_la-image-tiff.Tpo .deps/libcupsfilters_la-image-tiff.Plo
mv -f .deps/sfnt.Tpo .deps/sfnt.Plo
make[1]: Leaving directory '/tmp/B.5f7a4b71-2252-48e9-9e4e-2f2de3091f6f/BUILD/cups-filters-1.0.47'
Makefile:1613: recipe for target 'all' failed
make: *** [all] Error 2
error: Bad exit status from /tmp/B.5f7a4b71-2252-48e9-9e4e-2f2de3091f6f/BUILD/tmp/rpm-tmp.25788 (%build)


RPM build errors:
    Bad exit status from /tmp/B.5f7a4b71-2252-48e9-9e4e-2f2de3091f6f/BUILD/tmp/rpm-tmp.25788 (%build)
ended at: Mon Apr 28 13:49:32 2014, done in 0:00:26.540643
error: No files produced.
+ chmod -R u+rwX /tmp/B.5f7a4b71-2252-48e9-9e4e-2f2de3091f6f/BUILD
+ rm -rf /tmp/B.5f7a4b71-2252-48e9-9e4e-2f2de3091f6f/tmp /tmp/B.5f7a4b71-2252-48e9-9e4e-2f2de3091f6f/BUILD
+ rm -rf /tmp/B.5f7a4b71-2252-48e9-9e4e-2f2de3091f6f
Begin-PLD-Builder-Info
Build-Time: user:34.96s sys:5.88s real:33.48s (faults io:61 non-io:1693487)

End-PLD-Builder-Info
[Back to list of logs] [View rpm -qa of builder]