FailedOk

th/SRPMS[OK]
th/x32[OK]
th/i686[OK]
th/x86_64[OK]

ac/SRPMS[OK]
ac/i386[OK]
ac/i586[OK]
ac/i686[OK]
ac/alpha[OK]
ac/amd64[OK]
ac/athlon[OK]
ac/ppc[OK]
ac/sparc[OK]
ac/sparc64[OK]

Advanced Search
main()
Powered by PLD Linux
(c) 2002-2022 PLD Team
$Revision: 1.37 $
Powered by voodoo magic.
Your IP: 52.203.18.65

ossp-uuid a370d466-09aa-42f8-9483-2b4804246e9b

Status:Failed
Source URL:https://buildlogs.pld-linux.org/pld/th/i486/FAIL/ossp-uuid,a370d466-09aa-42f8-9483-2b4804246e9b.bz2
text/plain URL:View!
rpm -qa of builder:View!
Date:2014/04/28 14:18:03
Runtime:0:00:17.994232

Toc:

  • prep
  • Executing(%prep): /bin/sh -e /tmp/B.e4d21c47-9f39-40a9-9a48-bb1f7cd7cbe5/BUILD/tmp/rpm-tmp.1245
  • build
  • Executing(%build): /bin/sh -e /tmp/B.e4d21c47-9f39-40a9-9a48-bb1f7cd7cbe5/BUILD/tmp/rpm-tmp.1245
  • error 1
  • /tmp/B.e4d21c47-9f39-40a9-9a48-bb1f7cd7cbe5/BUILD/uuid-1.6.2/php/uuid.c:499:1: error: unknown type name 'function_entry'
  • error 2
  • Makefile:202: recipe for target 'uuid.lo' failed
  • error 3
  • make[2]: *** [uuid.lo] Error 1
  • error 4
  • Makefile.local:41: recipe for target 'build' failed
  • error 5
  • make[1]: *** [build] Error 2
  • error 6
  • Makefile:134: recipe for target 'php/modules/ossp-uuid.so' failed
  • error 7
  • error: Bad exit status from /tmp/B.e4d21c47-9f39-40a9-9a48-bb1f7cd7cbe5/BUILD/tmp/rpm-tmp.1245 (%build)
  • error 8
  • RPM build errors:
  • error 9
  • error: No files produced.

Content:

request from: glen
checking if we should skip the build
started at: Mon Apr 28 14:17:37 2014
fetching http://src.th.pld-linux.org//srpms/a370d466-09aa-42f8-9483-2b4804246e9b/ossp-uuid-1.6.2-15.src.rpm
fetched 415091 bytes, 1804.8 K/s
installing srpm: ossp-uuid-1.6.2-15.src.rpm
+ install -d /tmp/B.e4d21c47-9f39-40a9-9a48-bb1f7cd7cbe5/BUILD /tmp/B.e4d21c47-9f39-40a9-9a48-bb1f7cd7cbe5/RPMS
+ rpm -Uhv --nodeps --define '_topdir /tmp/B.e4d21c47-9f39-40a9-9a48-bb1f7cd7cbe5' --define '_specdir %{_topdir}' --define '_sourcedir %{_specdir}' --define '_rpmdir %{_topdir}/RPMS' --define '_builddir %{_topdir}/BUILD' ossp-uuid-1.6.2-15.src.rpm
Preparing...                ##################################################
ossp-uuid                   ##################################################
+ rm -f ossp-uuid-1.6.2-15.src.rpm
+ install -m 700 -d /tmp/B.e4d21c47-9f39-40a9-9a48-bb1f7cd7cbe5/BUILD/tmp
+ TMPDIR=/tmp/B.e4d21c47-9f39-40a9-9a48-bb1f7cd7cbe5/BUILD/tmp
+ exec nice -n 0 rpmbuild -bp --short-circuit --nodeps --define '_topdir /tmp/B.e4d21c47-9f39-40a9-9a48-bb1f7cd7cbe5' --define '_specdir %{_topdir}' --define '_sourcedir %{_specdir}' --define '_rpmdir %{_topdir}/RPMS' --define '_builddir %{_topdir}/BUILD' --target i486-pld-linux --define 'prep exit 0' /tmp/B.e4d21c47-9f39-40a9-9a48-bb1f7cd7cbe5/ossp-uuid.spec
Building target platforms: i486-pld-linux
checking BuildConflict-ing packages
no BuildConflicts found
checking BR
rpm: Building target platforms: i486-pld-linux
no BR needed
building RPM using: set -ex; : build-id: a370d466-09aa-42f8-9483-2b4804246e9b; TMPDIR=/tmp/B.e4d21c47-9f39-40a9-9a48-bb1f7cd7cbe5/BUILD/tmp exec nice -n 0 rpmbuild -bb --define '_smp_mflags -j9' --define '_pld_builder 1' --define '_topdir /tmp/B.e4d21c47-9f39-40a9-9a48-bb1f7cd7cbe5' --define '_specdir %{_topdir}' --define '_sourcedir %{_specdir}' --define '_rpmdir %{_topdir}/RPMS' --define '_builddir %{_topdir}/BUILD'  --target i486-pld-linux /tmp/B.e4d21c47-9f39-40a9-9a48-bb1f7cd7cbe5/ossp-uuid.spec
+ : build-id: a370d466-09aa-42f8-9483-2b4804246e9b
+ TMPDIR=/tmp/B.e4d21c47-9f39-40a9-9a48-bb1f7cd7cbe5/BUILD/tmp
+ exec nice -n 0 rpmbuild -bb --define '_smp_mflags -j9' --define '_pld_builder 1' --define '_topdir /tmp/B.e4d21c47-9f39-40a9-9a48-bb1f7cd7cbe5' --define '_specdir %{_topdir}' --define '_sourcedir %{_specdir}' --define '_rpmdir %{_topdir}/RPMS' --define '_builddir %{_topdir}/BUILD' --target i486-pld-linux /tmp/B.e4d21c47-9f39-40a9-9a48-bb1f7cd7cbe5/ossp-uuid.spec
Building target platforms: i486-pld-linux
Executing(%prep): /bin/sh -e /tmp/B.e4d21c47-9f39-40a9-9a48-bb1f7cd7cbe5/BUILD/tmp/rpm-tmp.1245
+ umask 022
+ cd /tmp/B.e4d21c47-9f39-40a9-9a48-bb1f7cd7cbe5/BUILD
+ cd /tmp/B.e4d21c47-9f39-40a9-9a48-bb1f7cd7cbe5/BUILD
+ rm -rf uuid-1.6.2
+ /usr/bin/gzip -dc /tmp/B.e4d21c47-9f39-40a9-9a48-bb1f7cd7cbe5/uuid-1.6.2.tar.gz
+ /bin/tar -xf -
+ STATUS=0 
+ '[' 0 -ne 0 ']'
+ cd uuid-1.6.2
+ /bin/id -u
+ '[' 2001 '=' 0 ']'
+ /bin/id -u
+ '[' 2001 '=' 0 ']'
+ /bin/chmod -Rf a+rX,u+w,g-w,o-w .
+ echo 'Patch #0 (uuid-ossp-prefix.patch):'
Patch #0 (uuid-ossp-prefix.patch):
+ '[' -f /tmp/B.e4d21c47-9f39-40a9-9a48-bb1f7cd7cbe5/uuid-ossp-prefix.patch ']'
+ /bin/cat /tmp/B.e4d21c47-9f39-40a9-9a48-bb1f7cd7cbe5/uuid-ossp-prefix.patch
+ /usr/bin/patch -s -p1
+ exit 0
Executing(%build): /bin/sh -e /tmp/B.e4d21c47-9f39-40a9-9a48-bb1f7cd7cbe5/BUILD/tmp/rpm-tmp.1245
TMP=/home/users/builder/tmp
HOME=/home/users/builder
PATH=/home/users/builder/GNUstep/Tools:/usr/local/bin:/usr/bin:/bin:/home/users/builder/bin
TMPDIR=/tmp/B.e4d21c47-9f39-40a9-9a48-bb1f7cd7cbe5/BUILD/tmp
+ umask 022
+ cd /tmp/B.e4d21c47-9f39-40a9-9a48-bb1f7cd7cbe5/BUILD
+ cd uuid-1.6.2
+ ./configure 'LDFLAGS=-Wl,--as-needed -Wl,--no-copy-dt-needed-entries -Wl,-z,relro -Wl,-z,combreloc ' 'CFLAGS=-O2 -fwrapv -pipe -Wformat -Werror=format-security -gdwarf-4 -fno-debug-types-section -fvar-tracking-assignments -g2 -Wp,-D_FORTIFY_SOURCE=2 -fstack-protector --param=ssp-buffer-size=4 -fomit-frame-pointer -march=i486 -fasynchronous-unwind-tables -gdwarf-4 -fno-debug-types-section -fvar-tracking-assignments -g2 ' 'CXXFLAGS=-O2 -fwrapv -pipe -Wformat -Werror=format-security -gdwarf-4 -fno-debug-types-section -fvar-tracking-assignments -g2 -Wp,-D_FORTIFY_SOURCE=2 -fstack-protector --param=ssp-buffer-size=4 -fomit-frame-pointer -march=i486 -fasynchronous-unwind-tables -gdwarf-4 -fno-debug-types-section -fvar-tracking-assignments -g2 ' 'FFLAGS=-O2 -fwrapv -pipe -Wformat -Werror=format-security -gdwarf-4 -fno-debug-types-section -fvar-tracking-assignments -g2 -Wp,-D_FORTIFY_SOURCE=2 -fstack-protector --param=ssp-buffer-size=4 -fomit-frame-pointer -march=i486 -fasynchronous-unwind-tables -gdwarf-4 -fno-debug-types-section -fvar-tracking-assignments -g2 ' 'FCFLAGS=-O2 -fwrapv -pipe -Wformat -Werror=format-security -gdwarf-4 -fno-debug-types-section -fvar-tracking-assignments -g2 -Wp,-D_FORTIFY_SOURCE=2 -fstack-protector --param=ssp-buffer-size=4 -fomit-frame-pointer -march=i486 -fasynchronous-unwind-tables -gdwarf-4 -fno-debug-types-section -fvar-tracking-assignments -g2 ' 'CPPFLAGS=' 'CC=i486-pld-linux-gcc' 'CXX=i486-pld-linux-g++' '--host=i486-pld-linux' '--build=i486-pld-linux' '--prefix=/usr' '--exec-prefix=/usr' '--bindir=/usr/bin' '--sbindir=/usr/sbin' '--sysconfdir=/etc' '--datadir=/usr/share' '--includedir=/usr/include' '--libdir=/usr/lib' '--libexecdir=/usr/lib' '--localstatedir=/var' '--sharedstatedir=/var/lib' '--mandir=/usr/share/man' '--infodir=/usr/share/info' '--x-libraries=/usr/lib' '--includedir=/usr/include/ossp-uuid' --with-dce --with-cxx --with-perl --with-php --without-pgsql
Configuring OSSP uuid (Universally Unique Identifier), version 1.6.2 (04-Jul-2008)
checking whether make sets $(MAKE)... yes
checking for i486-pld-linux-gcc... i486-pld-linux-gcc
checking for C compiler default output file name... a.out
checking whether the C compiler works... yes
checking whether we are cross compiling... no
checking for suffix of executables... 
checking for suffix of object files... o
checking whether we are using the GNU C compiler... yes
checking whether i486-pld-linux-gcc accepts -g... yes
checking for i486-pld-linux-gcc option to accept ISO C89... none needed
checking for compilation debug mode... disabled
checking how to run the C preprocessor... i486-pld-linux-gcc -E
checking for grep that handles long lines and -e... /bin/grep
checking for egrep... /bin/grep -E
checking for ANSI C header files... yes
checking for sys/types.h... yes
checking for sys/stat.h... yes
checking for stdlib.h... yes
checking for string.h... yes
checking for memory.h... yes
checking for strings.h... yes
checking for inttypes.h... yes
checking for stdint.h... yes
checking for unistd.h... yes
checking whether to build against external Dmalloc library... no
checking build system type... i486-pld-linux-gnu
checking host system type... i486-pld-linux-gnu
checking for a sed that does not truncate output... /bin/sed
checking for fgrep... /bin/grep -F
checking for ld used by i486-pld-linux-gcc... /usr/bin/ld
checking if the linker (/usr/bin/ld) is GNU ld... yes
checking for BSD- or MS-compatible name lister (nm)... /usr/bin/nm -B
checking the name lister (/usr/bin/nm -B) interface... BSD nm
checking whether ln -s works... yes
checking the maximum length of command line arguments... 1572864
checking whether the shell understands some XSI constructs... yes
checking whether the shell understands "+="... yes
checking for /usr/bin/ld option to reload object files... -r
checking how to recognize dependent libraries... pass_all
checking for i486-pld-linux-ar... no
checking for ar... ar
checking for i486-pld-linux-strip... no
checking for strip... strip
checking for i486-pld-linux-ranlib... no
checking for ranlib... ranlib
checking command to parse /usr/bin/nm -B output from i486-pld-linux-gcc object... ok
checking for dlfcn.h... yes
checking for objdir... .libs
checking if i486-pld-linux-gcc supports -fno-rtti -fno-exceptions... no
checking for i486-pld-linux-gcc option to produce PIC... -fPIC -DPIC
checking if i486-pld-linux-gcc PIC flag -fPIC -DPIC works... yes
checking if i486-pld-linux-gcc static flag -static works... yes
checking if i486-pld-linux-gcc supports -c -o file.o... yes
checking if i486-pld-linux-gcc supports -c -o file.o... (cached) yes
checking whether the i486-pld-linux-gcc linker (/usr/bin/ld) supports shared libraries... yes
checking whether -lc should be explicitly linked in... no
checking dynamic linker characteristics... GNU/Linux ld.so
checking how to hardcode library paths into programs... immediate
checking whether stripping libraries is possible... yes
checking if libtool supports shared libraries... yes
checking whether to build shared libraries... yes
checking whether to build static libraries... yes
checking whether we are using the GNU C++ compiler... yes
checking whether i486-pld-linux-g++ accepts -g... yes
checking how to run the C++ preprocessor... i486-pld-linux-g++ -E
checking for gethostname in -lnsl... yes
checking for accept in -lsocket... no
checking for va_copy() function... yes
checking for sys/types.h... (cached) yes
checking sys/param.h usability... yes
checking sys/param.h presence... yes
checking for sys/param.h... yes
checking sys/time.h usability... yes
checking sys/time.h presence... yes
checking for sys/time.h... yes
checking sys/socket.h usability... yes
checking sys/socket.h presence... yes
checking for sys/socket.h... yes
checking sys/sockio.h usability... no
checking sys/sockio.h presence... no
checking for sys/sockio.h... no
checking sys/ioctl.h usability... yes
checking sys/ioctl.h presence... yes
checking for sys/ioctl.h... yes
checking sys/select.h usability... yes
checking sys/select.h presence... yes
checking for sys/select.h... yes
checking for netdb.h... yes
checking for ifaddrs.h... yes
checking for net/if.h... yes
checking for net/if_dl.h... no
checking for net/if_arp.h... yes
checking for netinet/in.h... yes
checking for arpa/inet.h... yes
checking for struct timeval... yes
checking for getifaddrs... yes
checking for nanosleep... yes
checking for Sleep... no
checking for gettimeofday... yes
checking for clock_gettime... yes
checking for long long... yes
checking for long double... yes
checking size of char... 1
checking size of unsigned char... 1
checking size of short... 2
checking size of unsigned short... 2
checking size of int... 4
checking size of unsigned int... 4
checking size of long... 4
checking size of unsigned long... 4
checking size of long long... 8
checking size of unsigned long long... 8
checking whether to build DCE 1.1 backward compatibility API... (cached) yes
checking whether to build C++ bindings to C API... (cached) yes
checking whether we are using the GNU C++ compiler... (cached) yes
checking whether i486-pld-linux-g++ accepts -g... (cached) yes
checking for ld used by i486-pld-linux-g++... /usr/bin/ld
checking if the linker (/usr/bin/ld) is GNU ld... yes
checking whether the i486-pld-linux-g++ linker (/usr/bin/ld) supports shared libraries... yes
checking for i486-pld-linux-g++ option to produce PIC... -fPIC -DPIC
checking if i486-pld-linux-g++ PIC flag -fPIC -DPIC works... yes
checking if i486-pld-linux-g++ static flag -static works... yes
checking if i486-pld-linux-g++ supports -c -o file.o... yes
checking if i486-pld-linux-g++ supports -c -o file.o... (cached) yes
checking whether the i486-pld-linux-g++ linker (/usr/bin/ld) supports shared libraries... yes
checking dynamic linker characteristics... GNU/Linux ld.so
checking how to hardcode library paths into programs... immediate
checking whether to build Perl bindings to C API... (cached) yes
checking whether to build Perl compatibility API... (cached) no
checking for perl... /usr/bin/perl
checking whether to build PHP bindings to C API... (cached) yes
checking for php5... no
checking for php... /usr/bin/php
Configuring for:
PHP Api Version:         20121113
Zend Module Api No:      20121212
Zend Extension Api No:   220121212
checking for grep that handles long lines and -e... /bin/grep
checking for egrep... /bin/grep -E
checking for a sed that does not truncate output... /bin/sed
checking whether the C compiler works... yes
checking for C compiler default output file name... a.out
checking for suffix of executables... 
checking whether we are cross compiling... no
checking for suffix of object files... o
checking whether we are using the GNU C compiler... yes
checking whether i486-pld-linux-gcc accepts -g... yes
checking for i486-pld-linux-gcc option to accept ISO C89... none needed
checking how to run the C preprocessor... i486-pld-linux-gcc -E
checking for icc... no
checking for suncc... no
checking whether i486-pld-linux-gcc and cc understand -c and -o together... yes
checking for system library directory... lib
checking if compiler supports -R... no
checking if compiler supports -Wl,-rpath,... yes
checking build system type... i686-pc-linux-gnu
checking host system type... i686-pc-linux-gnu
checking target system type... i686-pc-linux-gnu
checking for PHP prefix... /usr
checking for PHP includes... -I/usr/include/php -I/usr/include/php/main -I/usr/include/php/TSRM -I/usr/include/php/Zend -I/usr/include/php/ext -I/usr/include/php/ext/date/lib
checking for PHP extension directory... /usr/lib/php
checking for PHP installed headers prefix... /usr/include/php
checking if debug is enabled... no
checking if zts is enabled... no
checking for re2c... re2c
checking for re2c version... 0.13.5 (ok)
checking for gawk... gawk
checking OSSP uuid module... yes, shared
checking for uuid_create... no
checking how to print strings... print -r
checking for a sed that does not truncate output... (cached) /bin/sed
checking for fgrep... /bin/grep -F
checking for ld used by i486-pld-linux-gcc... /usr/bin/ld
checking if the linker (/usr/bin/ld) is GNU ld... yes
checking for BSD- or MS-compatible name lister (nm)... /usr/bin/nm -B
checking the name lister (/usr/bin/nm -B) interface... BSD nm
checking whether ln -s works... yes
checking the maximum length of command line arguments... 1572864
checking whether the shell understands some XSI constructs... yes
checking whether the shell understands "+="... yes
checking how to convert i686-pc-linux-gnu file names to i686-pc-linux-gnu format... func_convert_file_noop
checking how to convert i686-pc-linux-gnu file names to toolchain format... func_convert_file_noop
checking for /usr/bin/ld option to reload object files... -r
checking for objdump... objdump
checking how to recognize dependent libraries... pass_all
checking for dlltool... no
checking how to associate runtime and link libraries... print -r --
checking for ar... ar
checking for archiver @FILE support... @
checking for strip... strip
checking for ranlib... ranlib
checking for mawk... (cached) gawk
checking command to parse /usr/bin/nm -B output from i486-pld-linux-gcc object... ok
checking for sysroot... no
checking for mt... no
checking if : is a manifest tool... no
checking for ANSI C header files... yes
checking for sys/types.h... yes
checking for sys/stat.h... yes
checking for stdlib.h... yes
checking for string.h... yes
checking for memory.h... yes
checking for strings.h... yes
checking for inttypes.h... yes
checking for stdint.h... yes
checking for unistd.h... yes
checking for dlfcn.h... yes
checking for objdir... .libs
checking if i486-pld-linux-gcc supports -fno-rtti -fno-exceptions... no
checking for i486-pld-linux-gcc option to produce PIC... -fPIC -DPIC
checking if i486-pld-linux-gcc PIC flag -fPIC -DPIC works... yes
checking if i486-pld-linux-gcc static flag -static works... yes
checking if i486-pld-linux-gcc supports -c -o file.o... yes
checking if i486-pld-linux-gcc supports -c -o file.o... (cached) yes
checking whether the i486-pld-linux-gcc linker (/usr/bin/ld) supports shared libraries... yes
checking whether -lc should be explicitly linked in... no
checking dynamic linker characteristics... GNU/Linux ld.so
checking how to hardcode library paths into programs... immediate
checking whether stripping libraries is possible... yes
checking if libtool supports shared libraries... yes
checking whether to build shared libraries... yes
checking whether to build static libraries... no
configure: creating ./config.status
config.status: creating config.h
config.status: executing libtool commands
checking whether to build PostgreSQL bindings to C API... (cached) no
checking for pg_config... /usr/bin/pg_config
configure: creating ./config.status
config.status: creating Makefile
config.status: creating uuid-config
config.status: creating uuid.pc
config.status: creating uuid.h
config.status: creating config.h
config.status: executing libtool commands
config.status: executing adjustment commands
+ /usr/bin/make -j9
libtool: compile:  i486-pld-linux-gcc -I. -I. -DHAVE_CONFIG_H -O2 -fwrapv -pipe -Wformat -Werror=format-security -gdwarf-4 -fno-debug-types-section -fvar-tracking-assignments -g2 -Wp,-D_FORTIFY_SOURCE=2 -fstack-protector --param=ssp-buffer-size=4 -fomit-frame-pointer -march=i486 -fasynchronous-unwind-tables -gdwarf-4 -fno-debug-types-section -fvar-tracking-assignments -g2 -c uuid.c  -fPIC -DPIC -o .libs/uuid.o
libtool: compile:  i486-pld-linux-gcc -I. -I. -DHAVE_CONFIG_H -O2 -fwrapv -pipe -Wformat -Werror=format-security -gdwarf-4 -fno-debug-types-section -fvar-tracking-assignments -g2 -Wp,-D_FORTIFY_SOURCE=2 -fstack-protector --param=ssp-buffer-size=4 -fomit-frame-pointer -march=i486 -fasynchronous-unwind-tables -gdwarf-4 -fno-debug-types-section -fvar-tracking-assignments -g2 -c uuid_ui128.c  -fPIC -DPIC -o .libs/uuid_ui128.o
libtool: compile:  i486-pld-linux-gcc -I. -I. -DHAVE_CONFIG_H -O2 -fwrapv -pipe -Wformat -Werror=format-security -gdwarf-4 -fno-debug-types-section -fvar-tracking-assignments -g2 -Wp,-D_FORTIFY_SOURCE=2 -fstack-protector --param=ssp-buffer-size=4 -fomit-frame-pointer -march=i486 -fasynchronous-unwind-tables -gdwarf-4 -fno-debug-types-section -fvar-tracking-assignments -g2 -c uuid_sha1.c  -fPIC -DPIC -o .libs/uuid_sha1.o
libtool: compile:  i486-pld-linux-gcc -I. -I. -DHAVE_CONFIG_H -O2 -fwrapv -pipe -Wformat -Werror=format-security -gdwarf-4 -fno-debug-types-section -fvar-tracking-assignments -g2 -Wp,-D_FORTIFY_SOURCE=2 -fstack-protector --param=ssp-buffer-size=4 -fomit-frame-pointer -march=i486 -fasynchronous-unwind-tables -gdwarf-4 -fno-debug-types-section -fvar-tracking-assignments -g2 -c uuid_time.c  -fPIC -DPIC -o .libs/uuid_time.o
libtool: compile:  i486-pld-linux-gcc -I. -I. -DHAVE_CONFIG_H -O2 -fwrapv -pipe -Wformat -Werror=format-security -gdwarf-4 -fno-debug-types-section -fvar-tracking-assignments -g2 -Wp,-D_FORTIFY_SOURCE=2 -fstack-protector --param=ssp-buffer-size=4 -fomit-frame-pointer -march=i486 -fasynchronous-unwind-tables -gdwarf-4 -fno-debug-types-section -fvar-tracking-assignments -g2 -c uuid_mac.c  -fPIC -DPIC -o .libs/uuid_mac.o
libtool: compile:  i486-pld-linux-gcc -I. -I. -DHAVE_CONFIG_H -O2 -fwrapv -pipe -Wformat -Werror=format-security -gdwarf-4 -fno-debug-types-section -fvar-tracking-assignments -g2 -Wp,-D_FORTIFY_SOURCE=2 -fstack-protector --param=ssp-buffer-size=4 -fomit-frame-pointer -march=i486 -fasynchronous-unwind-tables -gdwarf-4 -fno-debug-types-section -fvar-tracking-assignments -g2 -c uuid_str.c  -fPIC -DPIC -o .libs/uuid_str.o
libtool: compile:  i486-pld-linux-gcc -I. -I. -DHAVE_CONFIG_H -O2 -fwrapv -pipe -Wformat -Werror=format-security -gdwarf-4 -fno-debug-types-section -fvar-tracking-assignments -g2 -Wp,-D_FORTIFY_SOURCE=2 -fstack-protector --param=ssp-buffer-size=4 -fomit-frame-pointer -march=i486 -fasynchronous-unwind-tables -gdwarf-4 -fno-debug-types-section -fvar-tracking-assignments -g2 -c uuid_prng.c  -fPIC -DPIC -o .libs/uuid_prng.o
libtool: compile:  i486-pld-linux-gcc -I. -I. -DHAVE_CONFIG_H -O2 -fwrapv -pipe -Wformat -Werror=format-security -gdwarf-4 -fno-debug-types-section -fvar-tracking-assignments -g2 -Wp,-D_FORTIFY_SOURCE=2 -fstack-protector --param=ssp-buffer-size=4 -fomit-frame-pointer -march=i486 -fasynchronous-unwind-tables -gdwarf-4 -fno-debug-types-section -fvar-tracking-assignments -g2 -c uuid_ui64.c  -fPIC -DPIC -o .libs/uuid_ui64.o
libtool: compile:  i486-pld-linux-gcc -I. -I. -DHAVE_CONFIG_H -O2 -fwrapv -pipe -Wformat -Werror=format-security -gdwarf-4 -fno-debug-types-section -fvar-tracking-assignments -g2 -Wp,-D_FORTIFY_SOURCE=2 -fstack-protector --param=ssp-buffer-size=4 -fomit-frame-pointer -march=i486 -fasynchronous-unwind-tables -gdwarf-4 -fno-debug-types-section -fvar-tracking-assignments -g2 -c uuid_md5.c  -fPIC -DPIC -o .libs/uuid_md5.o
libtool: compile:  i486-pld-linux-gcc -I. -I. -DHAVE_CONFIG_H -O2 -fwrapv -pipe -Wformat -Werror=format-security -gdwarf-4 -fno-debug-types-section -fvar-tracking-assignments -g2 -Wp,-D_FORTIFY_SOURCE=2 -fstack-protector --param=ssp-buffer-size=4 -fomit-frame-pointer -march=i486 -fasynchronous-unwind-tables -gdwarf-4 -fno-debug-types-section -fvar-tracking-assignments -g2 -c uuid_time.c -o uuid_time.o >/dev/null 2>&1
libtool: compile:  i486-pld-linux-gcc -I. -I. -DHAVE_CONFIG_H -O2 -fwrapv -pipe -Wformat -Werror=format-security -gdwarf-4 -fno-debug-types-section -fvar-tracking-assignments -g2 -Wp,-D_FORTIFY_SOURCE=2 -fstack-protector --param=ssp-buffer-size=4 -fomit-frame-pointer -march=i486 -fasynchronous-unwind-tables -gdwarf-4 -fno-debug-types-section -fvar-tracking-assignments -g2 -c uuid_mac.c -o uuid_mac.o >/dev/null 2>&1
libtool: compile:  i486-pld-linux-gcc -I. -I. -DHAVE_CONFIG_H -O2 -fwrapv -pipe -Wformat -Werror=format-security -gdwarf-4 -fno-debug-types-section -fvar-tracking-assignments -g2 -Wp,-D_FORTIFY_SOURCE=2 -fstack-protector --param=ssp-buffer-size=4 -fomit-frame-pointer -march=i486 -fasynchronous-unwind-tables -gdwarf-4 -fno-debug-types-section -fvar-tracking-assignments -g2 -c uuid_prng.c -o uuid_prng.o >/dev/null 2>&1
libtool: compile:  i486-pld-linux-gcc -I. -I. -DHAVE_CONFIG_H -O2 -fwrapv -pipe -Wformat -Werror=format-security -gdwarf-4 -fno-debug-types-section -fvar-tracking-assignments -g2 -Wp,-D_FORTIFY_SOURCE=2 -fstack-protector --param=ssp-buffer-size=4 -fomit-frame-pointer -march=i486 -fasynchronous-unwind-tables -gdwarf-4 -fno-debug-types-section -fvar-tracking-assignments -g2 -c uuid_dce.c  -fPIC -DPIC -o .libs/uuid_dce.o
libtool: compile:  i486-pld-linux-gcc -I. -I. -DHAVE_CONFIG_H -O2 -fwrapv -pipe -Wformat -Werror=format-security -gdwarf-4 -fno-debug-types-section -fvar-tracking-assignments -g2 -Wp,-D_FORTIFY_SOURCE=2 -fstack-protector --param=ssp-buffer-size=4 -fomit-frame-pointer -march=i486 -fasynchronous-unwind-tables -gdwarf-4 -fno-debug-types-section -fvar-tracking-assignments -g2 -c uuid_sha1.c -o uuid_sha1.o >/dev/null 2>&1
libtool: compile:  i486-pld-linux-g++ -I. -I. -DHAVE_CONFIG_H -O2 -fwrapv -pipe -Wformat -Werror=format-security -gdwarf-4 -fno-debug-types-section -fvar-tracking-assignments -g2 -Wp,-D_FORTIFY_SOURCE=2 -fstack-protector --param=ssp-buffer-size=4 -fomit-frame-pointer -march=i486 -fasynchronous-unwind-tables -gdwarf-4 -fno-debug-types-section -fvar-tracking-assignments -g2 -c uuid++.cc  -fPIC -DPIC -o .libs/uuid++.o
i486-pld-linux-gcc -I. -I.  -DHAVE_CONFIG_H -O2 -fwrapv -pipe -Wformat -Werror=format-security -gdwarf-4 -fno-debug-types-section -fvar-tracking-assignments -g2 -Wp,-D_FORTIFY_SOURCE=2 -fstack-protector --param=ssp-buffer-size=4 -fomit-frame-pointer -march=i486 -fasynchronous-unwind-tables -gdwarf-4 -fno-debug-types-section -fvar-tracking-assignments -g2  -c uuid_cli.c
libtool: compile:  i486-pld-linux-gcc -I. -I. -DHAVE_CONFIG_H -O2 -fwrapv -pipe -Wformat -Werror=format-security -gdwarf-4 -fno-debug-types-section -fvar-tracking-assignments -g2 -Wp,-D_FORTIFY_SOURCE=2 -fstack-protector --param=ssp-buffer-size=4 -fomit-frame-pointer -march=i486 -fasynchronous-unwind-tables -gdwarf-4 -fno-debug-types-section -fvar-tracking-assignments -g2 -c uuid_dce.c -o uuid_dce.o >/dev/null 2>&1
libtool: compile:  i486-pld-linux-gcc -I. -I. -DHAVE_CONFIG_H -O2 -fwrapv -pipe -Wformat -Werror=format-security -gdwarf-4 -fno-debug-types-section -fvar-tracking-assignments -g2 -Wp,-D_FORTIFY_SOURCE=2 -fstack-protector --param=ssp-buffer-size=4 -fomit-frame-pointer -march=i486 -fasynchronous-unwind-tables -gdwarf-4 -fno-debug-types-section -fvar-tracking-assignments -g2 -c uuid_md5.c -o uuid_md5.o >/dev/null 2>&1
libtool: compile:  i486-pld-linux-gcc -I. -I. -DHAVE_CONFIG_H -O2 -fwrapv -pipe -Wformat -Werror=format-security -gdwarf-4 -fno-debug-types-section -fvar-tracking-assignments -g2 -Wp,-D_FORTIFY_SOURCE=2 -fstack-protector --param=ssp-buffer-size=4 -fomit-frame-pointer -march=i486 -fasynchronous-unwind-tables -gdwarf-4 -fno-debug-types-section -fvar-tracking-assignments -g2 -c uuid_ui64.c -o uuid_ui64.o >/dev/null 2>&1
libtool: compile:  i486-pld-linux-gcc -I. -I. -DHAVE_CONFIG_H -O2 -fwrapv -pipe -Wformat -Werror=format-security -gdwarf-4 -fno-debug-types-section -fvar-tracking-assignments -g2 -Wp,-D_FORTIFY_SOURCE=2 -fstack-protector --param=ssp-buffer-size=4 -fomit-frame-pointer -march=i486 -fasynchronous-unwind-tables -gdwarf-4 -fno-debug-types-section -fvar-tracking-assignments -g2 -c uuid_str.c -o uuid_str.o >/dev/null 2>&1
libtool: compile:  i486-pld-linux-gcc -I. -I. -DHAVE_CONFIG_H -O2 -fwrapv -pipe -Wformat -Werror=format-security -gdwarf-4 -fno-debug-types-section -fvar-tracking-assignments -g2 -Wp,-D_FORTIFY_SOURCE=2 -fstack-protector --param=ssp-buffer-size=4 -fomit-frame-pointer -march=i486 -fasynchronous-unwind-tables -gdwarf-4 -fno-debug-types-section -fvar-tracking-assignments -g2 -c uuid.c -o uuid.o >/dev/null 2>&1
libtool: compile:  i486-pld-linux-gcc -I. -I. -DHAVE_CONFIG_H -O2 -fwrapv -pipe -Wformat -Werror=format-security -gdwarf-4 -fno-debug-types-section -fvar-tracking-assignments -g2 -Wp,-D_FORTIFY_SOURCE=2 -fstack-protector --param=ssp-buffer-size=4 -fomit-frame-pointer -march=i486 -fasynchronous-unwind-tables -gdwarf-4 -fno-debug-types-section -fvar-tracking-assignments -g2 -c uuid_ui128.c -o uuid_ui128.o >/dev/null 2>&1
libtool: compile:  i486-pld-linux-g++ -I. -I. -DHAVE_CONFIG_H -O2 -fwrapv -pipe -Wformat -Werror=format-security -gdwarf-4 -fno-debug-types-section -fvar-tracking-assignments -g2 -Wp,-D_FORTIFY_SOURCE=2 -fstack-protector --param=ssp-buffer-size=4 -fomit-frame-pointer -march=i486 -fasynchronous-unwind-tables -gdwarf-4 -fno-debug-types-section -fvar-tracking-assignments -g2 -c uuid++.cc -o uuid++.o >/dev/null 2>&1
libtool: link: i486-pld-linux-gcc -shared  .libs/uuid.o .libs/uuid_md5.o .libs/uuid_sha1.o .libs/uuid_prng.o .libs/uuid_mac.o .libs/uuid_time.o .libs/uuid_ui64.o .libs/uuid_ui128.o .libs/uuid_str.o      -Wl,-soname -Wl,libossp-uuid.so.16 -o .libs/libossp-uuid.so.16.0.22
libtool: link: i486-pld-linux-gcc -shared  .libs/uuid_dce.o .libs/uuid.o .libs/uuid_md5.o .libs/uuid_sha1.o .libs/uuid_prng.o .libs/uuid_mac.o .libs/uuid_time.o .libs/uuid_ui64.o .libs/uuid_ui128.o .libs/uuid_str.o      -Wl,-soname -Wl,libossp-uuid_dce.so.16 -o .libs/libossp-uuid_dce.so.16.0.22
libtool: link: (cd ".libs" && rm -f "libossp-uuid.so.16" && ln -s "libossp-uuid.so.16.0.22" "libossp-uuid.so.16")
libtool: link: (cd ".libs" && rm -f "libossp-uuid.so" && ln -s "libossp-uuid.so.16.0.22" "libossp-uuid.so")
libtool: link: (cd ".libs" && rm -f "libossp-uuid_dce.so.16" && ln -s "libossp-uuid_dce.so.16.0.22" "libossp-uuid_dce.so.16")
libtool: link: (cd ".libs" && rm -f "libossp-uuid_dce.so" && ln -s "libossp-uuid_dce.so.16.0.22" "libossp-uuid_dce.so")
libtool: link: ar cru .libs/libossp-uuid.a  uuid.o uuid_md5.o uuid_sha1.o uuid_prng.o uuid_mac.o uuid_time.o uuid_ui64.o uuid_ui128.o uuid_str.o
libtool: link: i486-pld-linux-g++ -shared -nostdlib /usr/lib/gcc/i486-pld-linux/4.8.2/../../../crti.o /usr/lib/gcc/i486-pld-linux/4.8.2/crtbeginS.o  .libs/uuid++.o .libs/uuid.o .libs/uuid_md5.o .libs/uuid_sha1.o .libs/uuid_prng.o .libs/uuid_mac.o .libs/uuid_time.o .libs/uuid_ui64.o .libs/uuid_ui128.o .libs/uuid_str.o   -L/usr/lib/gcc/i486-pld-linux/4.8.2 -L/usr/lib/gcc/i486-pld-linux/4.8.2/../../.. /usr/lib/libstdc++.so -lm -lc -lgcc_s /usr/lib/gcc/i486-pld-linux/4.8.2/crtendS.o /usr/lib/gcc/i486-pld-linux/4.8.2/../../../crtn.o    -Wl,-soname -Wl,libossp-uuid++.so.16 -o .libs/libossp-uuid++.so.16.0.22
libtool: link: ranlib .libs/libossp-uuid.a
libtool: link: ar cru .libs/libossp-uuid_dce.a  uuid_dce.o uuid.o uuid_md5.o uuid_sha1.o uuid_prng.o uuid_mac.o uuid_time.o uuid_ui64.o uuid_ui128.o uuid_str.o
libtool: link: ranlib .libs/libossp-uuid_dce.a
libtool: link: ( cd ".libs" && rm -f "libossp-uuid.la" && ln -s "../libossp-uuid.la" "libossp-uuid.la" )
make[1]: Entering directory '/tmp/B.e4d21c47-9f39-40a9-9a48-bb1f7cd7cbe5/BUILD/uuid-1.6.2/php'
libtool: link: ( cd ".libs" && rm -f "libossp-uuid_dce.la" && ln -s "../libossp-uuid_dce.la" "libossp-uuid_dce.la" )
make[2]: Entering directory '/tmp/B.e4d21c47-9f39-40a9-9a48-bb1f7cd7cbe5/BUILD/uuid-1.6.2/php'
/bin/sh /tmp/B.e4d21c47-9f39-40a9-9a48-bb1f7cd7cbe5/BUILD/uuid-1.6.2/php/libtool --mode=compile i486-pld-linux-gcc  -I. -I/tmp/B.e4d21c47-9f39-40a9-9a48-bb1f7cd7cbe5/BUILD/uuid-1.6.2/php -DPHP_ATOM_INC -I/tmp/B.e4d21c47-9f39-40a9-9a48-bb1f7cd7cbe5/BUILD/uuid-1.6.2/php/include -I/tmp/B.e4d21c47-9f39-40a9-9a48-bb1f7cd7cbe5/BUILD/uuid-1.6.2/php/main -I/tmp/B.e4d21c47-9f39-40a9-9a48-bb1f7cd7cbe5/BUILD/uuid-1.6.2/php -I/usr/include/php -I/usr/include/php/main -I/usr/include/php/TSRM -I/usr/include/php/Zend -I/usr/include/php/ext -I/usr/include/php/ext/date/lib -I/tmp/B.e4d21c47-9f39-40a9-9a48-bb1f7cd7cbe5/BUILD/uuid-1.6.2/php/..  -DHAVE_CONFIG_H  -O2 -fwrapv -pipe -Wformat -Werror=format-security -gdwarf-4 -fno-debug-types-section -fvar-tracking-assignments -g2 -Wp,-D_FORTIFY_SOURCE=2 -fstack-protector --param=ssp-buffer-size=4 -fomit-frame-pointer -march=i486 -fasynchronous-unwind-tables -gdwarf-4 -fno-debug-types-section -fvar-tracking-assignments -g2   -c /tmp/B.e4d21c47-9f39-40a9-9a48-bb1f7cd7cbe5/BUILD/uuid-1.6.2/php/uuid.c -o uuid.lo 
libtool: compile:  i486-pld-linux-gcc -I. -I/tmp/B.e4d21c47-9f39-40a9-9a48-bb1f7cd7cbe5/BUILD/uuid-1.6.2/php -DPHP_ATOM_INC -I/tmp/B.e4d21c47-9f39-40a9-9a48-bb1f7cd7cbe5/BUILD/uuid-1.6.2/php/include -I/tmp/B.e4d21c47-9f39-40a9-9a48-bb1f7cd7cbe5/BUILD/uuid-1.6.2/php/main -I/tmp/B.e4d21c47-9f39-40a9-9a48-bb1f7cd7cbe5/BUILD/uuid-1.6.2/php -I/usr/include/php -I/usr/include/php/main -I/usr/include/php/TSRM -I/usr/include/php/Zend -I/usr/include/php/ext -I/usr/include/php/ext/date/lib -I/tmp/B.e4d21c47-9f39-40a9-9a48-bb1f7cd7cbe5/BUILD/uuid-1.6.2/php/.. -DHAVE_CONFIG_H -O2 -fwrapv -pipe -Wformat -Werror=format-security -gdwarf-4 -fno-debug-types-section -fvar-tracking-assignments -g2 -Wp,-D_FORTIFY_SOURCE=2 -fstack-protector --param=ssp-buffer-size=4 -fomit-frame-pointer -march=i486 -fasynchronous-unwind-tables -gdwarf-4 -fno-debug-types-section -fvar-tracking-assignments -g2 -c /tmp/B.e4d21c47-9f39-40a9-9a48-bb1f7cd7cbe5/BUILD/uuid-1.6.2/php/uuid.c  -fPIC -DPIC -o .libs/uuid.o
libtool: link: (cd ".libs" && rm -f "libossp-uuid++.so.16" && ln -s "libossp-uuid++.so.16.0.22" "libossp-uuid++.so.16")
libtool: link: (cd ".libs" && rm -f "libossp-uuid++.so" && ln -s "libossp-uuid++.so.16.0.22" "libossp-uuid++.so")
libtool: link: i486-pld-linux-gcc -Wl,--as-needed -Wl,--no-copy-dt-needed-entries -Wl,-z -Wl,relro -Wl,-z -Wl,combreloc -o .libs/uuid uuid_cli.o  ./.libs/libossp-uuid.so -lnsl
libtool: link: ar cru .libs/libossp-uuid++.a  uuid++.o uuid.o uuid_md5.o uuid_sha1.o uuid_prng.o uuid_mac.o uuid_time.o uuid_ui64.o uuid_ui128.o uuid_str.o
libtool: link: ranlib .libs/libossp-uuid++.a
libtool: link: ( cd ".libs" && rm -f "libossp-uuid++.la" && ln -s "../libossp-uuid++.la" "libossp-uuid++.la" )
Checking if your kit is complete...
Looks good
Warning: -L../.libs changed to -L/tmp/B.e4d21c47-9f39-40a9-9a48-bb1f7cd7cbe5/BUILD/uuid-1.6.2/perl/../.libs
Warning: -L.. changed to -L/tmp/B.e4d21c47-9f39-40a9-9a48-bb1f7cd7cbe5/BUILD/uuid-1.6.2/perl/..
/tmp/B.e4d21c47-9f39-40a9-9a48-bb1f7cd7cbe5/BUILD/uuid-1.6.2/php/uuid.c:499:1: error: unknown type name 'function_entry'
 static function_entry uuid_functions[] = {
 ^
/tmp/B.e4d21c47-9f39-40a9-9a48-bb1f7cd7cbe5/BUILD/uuid-1.6.2/php/uuid.c:500:5: warning: braces around scalar initializer [enabled by default]
     PHP_FE(uuid_create,  NULL)
     ^
/tmp/B.e4d21c47-9f39-40a9-9a48-bb1f7cd7cbe5/BUILD/uuid-1.6.2/php/uuid.c:500:5: warning: (near initialization for 'uuid_functions[0]') [enabled by default]
/tmp/B.e4d21c47-9f39-40a9-9a48-bb1f7cd7cbe5/BUILD/uuid-1.6.2/php/uuid.c:500:5: warning: initialization makes integer from pointer without a cast [enabled by default]
/tmp/B.e4d21c47-9f39-40a9-9a48-bb1f7cd7cbe5/BUILD/uuid-1.6.2/php/uuid.c:500:5: warning: (near initialization for 'uuid_functions[0]') [enabled by default]
/tmp/B.e4d21c47-9f39-40a9-9a48-bb1f7cd7cbe5/BUILD/uuid-1.6.2/php/uuid.c:500:5: warning: excess elements in scalar initializer [enabled by default]
/tmp/B.e4d21c47-9f39-40a9-9a48-bb1f7cd7cbe5/BUILD/uuid-1.6.2/php/uuid.c:500:5: warning: (near initialization for 'uuid_functions[0]') [enabled by default]
/tmp/B.e4d21c47-9f39-40a9-9a48-bb1f7cd7cbe5/BUILD/uuid-1.6.2/php/uuid.c:500:5: warning: excess elements in scalar initializer [enabled by default]
/tmp/B.e4d21c47-9f39-40a9-9a48-bb1f7cd7cbe5/BUILD/uuid-1.6.2/php/uuid.c:500:5: warning: (near initialization for 'uuid_functions[0]') [enabled by default]
In file included from /usr/include/php/main/php.h:38:0,
                 from /tmp/B.e4d21c47-9f39-40a9-9a48-bb1f7cd7cbe5/BUILD/uuid-1.6.2/php/uuid.c:35:
/usr/include/php/Zend/zend_API.h:71:129: warning: excess elements in scalar initializer [enabled by default]
 #define ZEND_FENTRY(zend_name, name, arg_info, flags) { #zend_name, name, arg_info, (zend_uint) (sizeof(arg_info)/sizeof(struct _zend_arg_info)-1), flags },
                                                                                                                                 ^
/usr/include/php/Zend/zend_API.h:77:38: note: in expansion of macro 'ZEND_FENTRY'
 #define ZEND_FE(name, arg_info)      ZEND_FENTRY(name, ZEND_FN(name), arg_info, 0)
                                      ^
/usr/include/php/main/php.h:349:18: note: in expansion of macro 'ZEND_FE'
 #define PHP_FE   ZEND_FE
                  ^
/tmp/B.e4d21c47-9f39-40a9-9a48-bb1f7cd7cbe5/BUILD/uuid-1.6.2/php/uuid.c:500:5: note: in expansion of macro 'PHP_FE'
     PHP_FE(uuid_create,  NULL)
     ^
/usr/include/php/Zend/zend_API.h:71:129: warning: (near initialization for 'uuid_functions[0]') [enabled by default]
 #define ZEND_FENTRY(zend_name, name, arg_info, flags) { #zend_name, name, arg_info, (zend_uint) (sizeof(arg_info)/sizeof(struct _zend_arg_info)-1), flags },
                                                                                                                                 ^
/usr/include/php/Zend/zend_API.h:77:38: note: in expansion of macro 'ZEND_FENTRY'
 #define ZEND_FE(name, arg_info)      ZEND_FENTRY(name, ZEND_FN(name), arg_info, 0)
                                      ^
/usr/include/php/main/php.h:349:18: note: in expansion of macro 'ZEND_FE'
 #define PHP_FE   ZEND_FE
                  ^
/tmp/B.e4d21c47-9f39-40a9-9a48-bb1f7cd7cbe5/BUILD/uuid-1.6.2/php/uuid.c:500:5: note: in expansion of macro 'PHP_FE'
     PHP_FE(uuid_create,  NULL)
     ^
/usr/include/php/Zend/zend_API.h:71:129: warning: excess elements in scalar initializer [enabled by default]
 #define ZEND_FENTRY(zend_name, name, arg_info, flags) { #zend_name, name, arg_info, (zend_uint) (sizeof(arg_info)/sizeof(struct _zend_arg_info)-1), flags },
                                                                                                                                 ^
/usr/include/php/Zend/zend_API.h:77:38: note: in expansion of macro 'ZEND_FENTRY'
 #define ZEND_FE(name, arg_info)      ZEND_FENTRY(name, ZEND_FN(name), arg_info, 0)
                                      ^
/usr/include/php/main/php.h:349:18: note: in expansion of macro 'ZEND_FE'
 #define PHP_FE   ZEND_FE
                  ^
/tmp/B.e4d21c47-9f39-40a9-9a48-bb1f7cd7cbe5/BUILD/uuid-1.6.2/php/uuid.c:500:5: note: in expansion of macro 'PHP_FE'
     PHP_FE(uuid_create,  NULL)
     ^
/usr/include/php/Zend/zend_API.h:71:129: warning: (near initialization for 'uuid_functions[0]') [enabled by default]
 #define ZEND_FENTRY(zend_name, name, arg_info, flags) { #zend_name, name, arg_info, (zend_uint) (sizeof(arg_info)/sizeof(struct _zend_arg_info)-1), flags },
                                                                                                                                 ^
/usr/include/php/Zend/zend_API.h:77:38: note: in expansion of macro 'ZEND_FENTRY'
 #define ZEND_FE(name, arg_info)      ZEND_FENTRY(name, ZEND_FN(name), arg_info, 0)
                                      ^
/usr/include/php/main/php.h:349:18: note: in expansion of macro 'ZEND_FE'
 #define PHP_FE   ZEND_FE
                  ^
/tmp/B.e4d21c47-9f39-40a9-9a48-bb1f7cd7cbe5/BUILD/uuid-1.6.2/php/uuid.c:500:5: note: in expansion of macro 'PHP_FE'
     PHP_FE(uuid_create,  NULL)
     ^
/tmp/B.e4d21c47-9f39-40a9-9a48-bb1f7cd7cbe5/BUILD/uuid-1.6.2/php/uuid.c:501:5: warning: braces around scalar initializer [enabled by default]
     PHP_FE(uuid_destroy, NULL)
     ^
/tmp/B.e4d21c47-9f39-40a9-9a48-bb1f7cd7cbe5/BUILD/uuid-1.6.2/php/uuid.c:501:5: warning: (near initialization for 'uuid_functions[1]') [enabled by default]
/tmp/B.e4d21c47-9f39-40a9-9a48-bb1f7cd7cbe5/BUILD/uuid-1.6.2/php/uuid.c:501:5: warning: initialization makes integer from pointer without a cast [enabled by default]
/tmp/B.e4d21c47-9f39-40a9-9a48-bb1f7cd7cbe5/BUILD/uuid-1.6.2/php/uuid.c:501:5: warning: (near initialization for 'uuid_functions[1]') [enabled by default]
/tmp/B.e4d21c47-9f39-40a9-9a48-bb1f7cd7cbe5/BUILD/uuid-1.6.2/php/uuid.c:501:5: warning: excess elements in scalar initializer [enabled by default]
/tmp/B.e4d21c47-9f39-40a9-9a48-bb1f7cd7cbe5/BUILD/uuid-1.6.2/php/uuid.c:501:5: warning: (near initialization for 'uuid_functions[1]') [enabled by default]
/tmp/B.e4d21c47-9f39-40a9-9a48-bb1f7cd7cbe5/BUILD/uuid-1.6.2/php/uuid.c:501:5: warning: excess elements in scalar initializer [enabled by default]
/tmp/B.e4d21c47-9f39-40a9-9a48-bb1f7cd7cbe5/BUILD/uuid-1.6.2/php/uuid.c:501:5: warning: (near initialization for 'uuid_functions[1]') [enabled by default]
In file included from /usr/include/php/main/php.h:38:0,
                 from /tmp/B.e4d21c47-9f39-40a9-9a48-bb1f7cd7cbe5/BUILD/uuid-1.6.2/php/uuid.c:35:
/usr/include/php/Zend/zend_API.h:71:129: warning: excess elements in scalar initializer [enabled by default]
 #define ZEND_FENTRY(zend_name, name, arg_info, flags) { #zend_name, name, arg_info, (zend_uint) (sizeof(arg_info)/sizeof(struct _zend_arg_info)-1), flags },
                                                                                                                                 ^
/usr/include/php/Zend/zend_API.h:77:38: note: in expansion of macro 'ZEND_FENTRY'
 #define ZEND_FE(name, arg_info)      ZEND_FENTRY(name, ZEND_FN(name), arg_info, 0)
                                      ^
/usr/include/php/main/php.h:349:18: note: in expansion of macro 'ZEND_FE'
 #define PHP_FE   ZEND_FE
                  ^
/tmp/B.e4d21c47-9f39-40a9-9a48-bb1f7cd7cbe5/BUILD/uuid-1.6.2/php/uuid.c:501:5: note: in expansion of macro 'PHP_FE'
     PHP_FE(uuid_destroy, NULL)
     ^
/usr/include/php/Zend/zend_API.h:71:129: warning: (near initialization for 'uuid_functions[1]') [enabled by default]
 #define ZEND_FENTRY(zend_name, name, arg_info, flags) { #zend_name, name, arg_info, (zend_uint) (sizeof(arg_info)/sizeof(struct _zend_arg_info)-1), flags },
                                                                                                                                 ^
/usr/include/php/Zend/zend_API.h:77:38: note: in expansion of macro 'ZEND_FENTRY'
 #define ZEND_FE(name, arg_info)      ZEND_FENTRY(name, ZEND_FN(name), arg_info, 0)
                                      ^
/usr/include/php/main/php.h:349:18: note: in expansion of macro 'ZEND_FE'
 #define PHP_FE   ZEND_FE
                  ^
/tmp/B.e4d21c47-9f39-40a9-9a48-bb1f7cd7cbe5/BUILD/uuid-1.6.2/php/uuid.c:501:5: note: in expansion of macro 'PHP_FE'
     PHP_FE(uuid_destroy, NULL)
     ^
/usr/include/php/Zend/zend_API.h:71:129: warning: excess elements in scalar initializer [enabled by default]
 #define ZEND_FENTRY(zend_name, name, arg_info, flags) { #zend_name, name, arg_info, (zend_uint) (sizeof(arg_info)/sizeof(struct _zend_arg_info)-1), flags },
                                                                                                                                 ^
/usr/include/php/Zend/zend_API.h:77:38: note: in expansion of macro 'ZEND_FENTRY'
 #define ZEND_FE(name, arg_info)      ZEND_FENTRY(name, ZEND_FN(name), arg_info, 0)
                                      ^
/usr/include/php/main/php.h:349:18: note: in expansion of macro 'ZEND_FE'
 #define PHP_FE   ZEND_FE
                  ^
/tmp/B.e4d21c47-9f39-40a9-9a48-bb1f7cd7cbe5/BUILD/uuid-1.6.2/php/uuid.c:501:5: note: in expansion of macro 'PHP_FE'
     PHP_FE(uuid_destroy, NULL)
     ^
/usr/include/php/Zend/zend_API.h:71:129: warning: (near initialization for 'uuid_functions[1]') [enabled by default]
 #define ZEND_FENTRY(zend_name, name, arg_info, flags) { #zend_name, name, arg_info, (zend_uint) (sizeof(arg_info)/sizeof(struct _zend_arg_info)-1), flags },
                                                                                                                                 ^
/usr/include/php/Zend/zend_API.h:77:38: note: in expansion of macro 'ZEND_FENTRY'
 #define ZEND_FE(name, arg_info)      ZEND_FENTRY(name, ZEND_FN(name), arg_info, 0)
                                      ^
/usr/include/php/main/php.h:349:18: note: in expansion of macro 'ZEND_FE'
 #define PHP_FE   ZEND_FE
                  ^
/tmp/B.e4d21c47-9f39-40a9-9a48-bb1f7cd7cbe5/BUILD/uuid-1.6.2/php/uuid.c:501:5: note: in expansion of macro 'PHP_FE'
     PHP_FE(uuid_destroy, NULL)
     ^
/tmp/B.e4d21c47-9f39-40a9-9a48-bb1f7cd7cbe5/BUILD/uuid-1.6.2/php/uuid.c:502:5: warning: braces around scalar initializer [enabled by default]
     PHP_FE(uuid_clone,   NULL)
     ^
/tmp/B.e4d21c47-9f39-40a9-9a48-bb1f7cd7cbe5/BUILD/uuid-1.6.2/php/uuid.c:502:5: warning: (near initialization for 'uuid_functions[2]') [enabled by default]
/tmp/B.e4d21c47-9f39-40a9-9a48-bb1f7cd7cbe5/BUILD/uuid-1.6.2/php/uuid.c:502:5: warning: initialization makes integer from pointer without a cast [enabled by default]
/tmp/B.e4d21c47-9f39-40a9-9a48-bb1f7cd7cbe5/BUILD/uuid-1.6.2/php/uuid.c:502:5: warning: (near initialization for 'uuid_functions[2]') [enabled by default]
/tmp/B.e4d21c47-9f39-40a9-9a48-bb1f7cd7cbe5/BUILD/uuid-1.6.2/php/uuid.c:502:5: warning: excess elements in scalar initializer [enabled by default]
/tmp/B.e4d21c47-9f39-40a9-9a48-bb1f7cd7cbe5/BUILD/uuid-1.6.2/php/uuid.c:502:5: warning: (near initialization for 'uuid_functions[2]') [enabled by default]
/tmp/B.e4d21c47-9f39-40a9-9a48-bb1f7cd7cbe5/BUILD/uuid-1.6.2/php/uuid.c:502:5: warning: excess elements in scalar initializer [enabled by default]
/tmp/B.e4d21c47-9f39-40a9-9a48-bb1f7cd7cbe5/BUILD/uuid-1.6.2/php/uuid.c:502:5: warning: (near initialization for 'uuid_functions[2]') [enabled by default]
In file included from /usr/include/php/main/php.h:38:0,
                 from /tmp/B.e4d21c47-9f39-40a9-9a48-bb1f7cd7cbe5/BUILD/uuid-1.6.2/php/uuid.c:35:
/usr/include/php/Zend/zend_API.h:71:129: warning: excess elements in scalar initializer [enabled by default]
 #define ZEND_FENTRY(zend_name, name, arg_info, flags) { #zend_name, name, arg_info, (zend_uint) (sizeof(arg_info)/sizeof(struct _zend_arg_info)-1), flags },
                                                                                                                                 ^
/usr/include/php/Zend/zend_API.h:77:38: note: in expansion of macro 'ZEND_FENTRY'
 #define ZEND_FE(name, arg_info)      ZEND_FENTRY(name, ZEND_FN(name), arg_info, 0)
                                      ^
/usr/include/php/main/php.h:349:18: note: in expansion of macro 'ZEND_FE'
 #define PHP_FE   ZEND_FE
                  ^
/tmp/B.e4d21c47-9f39-40a9-9a48-bb1f7cd7cbe5/BUILD/uuid-1.6.2/php/uuid.c:502:5: note: in expansion of macro 'PHP_FE'
     PHP_FE(uuid_clone,   NULL)
     ^
/usr/include/php/Zend/zend_API.h:71:129: warning: (near initialization for 'uuid_functions[2]') [enabled by default]
 #define ZEND_FENTRY(zend_name, name, arg_info, flags) { #zend_name, name, arg_info, (zend_uint) (sizeof(arg_info)/sizeof(struct _zend_arg_info)-1), flags },
                                                                                                                                 ^
/usr/include/php/Zend/zend_API.h:77:38: note: in expansion of macro 'ZEND_FENTRY'
 #define ZEND_FE(name, arg_info)      ZEND_FENTRY(name, ZEND_FN(name), arg_info, 0)
                                      ^
/usr/include/php/main/php.h:349:18: note: in expansion of macro 'ZEND_FE'
 #define PHP_FE   ZEND_FE
                  ^
/tmp/B.e4d21c47-9f39-40a9-9a48-bb1f7cd7cbe5/BUILD/uuid-1.6.2/php/uuid.c:502:5: note: in expansion of macro 'PHP_FE'
     PHP_FE(uuid_clone,   NULL)
     ^
/usr/include/php/Zend/zend_API.h:71:129: warning: excess elements in scalar initializer [enabled by default]
 #define ZEND_FENTRY(zend_name, name, arg_info, flags) { #zend_name, name, arg_info, (zend_uint) (sizeof(arg_info)/sizeof(struct _zend_arg_info)-1), flags },
                                                                                                                                 ^
/usr/include/php/Zend/zend_API.h:77:38: note: in expansion of macro 'ZEND_FENTRY'
 #define ZEND_FE(name, arg_info)      ZEND_FENTRY(name, ZEND_FN(name), arg_info, 0)
                                      ^
/usr/include/php/main/php.h:349:18: note: in expansion of macro 'ZEND_FE'
 #define PHP_FE   ZEND_FE
                  ^
/tmp/B.e4d21c47-9f39-40a9-9a48-bb1f7cd7cbe5/BUILD/uuid-1.6.2/php/uuid.c:502:5: note: in expansion of macro 'PHP_FE'
     PHP_FE(uuid_clone,   NULL)
     ^
/usr/include/php/Zend/zend_API.h:71:129: warning: (near initialization for 'uuid_functions[2]') [enabled by default]
 #define ZEND_FENTRY(zend_name, name, arg_info, flags) { #zend_name, name, arg_info, (zend_uint) (sizeof(arg_info)/sizeof(struct _zend_arg_info)-1), flags },
                                                                                                                                 ^
/usr/include/php/Zend/zend_API.h:77:38: note: in expansion of macro 'ZEND_FENTRY'
 #define ZEND_FE(name, arg_info)      ZEND_FENTRY(name, ZEND_FN(name), arg_info, 0)
                                      ^
/usr/include/php/main/php.h:349:18: note: in expansion of macro 'ZEND_FE'
 #define PHP_FE   ZEND_FE
                  ^
/tmp/B.e4d21c47-9f39-40a9-9a48-bb1f7cd7cbe5/BUILD/uuid-1.6.2/php/uuid.c:502:5: note: in expansion of macro 'PHP_FE'
     PHP_FE(uuid_clone,   NULL)
     ^
/tmp/B.e4d21c47-9f39-40a9-9a48-bb1f7cd7cbe5/BUILD/uuid-1.6.2/php/uuid.c:503:5: warning: braces around scalar initializer [enabled by default]
     PHP_FE(uuid_load,    NULL)
     ^
/tmp/B.e4d21c47-9f39-40a9-9a48-bb1f7cd7cbe5/BUILD/uuid-1.6.2/php/uuid.c:503:5: warning: (near initialization for 'uuid_functions[3]') [enabled by default]
/tmp/B.e4d21c47-9f39-40a9-9a48-bb1f7cd7cbe5/BUILD/uuid-1.6.2/php/uuid.c:503:5: warning: initialization makes integer from pointer without a cast [enabled by default]
/tmp/B.e4d21c47-9f39-40a9-9a48-bb1f7cd7cbe5/BUILD/uuid-1.6.2/php/uuid.c:503:5: warning: (near initialization for 'uuid_functions[3]') [enabled by default]
/tmp/B.e4d21c47-9f39-40a9-9a48-bb1f7cd7cbe5/BUILD/uuid-1.6.2/php/uuid.c:503:5: warning: excess elements in scalar initializer [enabled by default]
/tmp/B.e4d21c47-9f39-40a9-9a48-bb1f7cd7cbe5/BUILD/uuid-1.6.2/php/uuid.c:503:5: warning: (near initialization for 'uuid_functions[3]') [enabled by default]
/tmp/B.e4d21c47-9f39-40a9-9a48-bb1f7cd7cbe5/BUILD/uuid-1.6.2/php/uuid.c:503:5: warning: excess elements in scalar initializer [enabled by default]
/tmp/B.e4d21c47-9f39-40a9-9a48-bb1f7cd7cbe5/BUILD/uuid-1.6.2/php/uuid.c:503:5: warning: (near initialization for 'uuid_functions[3]') [enabled by default]
In file included from /usr/include/php/main/php.h:38:0,
                 from /tmp/B.e4d21c47-9f39-40a9-9a48-bb1f7cd7cbe5/BUILD/uuid-1.6.2/php/uuid.c:35:
/usr/include/php/Zend/zend_API.h:71:129: warning: excess elements in scalar initializer [enabled by default]
 #define ZEND_FENTRY(zend_name, name, arg_info, flags) { #zend_name, name, arg_info, (zend_uint) (sizeof(arg_info)/sizeof(struct _zend_arg_info)-1), flags },
                                                                                                                                 ^
/usr/include/php/Zend/zend_API.h:77:38: note: in expansion of macro 'ZEND_FENTRY'
 #define ZEND_FE(name, arg_info)      ZEND_FENTRY(name, ZEND_FN(name), arg_info, 0)
                                      ^
/usr/include/php/main/php.h:349:18: note: in expansion of macro 'ZEND_FE'
 #define PHP_FE   ZEND_FE
                  ^
/tmp/B.e4d21c47-9f39-40a9-9a48-bb1f7cd7cbe5/BUILD/uuid-1.6.2/php/uuid.c:503:5: note: in expansion of macro 'PHP_FE'
     PHP_FE(uuid_load,    NULL)
     ^
/usr/include/php/Zend/zend_API.h:71:129: warning: (near initialization for 'uuid_functions[3]') [enabled by default]
 #define ZEND_FENTRY(zend_name, name, arg_info, flags) { #zend_name, name, arg_info, (zend_uint) (sizeof(arg_info)/sizeof(struct _zend_arg_info)-1), flags },
                                                                                                                                 ^
/usr/include/php/Zend/zend_API.h:77:38: note: in expansion of macro 'ZEND_FENTRY'
 #define ZEND_FE(name, arg_info)      ZEND_FENTRY(name, ZEND_FN(name), arg_info, 0)
                                      ^
/usr/include/php/main/php.h:349:18: note: in expansion of macro 'ZEND_FE'
 #define PHP_FE   ZEND_FE
                  ^
/tmp/B.e4d21c47-9f39-40a9-9a48-bb1f7cd7cbe5/BUILD/uuid-1.6.2/php/uuid.c:503:5: note: in expansion of macro 'PHP_FE'
     PHP_FE(uuid_load,    NULL)
     ^
/usr/include/php/Zend/zend_API.h:71:129: warning: excess elements in scalar initializer [enabled by default]
 #define ZEND_FENTRY(zend_name, name, arg_info, flags) { #zend_name, name, arg_info, (zend_uint) (sizeof(arg_info)/sizeof(struct _zend_arg_info)-1), flags },
                                                                                                                                 ^
/usr/include/php/Zend/zend_API.h:77:38: note: in expansion of macro 'ZEND_FENTRY'
 #define ZEND_FE(name, arg_info)      ZEND_FENTRY(name, ZEND_FN(name), arg_info, 0)
                                      ^
/usr/include/php/main/php.h:349:18: note: in expansion of macro 'ZEND_FE'
 #define PHP_FE   ZEND_FE
                  ^
/tmp/B.e4d21c47-9f39-40a9-9a48-bb1f7cd7cbe5/BUILD/uuid-1.6.2/php/uuid.c:503:5: note: in expansion of macro 'PHP_FE'
     PHP_FE(uuid_load,    NULL)
     ^
/usr/include/php/Zend/zend_API.h:71:129: warning: (near initialization for 'uuid_functions[3]') [enabled by default]
 #define ZEND_FENTRY(zend_name, name, arg_info, flags) { #zend_name, name, arg_info, (zend_uint) (sizeof(arg_info)/sizeof(struct _zend_arg_info)-1), flags },
                                                                                                                                 ^
/usr/include/php/Zend/zend_API.h:77:38: note: in expansion of macro 'ZEND_FENTRY'
 #define ZEND_FE(name, arg_info)      ZEND_FENTRY(name, ZEND_FN(name), arg_info, 0)
                                      ^
/usr/include/php/main/php.h:349:18: note: in expansion of macro 'ZEND_FE'
 #define PHP_FE   ZEND_FE
                  ^
/tmp/B.e4d21c47-9f39-40a9-9a48-bb1f7cd7cbe5/BUILD/uuid-1.6.2/php/uuid.c:503:5: note: in expansion of macro 'PHP_FE'
     PHP_FE(uuid_load,    NULL)
     ^
/tmp/B.e4d21c47-9f39-40a9-9a48-bb1f7cd7cbe5/BUILD/uuid-1.6.2/php/uuid.c:504:5: warning: braces around scalar initializer [enabled by default]
     PHP_FE(uuid_make,    NULL)
     ^
/tmp/B.e4d21c47-9f39-40a9-9a48-bb1f7cd7cbe5/BUILD/uuid-1.6.2/php/uuid.c:504:5: warning: (near initialization for 'uuid_functions[4]') [enabled by default]
/tmp/B.e4d21c47-9f39-40a9-9a48-bb1f7cd7cbe5/BUILD/uuid-1.6.2/php/uuid.c:504:5: warning: initialization makes integer from pointer without a cast [enabled by default]
/tmp/B.e4d21c47-9f39-40a9-9a48-bb1f7cd7cbe5/BUILD/uuid-1.6.2/php/uuid.c:504:5: warning: (near initialization for 'uuid_functions[4]') [enabled by default]
/tmp/B.e4d21c47-9f39-40a9-9a48-bb1f7cd7cbe5/BUILD/uuid-1.6.2/php/uuid.c:504:5: warning: excess elements in scalar initializer [enabled by default]
/tmp/B.e4d21c47-9f39-40a9-9a48-bb1f7cd7cbe5/BUILD/uuid-1.6.2/php/uuid.c:504:5: warning: (near initialization for 'uuid_functions[4]') [enabled by default]
/tmp/B.e4d21c47-9f39-40a9-9a48-bb1f7cd7cbe5/BUILD/uuid-1.6.2/php/uuid.c:504:5: warning: excess elements in scalar initializer [enabled by default]
/tmp/B.e4d21c47-9f39-40a9-9a48-bb1f7cd7cbe5/BUILD/uuid-1.6.2/php/uuid.c:504:5: warning: (near initialization for 'uuid_functions[4]') [enabled by default]
In file included from /usr/include/php/main/php.h:38:0,
                 from /tmp/B.e4d21c47-9f39-40a9-9a48-bb1f7cd7cbe5/BUILD/uuid-1.6.2/php/uuid.c:35:
/usr/include/php/Zend/zend_API.h:71:129: warning: excess elements in scalar initializer [enabled by default]
 #define ZEND_FENTRY(zend_name, name, arg_info, flags) { #zend_name, name, arg_info, (zend_uint) (sizeof(arg_info)/sizeof(struct _zend_arg_info)-1), flags },
                                                                                                                                 ^
/usr/include/php/Zend/zend_API.h:77:38: note: in expansion of macro 'ZEND_FENTRY'
 #define ZEND_FE(name, arg_info)      ZEND_FENTRY(name, ZEND_FN(name), arg_info, 0)
                                      ^
/usr/include/php/main/php.h:349:18: note: in expansion of macro 'ZEND_FE'
 #define PHP_FE   ZEND_FE
                  ^
/tmp/B.e4d21c47-9f39-40a9-9a48-bb1f7cd7cbe5/BUILD/uuid-1.6.2/php/uuid.c:504:5: note: in expansion of macro 'PHP_FE'
     PHP_FE(uuid_make,    NULL)
     ^
/usr/include/php/Zend/zend_API.h:71:129: warning: (near initialization for 'uuid_functions[4]') [enabled by default]
 #define ZEND_FENTRY(zend_name, name, arg_info, flags) { #zend_name, name, arg_info, (zend_uint) (sizeof(arg_info)/sizeof(struct _zend_arg_info)-1), flags },
                                                                                                                                 ^
/usr/include/php/Zend/zend_API.h:77:38: note: in expansion of macro 'ZEND_FENTRY'
 #define ZEND_FE(name, arg_info)      ZEND_FENTRY(name, ZEND_FN(name), arg_info, 0)
                                      ^
/usr/include/php/main/php.h:349:18: note: in expansion of macro 'ZEND_FE'
 #define PHP_FE   ZEND_FE
                  ^
/tmp/B.e4d21c47-9f39-40a9-9a48-bb1f7cd7cbe5/BUILD/uuid-1.6.2/php/uuid.c:504:5: note: in expansion of macro 'PHP_FE'
     PHP_FE(uuid_make,    NULL)
     ^
/usr/include/php/Zend/zend_API.h:71:129: warning: excess elements in scalar initializer [enabled by default]
 #define ZEND_FENTRY(zend_name, name, arg_info, flags) { #zend_name, name, arg_info, (zend_uint) (sizeof(arg_info)/sizeof(struct _zend_arg_info)-1), flags },
                                                                                                                                 ^
/usr/include/php/Zend/zend_API.h:77:38: note: in expansion of macro 'ZEND_FENTRY'
 #define ZEND_FE(name, arg_info)      ZEND_FENTRY(name, ZEND_FN(name), arg_info, 0)
                                      ^
/usr/include/php/main/php.h:349:18: note: in expansion of macro 'ZEND_FE'
 #define PHP_FE   ZEND_FE
                  ^
/tmp/B.e4d21c47-9f39-40a9-9a48-bb1f7cd7cbe5/BUILD/uuid-1.6.2/php/uuid.c:504:5: note: in expansion of macro 'PHP_FE'
     PHP_FE(uuid_make,    NULL)
     ^
/usr/include/php/Zend/zend_API.h:71:129: warning: (near initialization for 'uuid_functions[4]') [enabled by default]
 #define ZEND_FENTRY(zend_name, name, arg_info, flags) { #zend_name, name, arg_info, (zend_uint) (sizeof(arg_info)/sizeof(struct _zend_arg_info)-1), flags },
                                                                                                                                 ^
/usr/include/php/Zend/zend_API.h:77:38: note: in expansion of macro 'ZEND_FENTRY'
 #define ZEND_FE(name, arg_info)      ZEND_FENTRY(name, ZEND_FN(name), arg_info, 0)
                                      ^
/usr/include/php/main/php.h:349:18: note: in expansion of macro 'ZEND_FE'
 #define PHP_FE   ZEND_FE
                  ^
/tmp/B.e4d21c47-9f39-40a9-9a48-bb1f7cd7cbe5/BUILD/uuid-1.6.2/php/uuid.c:504:5: note: in expansion of macro 'PHP_FE'
     PHP_FE(uuid_make,    NULL)
     ^
/tmp/B.e4d21c47-9f39-40a9-9a48-bb1f7cd7cbe5/BUILD/uuid-1.6.2/php/uuid.c:505:5: warning: braces around scalar initializer [enabled by default]
     PHP_FE(uuid_isnil,   NULL)
     ^
/tmp/B.e4d21c47-9f39-40a9-9a48-bb1f7cd7cbe5/BUILD/uuid-1.6.2/php/uuid.c:505:5: warning: (near initialization for 'uuid_functions[5]') [enabled by default]
/tmp/B.e4d21c47-9f39-40a9-9a48-bb1f7cd7cbe5/BUILD/uuid-1.6.2/php/uuid.c:505:5: warning: initialization makes integer from pointer without a cast [enabled by default]
/tmp/B.e4d21c47-9f39-40a9-9a48-bb1f7cd7cbe5/BUILD/uuid-1.6.2/php/uuid.c:505:5: warning: (near initialization for 'uuid_functions[5]') [enabled by default]
/tmp/B.e4d21c47-9f39-40a9-9a48-bb1f7cd7cbe5/BUILD/uuid-1.6.2/php/uuid.c:505:5: warning: excess elements in scalar initializer [enabled by default]
/tmp/B.e4d21c47-9f39-40a9-9a48-bb1f7cd7cbe5/BUILD/uuid-1.6.2/php/uuid.c:505:5: warning: (near initialization for 'uuid_functions[5]') [enabled by default]
/tmp/B.e4d21c47-9f39-40a9-9a48-bb1f7cd7cbe5/BUILD/uuid-1.6.2/php/uuid.c:505:5: warning: excess elements in scalar initializer [enabled by default]
/tmp/B.e4d21c47-9f39-40a9-9a48-bb1f7cd7cbe5/BUILD/uuid-1.6.2/php/uuid.c:505:5: warning: (near initialization for 'uuid_functions[5]') [enabled by default]
In file included from /usr/include/php/main/php.h:38:0,
                 from /tmp/B.e4d21c47-9f39-40a9-9a48-bb1f7cd7cbe5/BUILD/uuid-1.6.2/php/uuid.c:35:
/usr/include/php/Zend/zend_API.h:71:129: warning: excess elements in scalar initializer [enabled by default]
 #define ZEND_FENTRY(zend_name, name, arg_info, flags) { #zend_name, name, arg_info, (zend_uint) (sizeof(arg_info)/sizeof(struct _zend_arg_info)-1), flags },
                                                                                                                                 ^
/usr/include/php/Zend/zend_API.h:77:38: note: in expansion of macro 'ZEND_FENTRY'
 #define ZEND_FE(name, arg_info)      ZEND_FENTRY(name, ZEND_FN(name), arg_info, 0)
                                      ^
/usr/include/php/main/php.h:349:18: note: in expansion of macro 'ZEND_FE'
 #define PHP_FE   ZEND_FE
                  ^
/tmp/B.e4d21c47-9f39-40a9-9a48-bb1f7cd7cbe5/BUILD/uuid-1.6.2/php/uuid.c:505:5: note: in expansion of macro 'PHP_FE'
     PHP_FE(uuid_isnil,   NULL)
     ^
/usr/include/php/Zend/zend_API.h:71:129: warning: (near initialization for 'uuid_functions[5]') [enabled by default]
 #define ZEND_FENTRY(zend_name, name, arg_info, flags) { #zend_name, name, arg_info, (zend_uint) (sizeof(arg_info)/sizeof(struct _zend_arg_info)-1), flags },
                                                                                                                                 ^
/usr/include/php/Zend/zend_API.h:77:38: note: in expansion of macro 'ZEND_FENTRY'
 #define ZEND_FE(name, arg_info)      ZEND_FENTRY(name, ZEND_FN(name), arg_info, 0)
                                      ^
/usr/include/php/main/php.h:349:18: note: in expansion of macro 'ZEND_FE'
 #define PHP_FE   ZEND_FE
                  ^
/tmp/B.e4d21c47-9f39-40a9-9a48-bb1f7cd7cbe5/BUILD/uuid-1.6.2/php/uuid.c:505:5: note: in expansion of macro 'PHP_FE'
     PHP_FE(uuid_isnil,   NULL)
     ^
/usr/include/php/Zend/zend_API.h:71:129: warning: excess elements in scalar initializer [enabled by default]
 #define ZEND_FENTRY(zend_name, name, arg_info, flags) { #zend_name, name, arg_info, (zend_uint) (sizeof(arg_info)/sizeof(struct _zend_arg_info)-1), flags },
                                                                                                                                 ^
/usr/include/php/Zend/zend_API.h:77:38: note: in expansion of macro 'ZEND_FENTRY'
 #define ZEND_FE(name, arg_info)      ZEND_FENTRY(name, ZEND_FN(name), arg_info, 0)
                                      ^
/usr/include/php/main/php.h:349:18: note: in expansion of macro 'ZEND_FE'
 #define PHP_FE   ZEND_FE
                  ^
/tmp/B.e4d21c47-9f39-40a9-9a48-bb1f7cd7cbe5/BUILD/uuid-1.6.2/php/uuid.c:505:5: note: in expansion of macro 'PHP_FE'
     PHP_FE(uuid_isnil,   NULL)
     ^
/usr/include/php/Zend/zend_API.h:71:129: warning: (near initialization for 'uuid_functions[5]') [enabled by default]
 #define ZEND_FENTRY(zend_name, name, arg_info, flags) { #zend_name, name, arg_info, (zend_uint) (sizeof(arg_info)/sizeof(struct _zend_arg_info)-1), flags },
                                                                                                                                 ^
/usr/include/php/Zend/zend_API.h:77:38: note: in expansion of macro 'ZEND_FENTRY'
 #define ZEND_FE(name, arg_info)      ZEND_FENTRY(name, ZEND_FN(name), arg_info, 0)
                                      ^
/usr/include/php/main/php.h:349:18: note: in expansion of macro 'ZEND_FE'
 #define PHP_FE   ZEND_FE
                  ^
/tmp/B.e4d21c47-9f39-40a9-9a48-bb1f7cd7cbe5/BUILD/uuid-1.6.2/php/uuid.c:505:5: note: in expansion of macro 'PHP_FE'
     PHP_FE(uuid_isnil,   NULL)
     ^
/tmp/B.e4d21c47-9f39-40a9-9a48-bb1f7cd7cbe5/BUILD/uuid-1.6.2/php/uuid.c:506:5: warning: braces around scalar initializer [enabled by default]
     PHP_FE(uuid_compare, NULL)
     ^
/tmp/B.e4d21c47-9f39-40a9-9a48-bb1f7cd7cbe5/BUILD/uuid-1.6.2/php/uuid.c:506:5: warning: (near initialization for 'uuid_functions[6]') [enabled by default]
/tmp/B.e4d21c47-9f39-40a9-9a48-bb1f7cd7cbe5/BUILD/uuid-1.6.2/php/uuid.c:506:5: warning: initialization makes integer from pointer without a cast [enabled by default]
/tmp/B.e4d21c47-9f39-40a9-9a48-bb1f7cd7cbe5/BUILD/uuid-1.6.2/php/uuid.c:506:5: warning: (near initialization for 'uuid_functions[6]') [enabled by default]
/tmp/B.e4d21c47-9f39-40a9-9a48-bb1f7cd7cbe5/BUILD/uuid-1.6.2/php/uuid.c:506:5: warning: excess elements in scalar initializer [enabled by default]
/tmp/B.e4d21c47-9f39-40a9-9a48-bb1f7cd7cbe5/BUILD/uuid-1.6.2/php/uuid.c:506:5: warning: (near initialization for 'uuid_functions[6]') [enabled by default]
/tmp/B.e4d21c47-9f39-40a9-9a48-bb1f7cd7cbe5/BUILD/uuid-1.6.2/php/uuid.c:506:5: warning: excess elements in scalar initializer [enabled by default]
/tmp/B.e4d21c47-9f39-40a9-9a48-bb1f7cd7cbe5/BUILD/uuid-1.6.2/php/uuid.c:506:5: warning: (near initialization for 'uuid_functions[6]') [enabled by default]
In file included from /usr/include/php/main/php.h:38:0,
                 from /tmp/B.e4d21c47-9f39-40a9-9a48-bb1f7cd7cbe5/BUILD/uuid-1.6.2/php/uuid.c:35:
/usr/include/php/Zend/zend_API.h:71:129: warning: excess elements in scalar initializer [enabled by default]
 #define ZEND_FENTRY(zend_name, name, arg_info, flags) { #zend_name, name, arg_info, (zend_uint) (sizeof(arg_info)/sizeof(struct _zend_arg_info)-1), flags },
                                                                                                                                 ^
/usr/include/php/Zend/zend_API.h:77:38: note: in expansion of macro 'ZEND_FENTRY'
 #define ZEND_FE(name, arg_info)      ZEND_FENTRY(name, ZEND_FN(name), arg_info, 0)
                                      ^
/usr/include/php/main/php.h:349:18: note: in expansion of macro 'ZEND_FE'
 #define PHP_FE   ZEND_FE
                  ^
/tmp/B.e4d21c47-9f39-40a9-9a48-bb1f7cd7cbe5/BUILD/uuid-1.6.2/php/uuid.c:506:5: note: in expansion of macro 'PHP_FE'
     PHP_FE(uuid_compare, NULL)
     ^
/usr/include/php/Zend/zend_API.h:71:129: warning: (near initialization for 'uuid_functions[6]') [enabled by default]
 #define ZEND_FENTRY(zend_name, name, arg_info, flags) { #zend_name, name, arg_info, (zend_uint) (sizeof(arg_info)/sizeof(struct _zend_arg_info)-1), flags },
                                                                                                                                 ^
/usr/include/php/Zend/zend_API.h:77:38: note: in expansion of macro 'ZEND_FENTRY'
 #define ZEND_FE(name, arg_info)      ZEND_FENTRY(name, ZEND_FN(name), arg_info, 0)
                                      ^
/usr/include/php/main/php.h:349:18: note: in expansion of macro 'ZEND_FE'
 #define PHP_FE   ZEND_FE
                  ^
/tmp/B.e4d21c47-9f39-40a9-9a48-bb1f7cd7cbe5/BUILD/uuid-1.6.2/php/uuid.c:506:5: note: in expansion of macro 'PHP_FE'
     PHP_FE(uuid_compare, NULL)
     ^
/usr/include/php/Zend/zend_API.h:71:129: warning: excess elements in scalar initializer [enabled by default]
 #define ZEND_FENTRY(zend_name, name, arg_info, flags) { #zend_name, name, arg_info, (zend_uint) (sizeof(arg_info)/sizeof(struct _zend_arg_info)-1), flags },
                                                                                                                                 ^
/usr/include/php/Zend/zend_API.h:77:38: note: in expansion of macro 'ZEND_FENTRY'
 #define ZEND_FE(name, arg_info)      ZEND_FENTRY(name, ZEND_FN(name), arg_info, 0)
                                      ^
/usr/include/php/main/php.h:349:18: note: in expansion of macro 'ZEND_FE'
 #define PHP_FE   ZEND_FE
                  ^
/tmp/B.e4d21c47-9f39-40a9-9a48-bb1f7cd7cbe5/BUILD/uuid-1.6.2/php/uuid.c:506:5: note: in expansion of macro 'PHP_FE'
     PHP_FE(uuid_compare, NULL)
     ^
/usr/include/php/Zend/zend_API.h:71:129: warning: (near initialization for 'uuid_functions[6]') [enabled by default]
 #define ZEND_FENTRY(zend_name, name, arg_info, flags) { #zend_name, name, arg_info, (zend_uint) (sizeof(arg_info)/sizeof(struct _zend_arg_info)-1), flags },
                                                                                                                                 ^
/usr/include/php/Zend/zend_API.h:77:38: note: in expansion of macro 'ZEND_FENTRY'
 #define ZEND_FE(name, arg_info)      ZEND_FENTRY(name, ZEND_FN(name), arg_info, 0)
                                      ^
/usr/include/php/main/php.h:349:18: note: in expansion of macro 'ZEND_FE'
 #define PHP_FE   ZEND_FE
                  ^
/tmp/B.e4d21c47-9f39-40a9-9a48-bb1f7cd7cbe5/BUILD/uuid-1.6.2/php/uuid.c:506:5: note: in expansion of macro 'PHP_FE'
     PHP_FE(uuid_compare, NULL)
     ^
/tmp/B.e4d21c47-9f39-40a9-9a48-bb1f7cd7cbe5/BUILD/uuid-1.6.2/php/uuid.c:507:5: warning: braces around scalar initializer [enabled by default]
     PHP_FE(uuid_import,  NULL)
     ^
/tmp/B.e4d21c47-9f39-40a9-9a48-bb1f7cd7cbe5/BUILD/uuid-1.6.2/php/uuid.c:507:5: warning: (near initialization for 'uuid_functions[7]') [enabled by default]
/tmp/B.e4d21c47-9f39-40a9-9a48-bb1f7cd7cbe5/BUILD/uuid-1.6.2/php/uuid.c:507:5: warning: initialization makes integer from pointer without a cast [enabled by default]
/tmp/B.e4d21c47-9f39-40a9-9a48-bb1f7cd7cbe5/BUILD/uuid-1.6.2/php/uuid.c:507:5: warning: (near initialization for 'uuid_functions[7]') [enabled by default]
/tmp/B.e4d21c47-9f39-40a9-9a48-bb1f7cd7cbe5/BUILD/uuid-1.6.2/php/uuid.c:507:5: warning: excess elements in scalar initializer [enabled by default]
/tmp/B.e4d21c47-9f39-40a9-9a48-bb1f7cd7cbe5/BUILD/uuid-1.6.2/php/uuid.c:507:5: warning: (near initialization for 'uuid_functions[7]') [enabled by default]
/tmp/B.e4d21c47-9f39-40a9-9a48-bb1f7cd7cbe5/BUILD/uuid-1.6.2/php/uuid.c:507:5: warning: excess elements in scalar initializer [enabled by default]
/tmp/B.e4d21c47-9f39-40a9-9a48-bb1f7cd7cbe5/BUILD/uuid-1.6.2/php/uuid.c:507:5: warning: (near initialization for 'uuid_functions[7]') [enabled by default]
In file included from /usr/include/php/main/php.h:38:0,
                 from /tmp/B.e4d21c47-9f39-40a9-9a48-bb1f7cd7cbe5/BUILD/uuid-1.6.2/php/uuid.c:35:
/usr/include/php/Zend/zend_API.h:71:129: warning: excess elements in scalar initializer [enabled by default]
 #define ZEND_FENTRY(zend_name, name, arg_info, flags) { #zend_name, name, arg_info, (zend_uint) (sizeof(arg_info)/sizeof(struct _zend_arg_info)-1), flags },
                                                                                                                                 ^
/usr/include/php/Zend/zend_API.h:77:38: note: in expansion of macro 'ZEND_FENTRY'
 #define ZEND_FE(name, arg_info)      ZEND_FENTRY(name, ZEND_FN(name), arg_info, 0)
                                      ^
/usr/include/php/main/php.h:349:18: note: in expansion of macro 'ZEND_FE'
 #define PHP_FE   ZEND_FE
                  ^
/tmp/B.e4d21c47-9f39-40a9-9a48-bb1f7cd7cbe5/BUILD/uuid-1.6.2/php/uuid.c:507:5: note: in expansion of macro 'PHP_FE'
     PHP_FE(uuid_import,  NULL)
     ^
/usr/include/php/Zend/zend_API.h:71:129: warning: (near initialization for 'uuid_functions[7]') [enabled by default]
 #define ZEND_FENTRY(zend_name, name, arg_info, flags) { #zend_name, name, arg_info, (zend_uint) (sizeof(arg_info)/sizeof(struct _zend_arg_info)-1), flags },
                                                                                                                                 ^
/usr/include/php/Zend/zend_API.h:77:38: note: in expansion of macro 'ZEND_FENTRY'
 #define ZEND_FE(name, arg_info)      ZEND_FENTRY(name, ZEND_FN(name), arg_info, 0)
                                      ^
/usr/include/php/main/php.h:349:18: note: in expansion of macro 'ZEND_FE'
 #define PHP_FE   ZEND_FE
                  ^
/tmp/B.e4d21c47-9f39-40a9-9a48-bb1f7cd7cbe5/BUILD/uuid-1.6.2/php/uuid.c:507:5: note: in expansion of macro 'PHP_FE'
     PHP_FE(uuid_import,  NULL)
     ^
/usr/include/php/Zend/zend_API.h:71:129: warning: excess elements in scalar initializer [enabled by default]
 #define ZEND_FENTRY(zend_name, name, arg_info, flags) { #zend_name, name, arg_info, (zend_uint) (sizeof(arg_info)/sizeof(struct _zend_arg_info)-1), flags },
                                                                                                                                 ^
/usr/include/php/Zend/zend_API.h:77:38: note: in expansion of macro 'ZEND_FENTRY'
 #define ZEND_FE(name, arg_info)      ZEND_FENTRY(name, ZEND_FN(name), arg_info, 0)
                                      ^
/usr/include/php/main/php.h:349:18: note: in expansion of macro 'ZEND_FE'
 #define PHP_FE   ZEND_FE
                  ^
/tmp/B.e4d21c47-9f39-40a9-9a48-bb1f7cd7cbe5/BUILD/uuid-1.6.2/php/uuid.c:507:5: note: in expansion of macro 'PHP_FE'
     PHP_FE(uuid_import,  NULL)
     ^
/usr/include/php/Zend/zend_API.h:71:129: warning: (near initialization for 'uuid_functions[7]') [enabled by default]
 #define ZEND_FENTRY(zend_name, name, arg_info, flags) { #zend_name, name, arg_info, (zend_uint) (sizeof(arg_info)/sizeof(struct _zend_arg_info)-1), flags },
                                                                                                                                 ^
/usr/include/php/Zend/zend_API.h:77:38: note: in expansion of macro 'ZEND_FENTRY'
 #define ZEND_FE(name, arg_info)      ZEND_FENTRY(name, ZEND_FN(name), arg_info, 0)
                                      ^
/usr/include/php/main/php.h:349:18: note: in expansion of macro 'ZEND_FE'
 #define PHP_FE   ZEND_FE
                  ^
/tmp/B.e4d21c47-9f39-40a9-9a48-bb1f7cd7cbe5/BUILD/uuid-1.6.2/php/uuid.c:507:5: note: in expansion of macro 'PHP_FE'
     PHP_FE(uuid_import,  NULL)
     ^
/tmp/B.e4d21c47-9f39-40a9-9a48-bb1f7cd7cbe5/BUILD/uuid-1.6.2/php/uuid.c:508:5: warning: braces around scalar initializer [enabled by default]
     PHP_FE(uuid_export,  NULL)
     ^
/tmp/B.e4d21c47-9f39-40a9-9a48-bb1f7cd7cbe5/BUILD/uuid-1.6.2/php/uuid.c:508:5: warning: (near initialization for 'uuid_functions[8]') [enabled by default]
/tmp/B.e4d21c47-9f39-40a9-9a48-bb1f7cd7cbe5/BUILD/uuid-1.6.2/php/uuid.c:508:5: warning: initialization makes integer from pointer without a cast [enabled by default]
/tmp/B.e4d21c47-9f39-40a9-9a48-bb1f7cd7cbe5/BUILD/uuid-1.6.2/php/uuid.c:508:5: warning: (near initialization for 'uuid_functions[8]') [enabled by default]
/tmp/B.e4d21c47-9f39-40a9-9a48-bb1f7cd7cbe5/BUILD/uuid-1.6.2/php/uuid.c:508:5: warning: excess elements in scalar initializer [enabled by default]
/tmp/B.e4d21c47-9f39-40a9-9a48-bb1f7cd7cbe5/BUILD/uuid-1.6.2/php/uuid.c:508:5: warning: (near initialization for 'uuid_functions[8]') [enabled by default]
/tmp/B.e4d21c47-9f39-40a9-9a48-bb1f7cd7cbe5/BUILD/uuid-1.6.2/php/uuid.c:508:5: warning: excess elements in scalar initializer [enabled by default]
/tmp/B.e4d21c47-9f39-40a9-9a48-bb1f7cd7cbe5/BUILD/uuid-1.6.2/php/uuid.c:508:5: warning: (near initialization for 'uuid_functions[8]') [enabled by default]
In file included from /usr/include/php/main/php.h:38:0,
                 from /tmp/B.e4d21c47-9f39-40a9-9a48-bb1f7cd7cbe5/BUILD/uuid-1.6.2/php/uuid.c:35:
/usr/include/php/Zend/zend_API.h:71:129: warning: excess elements in scalar initializer [enabled by default]
 #define ZEND_FENTRY(zend_name, name, arg_info, flags) { #zend_name, name, arg_info, (zend_uint) (sizeof(arg_info)/sizeof(struct _zend_arg_info)-1), flags },
                                                                                                                                 ^
/usr/include/php/Zend/zend_API.h:77:38: note: in expansion of macro 'ZEND_FENTRY'
 #define ZEND_FE(name, arg_info)      ZEND_FENTRY(name, ZEND_FN(name), arg_info, 0)
                                      ^
/usr/include/php/main/php.h:349:18: note: in expansion of macro 'ZEND_FE'
 #define PHP_FE   ZEND_FE
                  ^
/tmp/B.e4d21c47-9f39-40a9-9a48-bb1f7cd7cbe5/BUILD/uuid-1.6.2/php/uuid.c:508:5: note: in expansion of macro 'PHP_FE'
     PHP_FE(uuid_export,  NULL)
     ^
/usr/include/php/Zend/zend_API.h:71:129: warning: (near initialization for 'uuid_functions[8]') [enabled by default]
 #define ZEND_FENTRY(zend_name, name, arg_info, flags) { #zend_name, name, arg_info, (zend_uint) (sizeof(arg_info)/sizeof(struct _zend_arg_info)-1), flags },
                                                                                                                                 ^
/usr/include/php/Zend/zend_API.h:77:38: note: in expansion of macro 'ZEND_FENTRY'
 #define ZEND_FE(name, arg_info)      ZEND_FENTRY(name, ZEND_FN(name), arg_info, 0)
                                      ^
/usr/include/php/main/php.h:349:18: note: in expansion of macro 'ZEND_FE'
 #define PHP_FE   ZEND_FE
                  ^
/tmp/B.e4d21c47-9f39-40a9-9a48-bb1f7cd7cbe5/BUILD/uuid-1.6.2/php/uuid.c:508:5: note: in expansion of macro 'PHP_FE'
     PHP_FE(uuid_export,  NULL)
     ^
/usr/include/php/Zend/zend_API.h:71:129: warning: excess elements in scalar initializer [enabled by default]
 #define ZEND_FENTRY(zend_name, name, arg_info, flags) { #zend_name, name, arg_info, (zend_uint) (sizeof(arg_info)/sizeof(struct _zend_arg_info)-1), flags },
                                                                                                                                 ^
/usr/include/php/Zend/zend_API.h:77:38: note: in expansion of macro 'ZEND_FENTRY'
 #define ZEND_FE(name, arg_info)      ZEND_FENTRY(name, ZEND_FN(name), arg_info, 0)
                                      ^
/usr/include/php/main/php.h:349:18: note: in expansion of macro 'ZEND_FE'
 #define PHP_FE   ZEND_FE
                  ^
/tmp/B.e4d21c47-9f39-40a9-9a48-bb1f7cd7cbe5/BUILD/uuid-1.6.2/php/uuid.c:508:5: note: in expansion of macro 'PHP_FE'
     PHP_FE(uuid_export,  NULL)
     ^
/usr/include/php/Zend/zend_API.h:71:129: warning: (near initialization for 'uuid_functions[8]') [enabled by default]
 #define ZEND_FENTRY(zend_name, name, arg_info, flags) { #zend_name, name, arg_info, (zend_uint) (sizeof(arg_info)/sizeof(struct _zend_arg_info)-1), flags },
                                                                                                                                 ^
/usr/include/php/Zend/zend_API.h:77:38: note: in expansion of macro 'ZEND_FENTRY'
 #define ZEND_FE(name, arg_info)      ZEND_FENTRY(name, ZEND_FN(name), arg_info, 0)
                                      ^
/usr/include/php/main/php.h:349:18: note: in expansion of macro 'ZEND_FE'
 #define PHP_FE   ZEND_FE
                  ^
/tmp/B.e4d21c47-9f39-40a9-9a48-bb1f7cd7cbe5/BUILD/uuid-1.6.2/php/uuid.c:508:5: note: in expansion of macro 'PHP_FE'
     PHP_FE(uuid_export,  NULL)
     ^
/tmp/B.e4d21c47-9f39-40a9-9a48-bb1f7cd7cbe5/BUILD/uuid-1.6.2/php/uuid.c:509:5: warning: braces around scalar initializer [enabled by default]
     PHP_FE(uuid_error,   NULL)
     ^
/tmp/B.e4d21c47-9f39-40a9-9a48-bb1f7cd7cbe5/BUILD/uuid-1.6.2/php/uuid.c:509:5: warning: (near initialization for 'uuid_functions[9]') [enabled by default]
/tmp/B.e4d21c47-9f39-40a9-9a48-bb1f7cd7cbe5/BUILD/uuid-1.6.2/php/uuid.c:509:5: warning: initialization makes integer from pointer without a cast [enabled by default]
/tmp/B.e4d21c47-9f39-40a9-9a48-bb1f7cd7cbe5/BUILD/uuid-1.6.2/php/uuid.c:509:5: warning: (near initialization for 'uuid_functions[9]') [enabled by default]
/tmp/B.e4d21c47-9f39-40a9-9a48-bb1f7cd7cbe5/BUILD/uuid-1.6.2/php/uuid.c:509:5: warning: excess elements in scalar initializer [enabled by default]
/tmp/B.e4d21c47-9f39-40a9-9a48-bb1f7cd7cbe5/BUILD/uuid-1.6.2/php/uuid.c:509:5: warning: (near initialization for 'uuid_functions[9]') [enabled by default]
/tmp/B.e4d21c47-9f39-40a9-9a48-bb1f7cd7cbe5/BUILD/uuid-1.6.2/php/uuid.c:509:5: warning: excess elements in scalar initializer [enabled by default]
/tmp/B.e4d21c47-9f39-40a9-9a48-bb1f7cd7cbe5/BUILD/uuid-1.6.2/php/uuid.c:509:5: warning: (near initialization for 'uuid_functions[9]') [enabled by default]
In file included from /usr/include/php/main/php.h:38:0,
                 from /tmp/B.e4d21c47-9f39-40a9-9a48-bb1f7cd7cbe5/BUILD/uuid-1.6.2/php/uuid.c:35:
/usr/include/php/Zend/zend_API.h:71:129: warning: excess elements in scalar initializer [enabled by default]
 #define ZEND_FENTRY(zend_name, name, arg_info, flags) { #zend_name, name, arg_info, (zend_uint) (sizeof(arg_info)/sizeof(struct _zend_arg_info)-1), flags },
                                                                                                                                 ^
/usr/include/php/Zend/zend_API.h:77:38: note: in expansion of macro 'ZEND_FENTRY'
 #define ZEND_FE(name, arg_info)      ZEND_FENTRY(name, ZEND_FN(name), arg_info, 0)
                                      ^
/usr/include/php/main/php.h:349:18: note: in expansion of macro 'ZEND_FE'
 #define PHP_FE   ZEND_FE
                  ^
/tmp/B.e4d21c47-9f39-40a9-9a48-bb1f7cd7cbe5/BUILD/uuid-1.6.2/php/uuid.c:509:5: note: in expansion of macro 'PHP_FE'
     PHP_FE(uuid_error,   NULL)
     ^
/usr/include/php/Zend/zend_API.h:71:129: warning: (near initialization for 'uuid_functions[9]') [enabled by default]
 #define ZEND_FENTRY(zend_name, name, arg_info, flags) { #zend_name, name, arg_info, (zend_uint) (sizeof(arg_info)/sizeof(struct _zend_arg_info)-1), flags },
                                                                                                                                 ^
/usr/include/php/Zend/zend_API.h:77:38: note: in expansion of macro 'ZEND_FENTRY'
 #define ZEND_FE(name, arg_info)      ZEND_FENTRY(name, ZEND_FN(name), arg_info, 0)
                                      ^
/usr/include/php/main/php.h:349:18: note: in expansion of macro 'ZEND_FE'
 #define PHP_FE   ZEND_FE
                  ^
/tmp/B.e4d21c47-9f39-40a9-9a48-bb1f7cd7cbe5/BUILD/uuid-1.6.2/php/uuid.c:509:5: note: in expansion of macro 'PHP_FE'
     PHP_FE(uuid_error,   NULL)
     ^
/usr/include/php/Zend/zend_API.h:71:129: warning: excess elements in scalar initializer [enabled by default]
 #define ZEND_FENTRY(zend_name, name, arg_info, flags) { #zend_name, name, arg_info, (zend_uint) (sizeof(arg_info)/sizeof(struct _zend_arg_info)-1), flags },
                                                                                                                                 ^
/usr/include/php/Zend/zend_API.h:77:38: note: in expansion of macro 'ZEND_FENTRY'
 #define ZEND_FE(name, arg_info)      ZEND_FENTRY(name, ZEND_FN(name), arg_info, 0)
                                      ^
/usr/include/php/main/php.h:349:18: note: in expansion of macro 'ZEND_FE'
 #define PHP_FE   ZEND_FE
                  ^
/tmp/B.e4d21c47-9f39-40a9-9a48-bb1f7cd7cbe5/BUILD/uuid-1.6.2/php/uuid.c:509:5: note: in expansion of macro 'PHP_FE'
     PHP_FE(uuid_error,   NULL)
     ^
/usr/include/php/Zend/zend_API.h:71:129: warning: (near initialization for 'uuid_functions[9]') [enabled by default]
 #define ZEND_FENTRY(zend_name, name, arg_info, flags) { #zend_name, name, arg_info, (zend_uint) (sizeof(arg_info)/sizeof(struct _zend_arg_info)-1), flags },
                                                                                                                                 ^
/usr/include/php/Zend/zend_API.h:77:38: note: in expansion of macro 'ZEND_FENTRY'
 #define ZEND_FE(name, arg_info)      ZEND_FENTRY(name, ZEND_FN(name), arg_info, 0)
                                      ^
/usr/include/php/main/php.h:349:18: note: in expansion of macro 'ZEND_FE'
 #define PHP_FE   ZEND_FE
                  ^
/tmp/B.e4d21c47-9f39-40a9-9a48-bb1f7cd7cbe5/BUILD/uuid-1.6.2/php/uuid.c:509:5: note: in expansion of macro 'PHP_FE'
     PHP_FE(uuid_error,   NULL)
     ^
/tmp/B.e4d21c47-9f39-40a9-9a48-bb1f7cd7cbe5/BUILD/uuid-1.6.2/php/uuid.c:510:5: warning: braces around scalar initializer [enabled by default]
     PHP_FE(uuid_version, NULL)
     ^
/tmp/B.e4d21c47-9f39-40a9-9a48-bb1f7cd7cbe5/BUILD/uuid-1.6.2/php/uuid.c:510:5: warning: (near initialization for 'uuid_functions[10]') [enabled by default]
/tmp/B.e4d21c47-9f39-40a9-9a48-bb1f7cd7cbe5/BUILD/uuid-1.6.2/php/uuid.c:510:5: warning: initialization makes integer from pointer without a cast [enabled by default]
/tmp/B.e4d21c47-9f39-40a9-9a48-bb1f7cd7cbe5/BUILD/uuid-1.6.2/php/uuid.c:510:5: warning: (near initialization for 'uuid_functions[10]') [enabled by default]
/tmp/B.e4d21c47-9f39-40a9-9a48-bb1f7cd7cbe5/BUILD/uuid-1.6.2/php/uuid.c:510:5: warning: excess elements in scalar initializer [enabled by default]
/tmp/B.e4d21c47-9f39-40a9-9a48-bb1f7cd7cbe5/BUILD/uuid-1.6.2/php/uuid.c:510:5: warning: (near initialization for 'uuid_functions[10]') [enabled by default]
/tmp/B.e4d21c47-9f39-40a9-9a48-bb1f7cd7cbe5/BUILD/uuid-1.6.2/php/uuid.c:510:5: warning: excess elements in scalar initializer [enabled by default]
/tmp/B.e4d21c47-9f39-40a9-9a48-bb1f7cd7cbe5/BUILD/uuid-1.6.2/php/uuid.c:510:5: warning: (near initialization for 'uuid_functions[10]') [enabled by default]
In file included from /usr/include/php/main/php.h:38:0,
                 from /tmp/B.e4d21c47-9f39-40a9-9a48-bb1f7cd7cbe5/BUILD/uuid-1.6.2/php/uuid.c:35:
/usr/include/php/Zend/zend_API.h:71:129: warning: excess elements in scalar initializer [enabled by default]
 #define ZEND_FENTRY(zend_name, name, arg_info, flags) { #zend_name, name, arg_info, (zend_uint) (sizeof(arg_info)/sizeof(struct _zend_arg_info)-1), flags },
                                                                                                                                 ^
/usr/include/php/Zend/zend_API.h:77:38: note: in expansion of macro 'ZEND_FENTRY'
 #define ZEND_FE(name, arg_info)      ZEND_FENTRY(name, ZEND_FN(name), arg_info, 0)
                                      ^
/usr/include/php/main/php.h:349:18: note: in expansion of macro 'ZEND_FE'
 #define PHP_FE   ZEND_FE
                  ^
/tmp/B.e4d21c47-9f39-40a9-9a48-bb1f7cd7cbe5/BUILD/uuid-1.6.2/php/uuid.c:510:5: note: in expansion of macro 'PHP_FE'
     PHP_FE(uuid_version, NULL)
     ^
/usr/include/php/Zend/zend_API.h:71:129: warning: (near initialization for 'uuid_functions[10]') [enabled by default]
 #define ZEND_FENTRY(zend_name, name, arg_info, flags) { #zend_name, name, arg_info, (zend_uint) (sizeof(arg_info)/sizeof(struct _zend_arg_info)-1), flags },
                                                                                                                                 ^
/usr/include/php/Zend/zend_API.h:77:38: note: in expansion of macro 'ZEND_FENTRY'
 #define ZEND_FE(name, arg_info)      ZEND_FENTRY(name, ZEND_FN(name), arg_info, 0)
                                      ^
/usr/include/php/main/php.h:349:18: note: in expansion of macro 'ZEND_FE'
 #define PHP_FE   ZEND_FE
                  ^
/tmp/B.e4d21c47-9f39-40a9-9a48-bb1f7cd7cbe5/BUILD/uuid-1.6.2/php/uuid.c:510:5: note: in expansion of macro 'PHP_FE'
     PHP_FE(uuid_version, NULL)
     ^
/usr/include/php/Zend/zend_API.h:71:129: warning: excess elements in scalar initializer [enabled by default]
 #define ZEND_FENTRY(zend_name, name, arg_info, flags) { #zend_name, name, arg_info, (zend_uint) (sizeof(arg_info)/sizeof(struct _zend_arg_info)-1), flags },
                                                                                                                                 ^
/usr/include/php/Zend/zend_API.h:77:38: note: in expansion of macro 'ZEND_FENTRY'
 #define ZEND_FE(name, arg_info)      ZEND_FENTRY(name, ZEND_FN(name), arg_info, 0)
                                      ^
/usr/include/php/main/php.h:349:18: note: in expansion of macro 'ZEND_FE'
 #define PHP_FE   ZEND_FE
                  ^
/tmp/B.e4d21c47-9f39-40a9-9a48-bb1f7cd7cbe5/BUILD/uuid-1.6.2/php/uuid.c:510:5: note: in expansion of macro 'PHP_FE'
     PHP_FE(uuid_version, NULL)
     ^
/usr/include/php/Zend/zend_API.h:71:129: warning: (near initialization for 'uuid_functions[10]') [enabled by default]
 #define ZEND_FENTRY(zend_name, name, arg_info, flags) { #zend_name, name, arg_info, (zend_uint) (sizeof(arg_info)/sizeof(struct _zend_arg_info)-1), flags },
                                                                                                                                 ^
/usr/include/php/Zend/zend_API.h:77:38: note: in expansion of macro 'ZEND_FENTRY'
 #define ZEND_FE(name, arg_info)      ZEND_FENTRY(name, ZEND_FN(name), arg_info, 0)
                                      ^
/usr/include/php/main/php.h:349:18: note: in expansion of macro 'ZEND_FE'
 #define PHP_FE   ZEND_FE
                  ^
/tmp/B.e4d21c47-9f39-40a9-9a48-bb1f7cd7cbe5/BUILD/uuid-1.6.2/php/uuid.c:510:5: note: in expansion of macro 'PHP_FE'
     PHP_FE(uuid_version, NULL)
     ^
/tmp/B.e4d21c47-9f39-40a9-9a48-bb1f7cd7cbe5/BUILD/uuid-1.6.2/php/uuid.c:511:5: warning: braces around scalar initializer [enabled by default]
     { NULL, NULL, NULL }
     ^
/tmp/B.e4d21c47-9f39-40a9-9a48-bb1f7cd7cbe5/BUILD/uuid-1.6.2/php/uuid.c:511:5: warning: (near initialization for 'uuid_functions[11]') [enabled by default]
/tmp/B.e4d21c47-9f39-40a9-9a48-bb1f7cd7cbe5/BUILD/uuid-1.6.2/php/uuid.c:511:5: warning: initialization makes integer from pointer without a cast [enabled by default]
/tmp/B.e4d21c47-9f39-40a9-9a48-bb1f7cd7cbe5/BUILD/uuid-1.6.2/php/uuid.c:511:5: warning: (near initialization for 'uuid_functions[11]') [enabled by default]
/tmp/B.e4d21c47-9f39-40a9-9a48-bb1f7cd7cbe5/BUILD/uuid-1.6.2/php/uuid.c:511:5: warning: excess elements in scalar initializer [enabled by default]
/tmp/B.e4d21c47-9f39-40a9-9a48-bb1f7cd7cbe5/BUILD/uuid-1.6.2/php/uuid.c:511:5: warning: (near initialization for 'uuid_functions[11]') [enabled by default]
/tmp/B.e4d21c47-9f39-40a9-9a48-bb1f7cd7cbe5/BUILD/uuid-1.6.2/php/uuid.c:511:5: warning: excess elements in scalar initializer [enabled by default]
/tmp/B.e4d21c47-9f39-40a9-9a48-bb1f7cd7cbe5/BUILD/uuid-1.6.2/php/uuid.c:511:5: warning: (near initialization for 'uuid_functions[11]') [enabled by default]
/tmp/B.e4d21c47-9f39-40a9-9a48-bb1f7cd7cbe5/BUILD/uuid-1.6.2/php/uuid.c:518:5: warning: initialization from incompatible pointer type [enabled by default]
     uuid_functions,
     ^
/tmp/B.e4d21c47-9f39-40a9-9a48-bb1f7cd7cbe5/BUILD/uuid-1.6.2/php/uuid.c:518:5: warning: (near initialization for 'uuid_module_entry.functions') [enabled by default]
Makefile:202: recipe for target 'uuid.lo' failed
make[2]: *** [uuid.lo] Error 1
make[2]: Leaving directory '/tmp/B.e4d21c47-9f39-40a9-9a48-bb1f7cd7cbe5/BUILD/uuid-1.6.2/php'
Makefile.local:41: recipe for target 'build' failed
make[1]: *** [build] Error 2
make[1]: Leaving directory '/tmp/B.e4d21c47-9f39-40a9-9a48-bb1f7cd7cbe5/BUILD/uuid-1.6.2/php'
Makefile:134: recipe for target 'php/modules/ossp-uuid.so' failed
make: *** [php/modules/ossp-uuid.so] Error 2
make: *** Waiting for unfinished jobs....
Writing Makefile for OSSP::uuid
Writing MYMETA.yml and MYMETA.json
make[1]: Entering directory '/tmp/B.e4d21c47-9f39-40a9-9a48-bb1f7cd7cbe5/BUILD/uuid-1.6.2/perl'
/usr/bin/perl5.18.2 /usr/share/perl5/5.18.2/ExtUtils/xsubpp  -typemap /usr/share/perl5/5.18.2/ExtUtils/typemap -typemap uuid.tm  uuid.xs > uuid.xsc && mv uuid.xsc uuid.c
Running Mkbootstrap for OSSP::uuid ()
cp uuid.pod blib/lib/OSSP/uuid.pod
cp uuid.pm blib/lib/OSSP/uuid.pm
chmod 644 uuid.bs
cp uuid.bs blib/arch/auto/OSSP/uuid/uuid.bs
chmod 644 blib/arch/auto/OSSP/uuid/uuid.bs
i486-pld-linux-gcc -c  -I. -I.. -D_REENTRANT -D_GNU_SOURCE -fno-strict-aliasing -pipe -fstack-protector -I/usr/local/include -D_LARGEFILE_SOURCE -D_FILE_OFFSET_BITS=64 -O2 -fwrapv -pipe -Wformat -Werror=format-security -gdwarf-4 -fno-debug-types-section -fvar-tracking-assignments -g2 -Wp,-D_FORTIFY_SOURCE=2 -fstack-protector --param=ssp-buffer-size=4 -fomit-frame-pointer -march=i486 -fasynchronous-unwind-tables -gdwarf-4 -fno-debug-types-section -fvar-tracking-assignments -g2   -DVERSION=\"1.0602\" -DXS_VERSION=\"1.0602\" -fPIC "-I/usr/lib/perl5/5.18.2/i486-pld-linux-thread-multi/CORE"   uuid.c
rm -f blib/arch/auto/OSSP/uuid/uuid.so
LD_RUN_PATH="/tmp/B.e4d21c47-9f39-40a9-9a48-bb1f7cd7cbe5/BUILD/uuid-1.6.2/perl/../.libs" i486-pld-linux-gcc  -shared   -Wl,--no-copy-dt-needed-entries -Wl,-z,relro -Wl,-z,combreloc  -fstack-protector uuid.o  -o blib/arch/auto/OSSP/uuid/uuid.so 	\
   -L/tmp/B.e4d21c47-9f39-40a9-9a48-bb1f7cd7cbe5/BUILD/uuid-1.6.2/perl/../.libs -L/tmp/B.e4d21c47-9f39-40a9-9a48-bb1f7cd7cbe5/BUILD/uuid-1.6.2/perl/.. -lossp-uuid  	\
  
chmod 755 blib/arch/auto/OSSP/uuid/uuid.so
Manifying blib/man3/OSSP::uuid.3
make[1]: Leaving directory '/tmp/B.e4d21c47-9f39-40a9-9a48-bb1f7cd7cbe5/BUILD/uuid-1.6.2/perl'
error: Bad exit status from /tmp/B.e4d21c47-9f39-40a9-9a48-bb1f7cd7cbe5/BUILD/tmp/rpm-tmp.1245 (%build)


RPM build errors:
    Bad exit status from /tmp/B.e4d21c47-9f39-40a9-9a48-bb1f7cd7cbe5/BUILD/tmp/rpm-tmp.1245 (%build)
ended at: Mon Apr 28 14:18:02 2014, done in 0:00:17.994232
error: No files produced.
+ chmod -R u+rwX /tmp/B.e4d21c47-9f39-40a9-9a48-bb1f7cd7cbe5/BUILD
+ rm -rf /tmp/B.e4d21c47-9f39-40a9-9a48-bb1f7cd7cbe5/tmp /tmp/B.e4d21c47-9f39-40a9-9a48-bb1f7cd7cbe5/BUILD
+ rm -rf /tmp/B.e4d21c47-9f39-40a9-9a48-bb1f7cd7cbe5
Begin-PLD-Builder-Info
Build-Time: user:17.51s sys:3.96s real:25.47s (faults io:0 non-io:2014104)

End-PLD-Builder-Info
[Back to list of logs] [View rpm -qa of builder]