FailedOk

th/SRPMS[OK]
th/x32[OK]
th/i686[OK]
th/x86_64[OK]

ac/SRPMS[OK]
ac/i386[OK]
ac/i586[OK]
ac/i686[OK]
ac/alpha[OK]
ac/amd64[OK]
ac/athlon[OK]
ac/ppc[OK]
ac/sparc[OK]
ac/sparc64[OK]

Advanced Search
main()
Powered by PLD Linux
(c) 2002-2019 PLD Team
$Revision: 1.37 $
Powered by electricity.
Your IP: 35.172.150.239

3store f5553d85-e951-4911-b3b6-a9609867e874

Status:Failed
Source URL:ftp://buildlogs.pld-linux.org/th/i686/FAIL/3store,f5553d85-e951-4911-b3b6-a9609867e874.bz2
text/plain URL:View!
rpm -qa of builder:View!
Date:2019/10/23 08:45:11
Runtime:0:00:09.324960

Toc:

  • prep
  • Executing(%prep): /bin/sh -e /tmp/B.VoOcci/BUILD/tmp/rpm-tmp.163
  • build
  • Executing(%build): /bin/sh -e /tmp/B.VoOcci/BUILD/tmp/rpm-tmp.163
  • error 1
  • /usr/include/glib-1.2/glib.h:557:14: error: '__const__' is not an asm qualifier
  • error 2
  • /usr/include/glib-1.2/glib.h:557:14: error: '__const__' is not an asm qualifier
  • error 3
  • make[4]: *** [Makefile:532: rdfsql.lo] Error 1
  • error 4
  • make[3]: *** [Makefile:557: all-recursive] Error 1
  • error 5
  • make[2]: *** [Makefile:381: all-recursive] Error 1
  • error 6
  • make[1]: *** [Makefile:320: all] Error 2
  • error 7
  • error: Bad exit status from /tmp/B.VoOcci/BUILD/tmp/rpm-tmp.163 (%build)
  • error 8
  • RPM build errors:
  • error 9
  • error: No files produced.

Content:

request from: baggins
checking if we should skip the build
started at: Wed Oct 23 08:44:57 2019
killing old processes on a builder
sending signal 9 to pid -1
Killed
cleaning up /tmp
fetching https://srcbuilder.pld-linux.org/th//srpms/f5553d85-e951-4911-b3b6-a9609867e874/3store-2.2.22-14.src.rpm
fetched 652839 bytes, 1406.7 K/s
installing srpm: 3store-2.2.22-14.src.rpm
+ install -d /tmp/B.VoOcci/BUILD /tmp/B.VoOcci/RPMS
+ LC_ALL=en_US.UTF-8
+ rpm -qp --changelog 3store-2.2.22-14.src.rpm
* Wed Oct 23 2019 PLD Linux Team <feedback@pld-linux.org>
- For complete changelog see: http://git.pld-linux.org/?p=packages/3store.git;a=log;h=master
* Wed Oct 23 2019 Jan Rękorajski <baggins@pld-linux.org> d22b03e
- release 14 (by relup.sh) * Thu Oct 17 2019 Arkadiusz Miśkiewicz <arekm@maven.pl> 353d2a4
- release 13 (by relup.sh) + rpm -Uhv --nodeps --define '_topdir /tmp/B.VoOcci' --define '_specdir %{_topdir}' --define '_sourcedir %{_specdir}' --define '_rpmdir %{_topdir}/RPMS' --define '_builddir %{_topdir}/BUILD' 3store-2.2.22-14.src.rpm Preparing... ################################################## 3store ################################################## + rm -f 3store-2.2.22-14.src.rpm + install -m 700 -d /tmp/B.VoOcci/BUILD/tmp + TMPDIR=/tmp/B.VoOcci/BUILD/tmp + exec nice -n 0 rpmbuild -bp --short-circuit --nodeps --define '_topdir /tmp/B.VoOcci' --define '_specdir %{_topdir}' --define '_sourcedir %{_specdir}' --define '_rpmdir %{_topdir}/RPMS' --define '_builddir %{_topdir}/BUILD' --target i686-pld-linux --define 'prep exit 0' /tmp/B.VoOcci/3store.spec Building target platforms: i686-pld-linux checking BuildConflict-ing packages no BuildConflicts found checking BR rpm: Building target platforms: i686-pld-linux no BR needed building RPM using: set -ex; : build-id: f5553d85-e951-4911-b3b6-a9609867e874; TMPDIR=/tmp/B.VoOcci/BUILD/tmp exec nice -n 0 rpmbuild -bb --define '_smp_mflags -j9' --define '_make_opts -Otarget' --define '_pld_builder 1' --define '_topdir /tmp/B.VoOcci' --define '_specdir %{_topdir}' --define '_sourcedir %{_specdir}' --define '_rpmdir %{_topdir}/RPMS' --define '_builddir %{_topdir}/BUILD' --target i686-pld-linux /tmp/B.VoOcci/3store.spec + : build-id: f5553d85-e951-4911-b3b6-a9609867e874 + TMPDIR=/tmp/B.VoOcci/BUILD/tmp + exec nice -n 0 rpmbuild -bb --define '_smp_mflags -j9' --define '_make_opts -Otarget' --define '_pld_builder 1' --define '_topdir /tmp/B.VoOcci' --define '_specdir %{_topdir}' --define '_sourcedir %{_specdir}' --define '_rpmdir %{_topdir}/RPMS' --define '_builddir %{_topdir}/BUILD' --target i686-pld-linux /tmp/B.VoOcci/3store.spec Building target platforms: i686-pld-linux Executing(%prep): /bin/sh -e /tmp/B.VoOcci/BUILD/tmp/rpm-tmp.163 + umask 022 + cd /tmp/B.VoOcci/BUILD + cd /tmp/B.VoOcci/BUILD + rm -rf 3store-2.2.22 + /usr/bin/gzip -dc /tmp/B.VoOcci/3store-2.2.22.tar.gz + /bin/tar -xf - + STATUS=0 + '[' 0 -ne 0 ']' + cd 3store-2.2.22 + /bin/id -u + '[' 1001 '=' 0 ']' + /bin/id -u + '[' 1001 '=' 0 ']' + /bin/chmod -Rf a+rX,u+w,g-w,o-w . + echo 'Patch #0 (3store-ac.patch):' Patch #0 (3store-ac.patch): + '[' -f /tmp/B.VoOcci/3store-ac.patch ']' + /bin/cat /tmp/B.VoOcci/3store-ac.patch + /usr/bin/patch -s -p1 + echo 'Patch #2 (format-security.patch):' Patch #2 (format-security.patch): + '[' -f /tmp/B.VoOcci/format-security.patch ']' + /bin/cat /tmp/B.VoOcci/format-security.patch + /usr/bin/patch -s -p1 + exit 0 Executing(%build): /bin/sh -e /tmp/B.VoOcci/BUILD/tmp/rpm-tmp.163 TMP=/home/users/builder/tmp HOME=/home/users/builder PATH=/home/users/builder/GNUstep/Tools:/usr/local/bin:/usr/bin:/bin:/home/users/builder/bin TMPDIR=/tmp/B.VoOcci/BUILD/tmp + umask 022 + cd /tmp/B.VoOcci/BUILD + cd 3store-2.2.22 + libtoolize --copy --force --install libtoolize: putting auxiliary files in '.'. libtoolize: copying file './config.guess' libtoolize: copying file './config.sub' libtoolize: copying file './install-sh' libtoolize: copying file './ltmain.sh' libtoolize: You should add the contents of the following files to 'aclocal.m4': libtoolize: '/usr/share/aclocal/libtool.m4' libtoolize: '/usr/share/aclocal/ltoptions.m4' libtoolize: '/usr/share/aclocal/ltsugar.m4' libtoolize: '/usr/share/aclocal/ltversion.m4' libtoolize: '/usr/share/aclocal/lt~obsolete.m4' libtoolize: Consider adding 'AC_CONFIG_MACRO_DIRS([m4])' to configure.in, libtoolize: and rerunning libtoolize and aclocal. libtoolize: Consider adding '-I m4' to ACLOCAL_AMFLAGS in Makefile.am. + aclocal aclocal: warning: autoconf input should be named 'configure.ac', not 'configure.in' + autoconf + autoheader + automake -a -c -f --foreign automake: warning: autoconf input should be named 'configure.ac', not 'configure.in' configure.in:17: installing './compile' configure.in:3: installing './missing' automake: warning: autoconf input should be named 'configure.ac', not 'configure.in' src/libokbc/Makefile.am: installing './depcomp' configure.in: installing './ylwrap' + ./configure 'LDFLAGS=-Wl,--as-needed -Wl,--no-copy-dt-needed-entries -Wl,-z,relro -Wl,-z,combreloc ' 'CFLAGS=-O2 -fwrapv -pipe -Wformat -Werror=format-security -gdwarf-4 -fno-debug-types-section -fvar-tracking-assignments -g2 -Wp,-D_FORTIFY_SOURCE=2 -fstack-protector-strong --param=ssp-buffer-size=4 -Werror=trampolines -fomit-frame-pointer -march=i686 -fasynchronous-unwind-tables -mtune=pentium4 -gdwarf-4 -fno-debug-types-section -fvar-tracking-assignments -g2 ' 'CXXFLAGS=-O2 -fwrapv -pipe -Wformat -Werror=format-security -gdwarf-4 -fno-debug-types-section -fvar-tracking-assignments -g2 -Wp,-D_FORTIFY_SOURCE=2 -fstack-protector-strong --param=ssp-buffer-size=4 -Werror=trampolines -fomit-frame-pointer -march=i686 -fasynchronous-unwind-tables -mtune=pentium4 -gdwarf-4 -fno-debug-types-section -fvar-tracking-assignments -g2 ' 'FFLAGS=-O2 -fwrapv -pipe -Wformat -Werror=format-security -gdwarf-4 -fno-debug-types-section -fvar-tracking-assignments -g2 -Wp,-D_FORTIFY_SOURCE=2 -fstack-protector-strong --param=ssp-buffer-size=4 -Werror=trampolines -fomit-frame-pointer -march=i686 -fasynchronous-unwind-tables -mtune=pentium4 -gdwarf-4 -fno-debug-types-section -fvar-tracking-assignments -g2 ' 'FCFLAGS=-O2 -fwrapv -pipe -Wformat -Werror=format-security -gdwarf-4 -fno-debug-types-section -fvar-tracking-assignments -g2 -Wp,-D_FORTIFY_SOURCE=2 -fstack-protector-strong --param=ssp-buffer-size=4 -Werror=trampolines -fomit-frame-pointer -march=i686 -fasynchronous-unwind-tables -mtune=pentium4 -gdwarf-4 -fno-debug-types-section -fvar-tracking-assignments -g2 ' 'CPPFLAGS=' 'CC=i686-pld-linux-gcc' 'CXX=i686-pld-linux-g++' '--host=i686-pld-linux' '--build=i686-pld-linux' '--prefix=/usr' '--exec-prefix=/usr' '--bindir=/usr/bin' '--sbindir=/usr/sbin' '--sysconfdir=/etc' '--datadir=/usr/share' '--includedir=/usr/include' '--libdir=/usr/lib' '--libexecdir=/usr/libexec' '--localstatedir=/var' '--sharedstatedir=/var/lib' '--mandir=/usr/share/man' '--infodir=/usr/share/info' '--x-libraries=/usr/lib' checking for a BSD-compatible install... /usr/bin/install -c checking whether build environment is sane... yes checking for a thread-safe mkdir -p... /bin/mkdir -p checking for mawk... mawk checking whether make sets $(MAKE)... yes checking whether make supports nested variables... yes checking for i686-pld-linux-ranlib... no checking for ranlib... ranlib checking for i686-pld-linux-gcc... i686-pld-linux-gcc checking whether the C compiler works... yes checking for C compiler default output file name... a.out checking for suffix of executables... checking whether we are cross compiling... no checking for suffix of object files... o checking whether we are using the GNU C compiler... yes checking whether i686-pld-linux-gcc accepts -g... yes checking for i686-pld-linux-gcc option to accept ISO C89... none needed checking whether i686-pld-linux-gcc understands -c and -o together... yes checking whether make supports the include directive... yes (GNU style) checking dependency style of i686-pld-linux-gcc... gcc3 checking for bison... bison -y checking for flex... flex checking lex output file root... lex.yy checking lex library... -lfl checking whether yytext is a pointer... yes checking build system type... i686-pld-linux-gnu checking host system type... i686-pld-linux-gnu checking how to print strings... print -r checking for a sed that does not truncate output... /bin/sed checking for grep that handles long lines and -e... /bin/grep checking for egrep... /bin/grep -E checking for fgrep... /bin/grep -F checking for ld used by i686-pld-linux-gcc... /usr/bin/ld checking if the linker (/usr/bin/ld) is GNU ld... yes checking for BSD- or MS-compatible name lister (nm)... /usr/bin/nm -B checking the name lister (/usr/bin/nm -B) interface... BSD nm checking whether ln -s works... yes checking the maximum length of command line arguments... 1572864 checking how to convert i686-pld-linux-gnu file names to i686-pld-linux-gnu format... func_convert_file_noop checking how to convert i686-pld-linux-gnu file names to toolchain format... func_convert_file_noop checking for /usr/bin/ld option to reload object files... -r checking for i686-pld-linux-objdump... no checking for objdump... objdump checking how to recognize dependent libraries... pass_all checking for i686-pld-linux-dlltool... no checking for dlltool... no checking how to associate runtime and link libraries... print -r -- checking for i686-pld-linux-ar... no checking for ar... ar checking for archiver @FILE support... @ checking for i686-pld-linux-strip... no checking for strip... strip checking for i686-pld-linux-ranlib... ranlib checking command to parse /usr/bin/nm -B output from i686-pld-linux-gcc object... ok checking for sysroot... no checking for a working dd... /bin/dd checking how to truncate binary pipes... /bin/dd bs=4096 count=1 checking for i686-pld-linux-mt... no checking for mt... no checking if : is a manifest tool... no checking how to run the C preprocessor... i686-pld-linux-gcc -E checking for ANSI C header files... yes checking for sys/types.h... yes checking for sys/stat.h... yes checking for stdlib.h... yes checking for string.h... yes checking for memory.h... yes checking for strings.h... yes checking for inttypes.h... yes checking for stdint.h... yes checking for unistd.h... yes checking for dlfcn.h... yes checking for objdir... .libs checking if i686-pld-linux-gcc supports -fno-rtti -fno-exceptions... no checking for i686-pld-linux-gcc option to produce PIC... -fPIC -DPIC checking if i686-pld-linux-gcc PIC flag -fPIC -DPIC works... yes checking if i686-pld-linux-gcc static flag -static works... yes checking if i686-pld-linux-gcc supports -c -o file.o... yes checking if i686-pld-linux-gcc supports -c -o file.o... (cached) yes checking whether the i686-pld-linux-gcc linker (/usr/bin/ld) supports shared libraries... yes checking whether -lc should be explicitly linked in... no checking dynamic linker characteristics... GNU/Linux ld.so checking how to hardcode library paths into programs... immediate checking whether stripping libraries is possible... yes checking if libtool supports shared libraries... yes checking whether to build shared libraries... yes checking whether to build static libraries... yes checking for pthread_self in -lpthread... yes checking for mysql_config... /usr/bin/mysql_config checking for glib-config... /usr/bin/glib-config checking for raptor-config... /usr/bin/raptor-config checking for ANSI C header files... (cached) yes checking for stdlib.h... (cached) yes checking for string.h... (cached) yes checking for unistd.h... (cached) yes checking for an ANSI C-conforming const... yes checking for inline... inline checking whether byte ordering is bigendian... no Will not build Apache module support checking that generated files are newer than configure... done configure: creating ./config.status config.status: creating 3store.pc config.status: creating 3store.spec config.status: creating 3store-config config.status: creating Makefile config.status: creating util/Makefile config.status: creating util/tables.sql config.status: creating src/Makefile config.status: creating src/rdfsql/Makefile config.status: creating src/rdfsql/rdfsql/Makefile config.status: creating src/libokbc/Makefile config.status: creating src/tools/Makefile config.status: creating src/perl/Makefile config.status: creating src/perl/RDQL.pm config.status: creating src/http/Makefile config.status: creating src/config.h config.status: executing depfiles commands config.status: executing libtool commands config.status: executing default commands + /usr/bin/make -Otarget -j9 Making all in src /usr/bin/make all-recursive Making all in rdfsql Making all in rdfsql make[4]: Nothing to be done for 'all'. make[4]: Entering directory '/tmp/B.VoOcci/BUILD/3store-2.2.22/src/rdfsql' /bin/sh ../../libtool --tag=CC --mode=compile i686-pld-linux-gcc -DHAVE_CONFIG_H -I. -I../../src -Wall -g -I/usr/include/glib-1.2 -I/usr/lib/glib/include -I/usr/include/mysql -O2 -fwrapv -pipe -Wformat -Werror=format-security -gdwarf-4 -fno-debug-types-section -fvar-tracking-assignments -g2 -Wp,-D_FORTIFY_SOURCE=2 -fstack-protector-strong --param=ssp-buffer-size=4 -Werror=trampolines -fomit-frame-pointer -march=i686 -fasynchronous-unwind-tables -mtune=pentium4 -gdwarf-4 -fno-debug-types-section -fvar-tracking-assignments -g2 -MT rdfsql.lo -MD -MP -MF .deps/rdfsql.Tpo -c -o rdfsql.lo rdfsql.c libtool: compile: i686-pld-linux-gcc -DHAVE_CONFIG_H -I. -I../../src -Wall -g -I/usr/include/glib-1.2 -I/usr/lib/glib/include -I/usr/include/mysql -O2 -fwrapv -pipe -Wformat -Werror=format-security -gdwarf-4 -fno-debug-types-section -fvar-tracking-assignments -g2 -Wp,-D_FORTIFY_SOURCE=2 -fstack-protector-strong --param=ssp-buffer-size=4 -Werror=trampolines -fomit-frame-pointer -march=i686 -fasynchronous-unwind-tables -mtune=pentium4 -gdwarf-4 -fno-debug-types-section -fvar-tracking-assignments -g2 -MT rdfsql.lo -MD -MP -MF .deps/rdfsql.Tpo -c rdfsql.c -fPIC -DPIC -o .libs/rdfsql.o In file included from rdfsql.c:17: rdfsql.c: In function 'rs_hash': /usr/include/glib-1.2/glib.h:557:14: error: '__const__' is not an asm qualifier 557 | __asm__ __const__ ("bswap %0" \ | ^~~~~~~~~ /usr/include/glib-1.2/glib.h:562:36: note: in expansion of macro 'GUINT32_SWAP_LE_BE_X86' 562 | # define GUINT32_SWAP_LE_BE(val) (GUINT32_SWAP_LE_BE_X86 (val)) | ^~~~~~~~~~~~~~~~~~~~~~ /usr/include/glib-1.2/glib.h:598:16: note: in expansion of macro 'GUINT32_SWAP_LE_BE' 598 | __r.__l[0] = GUINT32_SWAP_LE_BE (__w.__l[1]); \ | ^~~~~~~~~~~~~~~~~~ /usr/include/glib-1.2/glib.h:602:38: note: in expansion of macro 'GUINT64_SWAP_LE_BE_X86' 602 | # define GUINT64_SWAP_LE_BE(val) (GUINT64_SWAP_LE_BE_X86 (val)) | ^~~~~~~~~~~~~~~~~~~~~~ /usr/lib/glib/include/glibconfig.h:104:29: note: in expansion of macro 'GUINT64_SWAP_LE_BE' 104 | #define GUINT64_TO_BE(val) (GUINT64_SWAP_LE_BE (val)) | ^~~~~~~~~~~~~~~~~~ /usr/include/glib-1.2/glib.h:633:31: note: in expansion of macro 'GUINT64_TO_BE' 633 | #define GUINT64_FROM_BE(val) (GUINT64_TO_BE (val)) | ^~~~~~~~~~~~~ rdfsql.c:48:12: note: in expansion of macro 'GUINT64_FROM_BE' 48 | return GUINT64_FROM_BE(data[0]); | ^~~~~~~~~~~~~~~ /usr/include/glib-1.2/glib.h:557:14: error: '__const__' is not an asm qualifier 557 | __asm__ __const__ ("bswap %0" \ | ^~~~~~~~~ /usr/include/glib-1.2/glib.h:562:36: note: in expansion of macro 'GUINT32_SWAP_LE_BE_X86' 562 | # define GUINT32_SWAP_LE_BE(val) (GUINT32_SWAP_LE_BE_X86 (val)) | ^~~~~~~~~~~~~~~~~~~~~~ /usr/include/glib-1.2/glib.h:599:16: note: in expansion of macro 'GUINT32_SWAP_LE_BE' 599 | __r.__l[1] = GUINT32_SWAP_LE_BE (__w.__l[0]); \ | ^~~~~~~~~~~~~~~~~~ /usr/include/glib-1.2/glib.h:602:38: note: in expansion of macro 'GUINT64_SWAP_LE_BE_X86' 602 | # define GUINT64_SWAP_LE_BE(val) (GUINT64_SWAP_LE_BE_X86 (val)) | ^~~~~~~~~~~~~~~~~~~~~~ /usr/lib/glib/include/glibconfig.h:104:29: note: in expansion of macro 'GUINT64_SWAP_LE_BE' 104 | #define GUINT64_TO_BE(val) (GUINT64_SWAP_LE_BE (val)) | ^~~~~~~~~~~~~~~~~~ /usr/include/glib-1.2/glib.h:633:31: note: in expansion of macro 'GUINT64_TO_BE' 633 | #define GUINT64_FROM_BE(val) (GUINT64_TO_BE (val)) | ^~~~~~~~~~~~~ rdfsql.c:48:12: note: in expansion of macro 'GUINT64_FROM_BE' 48 | return GUINT64_FROM_BE(data[0]); | ^~~~~~~~~~~~~~~ make[4]: *** [Makefile:532: rdfsql.lo] Error 1 make[4]: Leaving directory '/tmp/B.VoOcci/BUILD/3store-2.2.22/src/rdfsql' make[4]: *** Waiting for unfinished jobs.... make[4]: Entering directory '/tmp/B.VoOcci/BUILD/3store-2.2.22/src/rdfsql' /bin/sh ../../libtool --tag=CC --mode=compile i686-pld-linux-gcc -DHAVE_CONFIG_H -I. -I../../src -Wall -g -I/usr/include/glib-1.2 -I/usr/lib/glib/include -I/usr/include/mysql -O2 -fwrapv -pipe -Wformat -Werror=format-security -gdwarf-4 -fno-debug-types-section -fvar-tracking-assignments -g2 -Wp,-D_FORTIFY_SOURCE=2 -fstack-protector-strong --param=ssp-buffer-size=4 -Werror=trampolines -fomit-frame-pointer -march=i686 -fasynchronous-unwind-tables -mtune=pentium4 -gdwarf-4 -fno-debug-types-section -fvar-tracking-assignments -g2 -MT rdql_datatypes.lo -MD -MP -MF .deps/rdql_datatypes.Tpo -c -o rdql_datatypes.lo rdql_datatypes.c libtool: compile: i686-pld-linux-gcc -DHAVE_CONFIG_H -I. -I../../src -Wall -g -I/usr/include/glib-1.2 -I/usr/lib/glib/include -I/usr/include/mysql -O2 -fwrapv -pipe -Wformat -Werror=format-security -gdwarf-4 -fno-debug-types-section -fvar-tracking-assignments -g2 -Wp,-D_FORTIFY_SOURCE=2 -fstack-protector-strong --param=ssp-buffer-size=4 -Werror=trampolines -fomit-frame-pointer -march=i686 -fasynchronous-unwind-tables -mtune=pentium4 -gdwarf-4 -fno-debug-types-section -fvar-tracking-assignments -g2 -MT rdql_datatypes.lo -MD -MP -MF .deps/rdql_datatypes.Tpo -c rdql_datatypes.c -fPIC -DPIC -o .libs/rdql_datatypes.o libtool: compile: i686-pld-linux-gcc -DHAVE_CONFIG_H -I. -I../../src -Wall -g -I/usr/include/glib-1.2 -I/usr/lib/glib/include -I/usr/include/mysql -O2 -fwrapv -pipe -Wformat -Werror=format-security -gdwarf-4 -fno-debug-types-section -fvar-tracking-assignments -g2 -Wp,-D_FORTIFY_SOURCE=2 -fstack-protector-strong --param=ssp-buffer-size=4 -Werror=trampolines -fomit-frame-pointer -march=i686 -fasynchronous-unwind-tables -mtune=pentium4 -gdwarf-4 -fno-debug-types-section -fvar-tracking-assignments -g2 -MT rdql_datatypes.lo -MD -MP -MF .deps/rdql_datatypes.Tpo -c rdql_datatypes.c -o rdql_datatypes.o >/dev/null 2>&1 mv -f .deps/rdql_datatypes.Tpo .deps/rdql_datatypes.Plo make[4]: Leaving directory '/tmp/B.VoOcci/BUILD/3store-2.2.22/src/rdfsql' make[4]: Entering directory '/tmp/B.VoOcci/BUILD/3store-2.2.22/src/rdfsql' /bin/sh ../../libtool --tag=CC --mode=compile i686-pld-linux-gcc -DHAVE_CONFIG_H -I. -I../../src -Wall -g -I/usr/include/glib-1.2 -I/usr/lib/glib/include -I/usr/include/mysql -O2 -fwrapv -pipe -Wformat -Werror=format-security -gdwarf-4 -fno-debug-types-section -fvar-tracking-assignments -g2 -Wp,-D_FORTIFY_SOURCE=2 -fstack-protector-strong --param=ssp-buffer-size=4 -Werror=trampolines -fomit-frame-pointer -march=i686 -fasynchronous-unwind-tables -mtune=pentium4 -gdwarf-4 -fno-debug-types-section -fvar-tracking-assignments -g2 -MT import.lo -MD -MP -MF .deps/import.Tpo -c -o import.lo import.c libtool: compile: i686-pld-linux-gcc -DHAVE_CONFIG_H -I. -I../../src -Wall -g -I/usr/include/glib-1.2 -I/usr/lib/glib/include -I/usr/include/mysql -O2 -fwrapv -pipe -Wformat -Werror=format-security -gdwarf-4 -fno-debug-types-section -fvar-tracking-assignments -g2 -Wp,-D_FORTIFY_SOURCE=2 -fstack-protector-strong --param=ssp-buffer-size=4 -Werror=trampolines -fomit-frame-pointer -march=i686 -fasynchronous-unwind-tables -mtune=pentium4 -gdwarf-4 -fno-debug-types-section -fvar-tracking-assignments -g2 -MT import.lo -MD -MP -MF .deps/import.Tpo -c import.c -fPIC -DPIC -o .libs/import.o import.c: In function 'rs_import2': import.c:145:27: warning: pointer targets in passing argument 1 of 'raptor_new_uri' differ in signedness [-Wpointer-sign] 145 | ruri = raptor_new_uri(uri); | ^~~ | | | char * In file included from import.c:26: /usr/include/raptor.h:1149:13: note: expected 'const unsigned char *' but argument is of type 'char *' 1149 | raptor_uri* raptor_new_uri(const unsigned char *uri_string); | ^~~~~~~~~~~~~~ import.c:146:27: warning: pointer targets in passing argument 1 of 'raptor_new_uri' differ in signedness [-Wpointer-sign] 146 | muri = raptor_new_uri(model); | ^~~~~ | | | char * In file included from import.c:26: /usr/include/raptor.h:1149:13: note: expected 'const unsigned char *' but argument is of type 'char *' 1149 | raptor_uri* raptor_new_uri(const unsigned char *uri_string); | ^~~~~~~~~~~~~~ import.c: In function 'store_stmt': import.c:208:18: warning: pointer targets in initialization of 'char *' from 'unsigned char *' differ in signedness [-Wpointer-sign] 208 | char *subj = raptor_uri_as_string((raptor_uri *)statement->subject), | ^~~~~~~~~~~~~~~~~~~~ import.c:209:11: warning: pointer targets in initialization of 'char *' from 'unsigned char *' differ in signedness [-Wpointer-sign] 209 | *pred = raptor_uri_as_string((raptor_uri *)statement->predicate), | ^~~~~~~~~~~~~~~~~~~~ import.c:210:18: warning: pointer targets in initialization of 'char *' from 'unsigned char *' differ in signedness [-Wpointer-sign] 210 | *obj = raptor_uri_as_string((raptor_uri *)statement->object); | ^~~~~~~~~~~~~~~~~~~~ import.c:212:2: warning: pointer targets in initialization of 'const char *' from 'unsigned char *' differ in signedness [-Wpointer-sign] 212 | raptor_uri_as_string(statement->object_literal_datatype); | ^~~~~~~~~~~~~~~~~~~~ libtool: compile: i686-pld-linux-gcc -DHAVE_CONFIG_H -I. -I../../src -Wall -g -I/usr/include/glib-1.2 -I/usr/lib/glib/include -I/usr/include/mysql -O2 -fwrapv -pipe -Wformat -Werror=format-security -gdwarf-4 -fno-debug-types-section -fvar-tracking-assignments -g2 -Wp,-D_FORTIFY_SOURCE=2 -fstack-protector-strong --param=ssp-buffer-size=4 -Werror=trampolines -fomit-frame-pointer -march=i686 -fasynchronous-unwind-tables -mtune=pentium4 -gdwarf-4 -fno-debug-types-section -fvar-tracking-assignments -g2 -MT import.lo -MD -MP -MF .deps/import.Tpo -c import.c -o import.o >/dev/null 2>&1 mv -f .deps/import.Tpo .deps/import.Plo make[4]: Leaving directory '/tmp/B.VoOcci/BUILD/3store-2.2.22/src/rdfsql' make[4]: Entering directory '/tmp/B.VoOcci/BUILD/3store-2.2.22/src/rdfsql' /bin/sh ../../libtool --tag=CC --mode=compile i686-pld-linux-gcc -DHAVE_CONFIG_H -I. -I../../src -Wall -g -I/usr/include/glib-1.2 -I/usr/lib/glib/include -I/usr/include/mysql -O2 -fwrapv -pipe -Wformat -Werror=format-security -gdwarf-4 -fno-debug-types-section -fvar-tracking-assignments -g2 -Wp,-D_FORTIFY_SOURCE=2 -fstack-protector-strong --param=ssp-buffer-size=4 -Werror=trampolines -fomit-frame-pointer -march=i686 -fasynchronous-unwind-tables -mtune=pentium4 -gdwarf-4 -fno-debug-types-section -fvar-tracking-assignments -g2 -MT md5.lo -MD -MP -MF .deps/md5.Tpo -c -o md5.lo md5.c libtool: compile: i686-pld-linux-gcc -DHAVE_CONFIG_H -I. -I../../src -Wall -g -I/usr/include/glib-1.2 -I/usr/lib/glib/include -I/usr/include/mysql -O2 -fwrapv -pipe -Wformat -Werror=format-security -gdwarf-4 -fno-debug-types-section -fvar-tracking-assignments -g2 -Wp,-D_FORTIFY_SOURCE=2 -fstack-protector-strong --param=ssp-buffer-size=4 -Werror=trampolines -fomit-frame-pointer -march=i686 -fasynchronous-unwind-tables -mtune=pentium4 -gdwarf-4 -fno-debug-types-section -fvar-tracking-assignments -g2 -MT md5.lo -MD -MP -MF .deps/md5.Tpo -c md5.c -fPIC -DPIC -o .libs/md5.o libtool: compile: i686-pld-linux-gcc -DHAVE_CONFIG_H -I. -I../../src -Wall -g -I/usr/include/glib-1.2 -I/usr/lib/glib/include -I/usr/include/mysql -O2 -fwrapv -pipe -Wformat -Werror=format-security -gdwarf-4 -fno-debug-types-section -fvar-tracking-assignments -g2 -Wp,-D_FORTIFY_SOURCE=2 -fstack-protector-strong --param=ssp-buffer-size=4 -Werror=trampolines -fomit-frame-pointer -march=i686 -fasynchronous-unwind-tables -mtune=pentium4 -gdwarf-4 -fno-debug-types-section -fvar-tracking-assignments -g2 -MT md5.lo -MD -MP -MF .deps/md5.Tpo -c md5.c -o md5.o >/dev/null 2>&1 mv -f .deps/md5.Tpo .deps/md5.Plo make[4]: Leaving directory '/tmp/B.VoOcci/BUILD/3store-2.2.22/src/rdfsql' make[4]: Entering directory '/tmp/B.VoOcci/BUILD/3store-2.2.22/src/rdfsql' /bin/sh ../../libtool --tag=CC --mode=compile i686-pld-linux-gcc -DHAVE_CONFIG_H -I. -I../../src -Wall -g -I/usr/include/glib-1.2 -I/usr/lib/glib/include -I/usr/include/mysql -O2 -fwrapv -pipe -Wformat -Werror=format-security -gdwarf-4 -fno-debug-types-section -fvar-tracking-assignments -g2 -Wp,-D_FORTIFY_SOURCE=2 -fstack-protector-strong --param=ssp-buffer-size=4 -Werror=trampolines -fomit-frame-pointer -march=i686 -fasynchronous-unwind-tables -mtune=pentium4 -gdwarf-4 -fno-debug-types-section -fvar-tracking-assignments -g2 -MT rdql_parser.lo -MD -MP -MF .deps/rdql_parser.Tpo -c -o rdql_parser.lo rdql_parser.c libtool: compile: i686-pld-linux-gcc -DHAVE_CONFIG_H -I. -I../../src -Wall -g -I/usr/include/glib-1.2 -I/usr/lib/glib/include -I/usr/include/mysql -O2 -fwrapv -pipe -Wformat -Werror=format-security -gdwarf-4 -fno-debug-types-section -fvar-tracking-assignments -g2 -Wp,-D_FORTIFY_SOURCE=2 -fstack-protector-strong --param=ssp-buffer-size=4 -Werror=trampolines -fomit-frame-pointer -march=i686 -fasynchronous-unwind-tables -mtune=pentium4 -gdwarf-4 -fno-debug-types-section -fvar-tracking-assignments -g2 -MT rdql_parser.lo -MD -MP -MF .deps/rdql_parser.Tpo -c rdql_parser.c -fPIC -DPIC -o .libs/rdql_parser.o rdql_parser.c:3:1: warning: 'yyrcsid' defined but not used [-Wunused-const-variable=] 3 | yyrcsid[] = "$FreeBSD: src/usr.bin/yacc/skeleton.c,v 1.28 2000/01/17 02:04:06 bde Exp $"; | ^~~~~~~ libtool: compile: i686-pld-linux-gcc -DHAVE_CONFIG_H -I. -I../../src -Wall -g -I/usr/include/glib-1.2 -I/usr/lib/glib/include -I/usr/include/mysql -O2 -fwrapv -pipe -Wformat -Werror=format-security -gdwarf-4 -fno-debug-types-section -fvar-tracking-assignments -g2 -Wp,-D_FORTIFY_SOURCE=2 -fstack-protector-strong --param=ssp-buffer-size=4 -Werror=trampolines -fomit-frame-pointer -march=i686 -fasynchronous-unwind-tables -mtune=pentium4 -gdwarf-4 -fno-debug-types-section -fvar-tracking-assignments -g2 -MT rdql_parser.lo -MD -MP -MF .deps/rdql_parser.Tpo -c rdql_parser.c -o rdql_parser.o >/dev/null 2>&1 mv -f .deps/rdql_parser.Tpo .deps/rdql_parser.Plo make[4]: Leaving directory '/tmp/B.VoOcci/BUILD/3store-2.2.22/src/rdfsql' make[4]: Entering directory '/tmp/B.VoOcci/BUILD/3store-2.2.22/src/rdfsql' /bin/sh ../../libtool --tag=CC --mode=compile i686-pld-linux-gcc -DHAVE_CONFIG_H -I. -I../../src -Wall -g -I/usr/include/glib-1.2 -I/usr/lib/glib/include -I/usr/include/mysql -O2 -fwrapv -pipe -Wformat -Werror=format-security -gdwarf-4 -fno-debug-types-section -fvar-tracking-assignments -g2 -Wp,-D_FORTIFY_SOURCE=2 -fstack-protector-strong --param=ssp-buffer-size=4 -Werror=trampolines -fomit-frame-pointer -march=i686 -fasynchronous-unwind-tables -mtune=pentium4 -gdwarf-4 -fno-debug-types-section -fvar-tracking-assignments -g2 -MT rdql_lex.lo -MD -MP -MF .deps/rdql_lex.Tpo -c -o rdql_lex.lo rdql_lex.c libtool: compile: i686-pld-linux-gcc -DHAVE_CONFIG_H -I. -I../../src -Wall -g -I/usr/include/glib-1.2 -I/usr/lib/glib/include -I/usr/include/mysql -O2 -fwrapv -pipe -Wformat -Werror=format-security -gdwarf-4 -fno-debug-types-section -fvar-tracking-assignments -g2 -Wp,-D_FORTIFY_SOURCE=2 -fstack-protector-strong --param=ssp-buffer-size=4 -Werror=trampolines -fomit-frame-pointer -march=i686 -fasynchronous-unwind-tables -mtune=pentium4 -gdwarf-4 -fno-debug-types-section -fvar-tracking-assignments -g2 -MT rdql_lex.lo -MD -MP -MF .deps/rdql_lex.Tpo -c rdql_lex.c -fPIC -DPIC -o .libs/rdql_lex.o libtool: compile: i686-pld-linux-gcc -DHAVE_CONFIG_H -I. -I../../src -Wall -g -I/usr/include/glib-1.2 -I/usr/lib/glib/include -I/usr/include/mysql -O2 -fwrapv -pipe -Wformat -Werror=format-security -gdwarf-4 -fno-debug-types-section -fvar-tracking-assignments -g2 -Wp,-D_FORTIFY_SOURCE=2 -fstack-protector-strong --param=ssp-buffer-size=4 -Werror=trampolines -fomit-frame-pointer -march=i686 -fasynchronous-unwind-tables -mtune=pentium4 -gdwarf-4 -fno-debug-types-section -fvar-tracking-assignments -g2 -MT rdql_lex.lo -MD -MP -MF .deps/rdql_lex.Tpo -c rdql_lex.c -o rdql_lex.o >/dev/null 2>&1 mv -f .deps/rdql_lex.Tpo .deps/rdql_lex.Plo make[4]: Leaving directory '/tmp/B.VoOcci/BUILD/3store-2.2.22/src/rdfsql' make[4]: Entering directory '/tmp/B.VoOcci/BUILD/3store-2.2.22/src/rdfsql' /bin/sh ../../libtool --tag=CC --mode=compile i686-pld-linux-gcc -DHAVE_CONFIG_H -I. -I../../src -Wall -g -I/usr/include/glib-1.2 -I/usr/lib/glib/include -I/usr/include/mysql -O2 -fwrapv -pipe -Wformat -Werror=format-security -gdwarf-4 -fno-debug-types-section -fvar-tracking-assignments -g2 -Wp,-D_FORTIFY_SOURCE=2 -fstack-protector-strong --param=ssp-buffer-size=4 -Werror=trampolines -fomit-frame-pointer -march=i686 -fasynchronous-unwind-tables -mtune=pentium4 -gdwarf-4 -fno-debug-types-section -fvar-tracking-assignments -g2 -MT cache.lo -MD -MP -MF .deps/cache.Tpo -c -o cache.lo cache.c libtool: compile: i686-pld-linux-gcc -DHAVE_CONFIG_H -I. -I../../src -Wall -g -I/usr/include/glib-1.2 -I/usr/lib/glib/include -I/usr/include/mysql -O2 -fwrapv -pipe -Wformat -Werror=format-security -gdwarf-4 -fno-debug-types-section -fvar-tracking-assignments -g2 -Wp,-D_FORTIFY_SOURCE=2 -fstack-protector-strong --param=ssp-buffer-size=4 -Werror=trampolines -fomit-frame-pointer -march=i686 -fasynchronous-unwind-tables -mtune=pentium4 -gdwarf-4 -fno-debug-types-section -fvar-tracking-assignments -g2 -MT cache.lo -MD -MP -MF .deps/cache.Tpo -c cache.c -fPIC -DPIC -o .libs/cache.o cache.c: In function 'rebuild_latice_inline': cache.c:166:9: warning: variable 'pass' set but not used [-Wunused-but-set-variable] 166 | int pass, count; | ^~~~ libtool: compile: i686-pld-linux-gcc -DHAVE_CONFIG_H -I. -I../../src -Wall -g -I/usr/include/glib-1.2 -I/usr/lib/glib/include -I/usr/include/mysql -O2 -fwrapv -pipe -Wformat -Werror=format-security -gdwarf-4 -fno-debug-types-section -fvar-tracking-assignments -g2 -Wp,-D_FORTIFY_SOURCE=2 -fstack-protector-strong --param=ssp-buffer-size=4 -Werror=trampolines -fomit-frame-pointer -march=i686 -fasynchronous-unwind-tables -mtune=pentium4 -gdwarf-4 -fno-debug-types-section -fvar-tracking-assignments -g2 -MT cache.lo -MD -MP -MF .deps/cache.Tpo -c cache.c -o cache.o >/dev/null 2>&1 mv -f .deps/cache.Tpo .deps/cache.Plo make[4]: Leaving directory '/tmp/B.VoOcci/BUILD/3store-2.2.22/src/rdfsql' make[4]: Entering directory '/tmp/B.VoOcci/BUILD/3store-2.2.22/src/rdfsql' /bin/sh ../../libtool --tag=CC --mode=compile i686-pld-linux-gcc -DHAVE_CONFIG_H -I. -I../../src -Wall -g -I/usr/include/glib-1.2 -I/usr/lib/glib/include -I/usr/include/mysql -O2 -fwrapv -pipe -Wformat -Werror=format-security -gdwarf-4 -fno-debug-types-section -fvar-tracking-assignments -g2 -Wp,-D_FORTIFY_SOURCE=2 -fstack-protector-strong --param=ssp-buffer-size=4 -Werror=trampolines -fomit-frame-pointer -march=i686 -fasynchronous-unwind-tables -mtune=pentium4 -gdwarf-4 -fno-debug-types-section -fvar-tracking-assignments -g2 -MT rdql.lo -MD -MP -MF .deps/rdql.Tpo -c -o rdql.lo rdql.c libtool: compile: i686-pld-linux-gcc -DHAVE_CONFIG_H -I. -I../../src -Wall -g -I/usr/include/glib-1.2 -I/usr/lib/glib/include -I/usr/include/mysql -O2 -fwrapv -pipe -Wformat -Werror=format-security -gdwarf-4 -fno-debug-types-section -fvar-tracking-assignments -g2 -Wp,-D_FORTIFY_SOURCE=2 -fstack-protector-strong --param=ssp-buffer-size=4 -Werror=trampolines -fomit-frame-pointer -march=i686 -fasynchronous-unwind-tables -mtune=pentium4 -gdwarf-4 -fno-debug-types-section -fvar-tracking-assignments -g2 -MT rdql.lo -MD -MP -MF .deps/rdql.Tpo -c rdql.c -fPIC -DPIC -o .libs/rdql.o rdql.c: In function 'st_free': rdql.c:25:26: warning: passing argument 1 of 'free' discards 'const' qualifier from pointer target type [-Wdiscarded-qualifiers] 25 | if (v->column) free(v->column); | ~^~~~~~~~ In file included from rdql.c:2: /usr/include/stdlib.h:565:25: note: expected 'void *' but argument is of type 'const char *' 565 | extern void free (void *__ptr) __THROW; | ~~~~~~^~~~~ rdql.c:26:30: warning: passing argument 1 of 'free' discards 'const' qualifier from pointer target type [-Wdiscarded-qualifiers] 26 | if (v->val_column) free(v->val_column); | ~^~~~~~~~~~~~ In file included from rdql.c:2: /usr/include/stdlib.h:565:25: note: expected 'void *' but argument is of type 'const char *' 565 | extern void free (void *__ptr) __THROW; | ~~~~~~^~~~~ rdql.c:27:31: warning: passing argument 1 of 'free' discards 'const' qualifier from pointer target type [-Wdiscarded-qualifiers] 27 | if (v->hash_column) free(v->hash_column); | ~^~~~~~~~~~~~~ In file included from rdql.c:2: /usr/include/stdlib.h:565:25: note: expected 'void *' but argument is of type 'const char *' 565 | extern void free (void *__ptr) __THROW; | ~~~~~~^~~~~ libtool: compile: i686-pld-linux-gcc -DHAVE_CONFIG_H -I. -I../../src -Wall -g -I/usr/include/glib-1.2 -I/usr/lib/glib/include -I/usr/include/mysql -O2 -fwrapv -pipe -Wformat -Werror=format-security -gdwarf-4 -fno-debug-types-section -fvar-tracking-assignments -g2 -Wp,-D_FORTIFY_SOURCE=2 -fstack-protector-strong --param=ssp-buffer-size=4 -Werror=trampolines -fomit-frame-pointer -march=i686 -fasynchronous-unwind-tables -mtune=pentium4 -gdwarf-4 -fno-debug-types-section -fvar-tracking-assignments -g2 -MT rdql.lo -MD -MP -MF .deps/rdql.Tpo -c rdql.c -o rdql.o >/dev/null 2>&1 mv -f .deps/rdql.Tpo .deps/rdql.Plo make[4]: Leaving directory '/tmp/B.VoOcci/BUILD/3store-2.2.22/src/rdfsql' make[3]: *** [Makefile:557: all-recursive] Error 1 make[2]: *** [Makefile:381: all-recursive] Error 1 make[1]: *** [Makefile:320: all] Error 2 make: *** [Makefile:490: all-recursive] Error 1 error: Bad exit status from /tmp/B.VoOcci/BUILD/tmp/rpm-tmp.163 (%build) RPM build errors: Bad exit status from /tmp/B.VoOcci/BUILD/tmp/rpm-tmp.163 (%build) ended at: Wed Oct 23 08:45:11 2019, done in 0:00:09.324960 error: No files produced. + chmod -R u+rwX /tmp/B.VoOcci/BUILD + rm -rf /tmp/B.VoOcci/tmp /tmp/B.VoOcci/BUILD + rm -rf /tmp/B.VoOcci Begin-PLD-Builder-Info Build-Time: user:12.63s sys:1.01s real:14.68s (faults io:0 non-io:620092) End-PLD-Builder-Info
[Back to list of logs] [View rpm -qa of builder]