FailedOk

th/SRPMS[OK]
th/x32[OK]
th/i686[OK]
th/x86_64[OK]

ac/SRPMS[OK]
ac/i386[OK]
ac/i586[OK]
ac/i686[OK]
ac/alpha[OK]
ac/amd64[OK]
ac/athlon[OK]
ac/ppc[OK]
ac/sparc[OK]
ac/sparc64[OK]

Advanced Search
main()
Powered by PLD Linux
(c) 2002-2018 PLD Team
$Revision: 1.37 $
Powered by bogon.
Your IP: 54.234.13.175

CuraEngine 702fc791-3306-450d-bfa9-e77cb0597252

Status:Failed
Source URL:ftp://buildlogs.pld-linux.org/th/i686/FAIL/CuraEngine,702fc791-3306-450d-bfa9-e77cb0597252.bz2
text/plain URL:View!
full text:View!
rpm -qa of builder:View!
Date:2018/11/04 14:13:40
Runtime:0:00:04.821414

Toc:

  • error 1
  • make[2]: *** [CMakeFiles/stb.dir/build.make:93: stb-prefix/src/stb-stamp/stb-download] Error 1
  • error 2
  • make[1]: *** [CMakeFiles/Makefile2:113: CMakeFiles/stb.dir/all] Error 2
  • error 3
  • error: Bad exit status from /tmp/B.DEmEv4/BUILD/tmp/rpm-tmp.6443 (%build)
  • error 4
  • RPM build errors:
  • error 5
  • error: No files produced.

Content:

Patch #1 (CuraEngine-static-libstdcpp.patch):
+ '[' -f /tmp/B.DEmEv4/CuraEngine-static-libstdcpp.patch ']'
+ /bin/cat /tmp/B.DEmEv4/CuraEngine-static-libstdcpp.patch
+ /usr/bin/patch -s -p1
+ rm -rf libs
+ /bin/sed -i 's|#include <clipper/clipper.hpp>|#include <polyclipping/clipper.hpp>|' src/utils/AABB.h src/utils/AABB3D.h src/utils/Coord_t.h src/utils/Date.h src/utils/IntPoint.h src/utils/LazyInitialization.h src/utils/ListPolyIt.h src/utils/Lock.h src/utils/MinimumSpanningTree.h src/utils/NoCopy.h src/utils/Point3.h src/utils/PolygonConnector.h src/utils/PolygonProximityLinker.h src/utils/PolygonsPointIndex.h src/utils/ProximityPointLink.h src/utils/SVG.h src/utils/SparseGrid.h src/utils/SparseLineGrid.h src/utils/SparsePointGrid.h src/utils/SparsePointGridInclusive.h src/utils/SymmetricPair.h src/utils/UnionFind.h src/utils/algorithm.h src/utils/floatpoint.h src/utils/gettime.h src/utils/linearAlg2D.h src/utils/logoutput.h src/utils/macros.h src/utils/math.h src/utils/optional.h src/utils/orderOptimizer.h src/utils/polygon.h src/utils/polygonUtils.h src/utils/socket.h src/utils/string.h src/ConicalOverhang.cpp src/ExtruderTrain.cpp src/FffGcodeWriter.cpp src/FffPolygonGenerator.cpp src/FffProcessor.cpp src/GCodePathConfig.cpp src/InsetOrderOptimizer.cpp src/LayerPlan.cpp src/LayerPlanBuffer.cpp src/MergeInfillLines.cpp src/MeshGroup.cpp src/Mold.cpp src/Preheat.cpp src/PrimeTower.cpp src/SkirtBrim.cpp src/SupportInfillPart.cpp src/TopSurface.cpp src/TreeSupport.cpp src/WallsComputation.cpp src/Weaver.cpp src/Wireframe2gcode.cpp src/bridge.cpp src/commandSocket.cpp src/gcodeExport.cpp src/infill.cpp src/layerPart.cpp src/main.cpp src/mesh.cpp src/multiVolumes.cpp src/pathOrderOptimizer.cpp src/raft.cpp src/skin.cpp src/sliceDataStorage.cpp src/slicer.cpp src/support.cpp src/timeEstimate.cpp src/wallOverlap.cpp
+ /bin/sed -i 's/"DEV"/"3.5.1"/' src/settings/settings.h
+ exit 0
Executing(%build): /bin/sh -e /tmp/B.DEmEv4/BUILD/tmp/rpm-tmp.6443
TMP=/home/users/builder/tmp
HOME=/home/users/builder
PATH=/usr/local/bin:/usr/bin:/bin:/home/users/builder/bin
TMPDIR=/tmp/B.DEmEv4/BUILD/tmp
+ umask 022
+ cd /tmp/B.DEmEv4/BUILD
+ cd CuraEngine-3.5.1
+ mkdir build
+ cd build
+ CC=i686-pld-linux-gcc CXX=i686-pld-linux-g++ CPPFLAGS= /usr/bin/cmake '-DCMAKE_VERBOSE_MAKEFILE=ON' '-DCMAKE_BUILD_TYPE=PLD' '-DCMAKE_INSTALL_BINDIR:PATH=/usr/bin' '-DCMAKE_INSTALL_SBINDIR:PATH=/usr/sbin' '-DCMAKE_INSTALL_LIBEXECDIR:PATH=/usr/libexec' '-DCMAKE_INSTALL_SYSCONFDIR:PATH=/etc' '-DCMAKE_INSTALL_SHAREDSTATEDIRPATH:PATH=/var/lib' '-DCMAKE_INSTALL_LOCALSTATEDIRPATH:PATH=/var' '-DCMAKE_INSTALL_LIBDIR:PATH=/usr/lib' '-DCMAKE_INSTALL_INCLUDEDIR:PATH=/usr/include' '-DCMAKE_INSTALL_OLDINCLUDEDIR:PATH=/usr/include' '-DCMAKE_INSTALL_DATAROOTDIR:PATH=/usr/share' '-DCMAKE_INSTALL_DATADIR:PATH=/usr/share' '-DCMAKE_INSTALL_INFODIR:PATH=/usr/share/info' '-DCMAKE_INSTALL_LOCALEDIR:PATH=/usr/share/locale' '-DCMAKE_INSTALL_MANDIR:PATH=/usr/share/man' '-DCMAKE_INSTALL_DOCDIR:PATH=/usr/share/doc' '-DCMAKE_INSTALL_PREFIX:PATH=/usr' '-DSYSCONF_INSTALL_DIR:PATH=/etc' '-DCMAKE_CXX_FLAGS_PLD=-O2 -fwrapv -pipe -Wformat -Werror=format-security -gdwarf-4 -fno-debug-types-section -fvar-tracking-assignments -g2 -Wp,-D_FORTIFY_SOURCE=2 -fstack-protector-strong --param=ssp-buffer-size=4 -fomit-frame-pointer -march=i686 -fasynchronous-unwind-tables -mtune=pentium4 -gdwarf-4 -fno-debug-types-section -fvar-tracking-assignments -g2  -DNDEBUG -DQT_NO_DEBUG' '-DCMAKE_C_FLAGS_PLD=-O2 -fwrapv -pipe -Wformat -Werror=format-security -gdwarf-4 -fno-debug-types-section -fvar-tracking-assignments -g2 -Wp,-D_FORTIFY_SOURCE=2 -fstack-protector-strong --param=ssp-buffer-size=4 -fomit-frame-pointer -march=i686 -fasynchronous-unwind-tables -mtune=pentium4 -gdwarf-4 -fno-debug-types-section -fvar-tracking-assignments -g2  -DNDEBUG -DQT_NO_DEBUG' '-DCMAKE_Fortran_FLAGS_PLD=-O2 -fwrapv -pipe -Wformat -Werror=format-security -gdwarf-4 -fno-debug-types-section -fvar-tracking-assignments -g2 -Wp,-D_FORTIFY_SOURCE=2 -fstack-protector-strong --param=ssp-buffer-size=4 -fomit-frame-pointer -march=i686 -fasynchronous-unwind-tables -mtune=pentium4 -gdwarf-4 -fno-debug-types-section -fvar-tracking-assignments -g2  -DNDEBUG -DQT_NO_DEBUG' '-DCMAKE_EXE_LINKER_FLAGS_PLD=-Wl,--as-needed -Wl,--no-copy-dt-needed-entries -Wl,-z,relro -Wl,-z,combreloc ' '-DCMAKE_SHARED_LINKER_FLAGS_PLD=-Wl,--as-needed -Wl,--no-copy-dt-needed-entries -Wl,-z,relro -Wl,-z,combreloc ' '-DCMAKE_MODULE_LINKER_FLAGS_PLD=-Wl,--as-needed -Wl,--no-copy-dt-needed-entries -Wl,-z,relro -Wl,-z,combreloc ' '-DBUILD_SHARED_LIBS:BOOL=ON' .. '-DUSE_SYSTEM_LIBS:BOOL=ON' '-DBUILD_SHARED_LIBS:BOOL=OFF' '-DCURA_ENGINE_VERSION:STRING=3.5.1'
-- The C compiler identification is GNU 8.2.0
-- The CXX compiler identification is GNU 8.2.0
-- Check for working C compiler: /usr/bin/i686-pld-linux-gcc
-- Check for working C compiler: /usr/bin/i686-pld-linux-gcc -- works
-- Detecting C compiler ABI info
-- Detecting C compiler ABI info - done
-- Detecting C compile features
-- Detecting C compile features - done
-- Check for working CXX compiler: /usr/bin/i686-pld-linux-g++
-- Check for working CXX compiler: /usr/bin/i686-pld-linux-g++ -- works
-- Detecting CXX compiler ABI info
-- Detecting CXX compiler ABI info - done
-- Detecting CXX compile features
-- Detecting CXX compile features - done
-- Building with Arcus
-- Looking for pthread.h
-- Looking for pthread.h - found
-- Looking for pthread_create
-- Looking for pthread_create - not found
-- Looking for pthread_create in pthreads
-- Looking for pthread_create in pthreads - not found
-- Looking for pthread_create in pthread
-- Looking for pthread_create in pthread - found
-- Found Threads: TRUE  
-- Found Protobuf: /usr/lib/libprotobuf.so;-lpthread (found suitable version "3.6.1", minimum required is "3.0.0") 
-- Building Stb from source.
-- Created Stb installation at: /tmp/B.DEmEv4/BUILD/CuraEngine-3.5.1/build/stb-prefix/src
-- RapidJSON found. Headers: /usr/include
-- Found Polyclipping: /usr/lib/libpolyclipping.so (found version "6.2.0") 
-- Compile with more optimization flags
-- Found OpenMP_C: -fopenmp (found version "4.5") 
-- Found OpenMP_CXX: -fopenmp (found version "4.5") 
-- Found OpenMP: TRUE (found version "4.5")  
-- Configuring done
-- Generating done
CMake Warning:
  Manually-specified variables were not used by the project:

    CMAKE_Fortran_FLAGS_PLD
    CMAKE_INSTALL_LOCALSTATEDIRPATH
    CMAKE_INSTALL_SHAREDSTATEDIRPATH
    SYSCONF_INSTALL_DIR


-- Build files have been written to: /tmp/B.DEmEv4/BUILD/CuraEngine-3.5.1/build
+ /usr/bin/make -Otarget -j9
/usr/bin/cmake -H/tmp/B.DEmEv4/BUILD/CuraEngine-3.5.1 -B/tmp/B.DEmEv4/BUILD/CuraEngine-3.5.1/build --check-build-system CMakeFiles/Makefile.cmake 0
/usr/bin/cmake -E cmake_progress_start /tmp/B.DEmEv4/BUILD/CuraEngine-3.5.1/build/CMakeFiles /tmp/B.DEmEv4/BUILD/CuraEngine-3.5.1/build/CMakeFiles/progress.marks
/usr/bin/make -f CMakeFiles/Makefile2 all
/usr/bin/make -f CMakeFiles/stb.dir/build.make CMakeFiles/stb.dir/depend
make[2]: Entering directory '/tmp/B.DEmEv4/BUILD/CuraEngine-3.5.1/build'
cd /tmp/B.DEmEv4/BUILD/CuraEngine-3.5.1/build && /usr/bin/cmake -E cmake_depends "Unix Makefiles" /tmp/B.DEmEv4/BUILD/CuraEngine-3.5.1 /tmp/B.DEmEv4/BUILD/CuraEngine-3.5.1 /tmp/B.DEmEv4/BUILD/CuraEngine-3.5.1/build /tmp/B.DEmEv4/BUILD/CuraEngine-3.5.1/build /tmp/B.DEmEv4/BUILD/CuraEngine-3.5.1/build/CMakeFiles/stb.dir/DependInfo.cmake --color=
Scanning dependencies of target stb
make[2]: Leaving directory '/tmp/B.DEmEv4/BUILD/CuraEngine-3.5.1/build'
/usr/bin/make -f CMakeFiles/stb.dir/build.make CMakeFiles/stb.dir/build
make[2]: Entering directory '/tmp/B.DEmEv4/BUILD/CuraEngine-3.5.1/build'
[  1%] Creating directories for 'stb'
/usr/bin/cmake -E make_directory /tmp/B.DEmEv4/BUILD/CuraEngine-3.5.1/build/stb-prefix/src/stb
/usr/bin/cmake -E make_directory /tmp/B.DEmEv4/BUILD/CuraEngine-3.5.1/build/stb-prefix/src/stb-build
/usr/bin/cmake -E make_directory /tmp/B.DEmEv4/BUILD/CuraEngine-3.5.1/build/stb-prefix
/usr/bin/cmake -E make_directory /tmp/B.DEmEv4/BUILD/CuraEngine-3.5.1/build/stb-prefix/tmp
/usr/bin/cmake -E make_directory /tmp/B.DEmEv4/BUILD/CuraEngine-3.5.1/build/stb-prefix/src/stb-stamp
/usr/bin/cmake -E make_directory /tmp/B.DEmEv4/BUILD/CuraEngine-3.5.1/build/stb-prefix/src
/usr/bin/cmake -E touch /tmp/B.DEmEv4/BUILD/CuraEngine-3.5.1/build/stb-prefix/src/stb-stamp/stb-mkdir
make[2]: Leaving directory '/tmp/B.DEmEv4/BUILD/CuraEngine-3.5.1/build'
make[2]: Entering directory '/tmp/B.DEmEv4/BUILD/CuraEngine-3.5.1/build'
[  2%] Performing download step (git clone) for 'stb'
cd /tmp/B.DEmEv4/BUILD/CuraEngine-3.5.1/build/stb-prefix/src && /usr/bin/cmake -P /tmp/B.DEmEv4/BUILD/CuraEngine-3.5.1/build/stb-prefix/tmp/stb-gitclone.cmake
Cloning into 'stb'...
fatal: unable to access 'https://github.com/nothings/stb.git/': Could not resolve: github.com (Could not contact DNS servers)
Cloning into 'stb'...
fatal: unable to access 'https://github.com/nothings/stb.git/': Could not resolve: github.com (Could not contact DNS servers)
Cloning into 'stb'...
fatal: unable to access 'https://github.com/nothings/stb.git/': Could not resolve: github.com (Could not contact DNS servers)
-- Had to git clone more than once:
          3 times.
CMake Error at /tmp/B.DEmEv4/BUILD/CuraEngine-3.5.1/build/stb-prefix/tmp/stb-gitclone.cmake:66 (message):
  Failed to clone repository: 'https://github.com/nothings/stb.git'


make[2]: *** [CMakeFiles/stb.dir/build.make:93: stb-prefix/src/stb-stamp/stb-download] Error 1
make[2]: Leaving directory '/tmp/B.DEmEv4/BUILD/CuraEngine-3.5.1/build'
make[1]: *** [CMakeFiles/Makefile2:113: CMakeFiles/stb.dir/all] Error 2
make: *** [Makefile:155: all] Error 2
error: Bad exit status from /tmp/B.DEmEv4/BUILD/tmp/rpm-tmp.6443 (%build)


RPM build errors:
    Bad exit status from /tmp/B.DEmEv4/BUILD/tmp/rpm-tmp.6443 (%build)
ended at: Sun Nov  4 14:13:40 2018, done in 0:00:04.821414
error: No files produced.
+ chmod -R u+rwX /tmp/B.DEmEv4/BUILD
+ rm -rf /tmp/B.DEmEv4/tmp /tmp/B.DEmEv4/BUILD
+ rm -rf /tmp/B.DEmEv4
Begin-PLD-Builder-Info
Build-Time: user:5.43s sys:1.44s real:8.94s (faults io:0 non-io:215226)

End-PLD-Builder-Info
[Back to list of logs] [View rpm -qa of builder]