FailedOk

th/SRPMS[OK]
th/x32[OK]
th/i686[OK]
th/x86_64[OK]

ac/SRPMS[OK]
ac/i386[OK]
ac/i586[OK]
ac/i686[OK]
ac/alpha[OK]
ac/amd64[OK]
ac/athlon[OK]
ac/ppc[OK]
ac/sparc[OK]
ac/sparc64[OK]

Advanced Search
main()
Powered by PLD Linux
(c) 2002-2018 PLD Team
$Revision: 1.37 $
Powered by overclock.
Your IP: 54.84.236.168

Yap 706aeb4a-f019-4e43-852a-017f835b584a

Status:Failed
Source URL:ftp://buildlogs.pld-linux.org/th/i686/FAIL/Yap,706aeb4a-f019-4e43-852a-017f835b584a.bz2
text/plain URL:View!
full text:View!
rpm -qa of builder:View!
Date:2018/03/06 05:02:51
Runtime:0:01:00.498934

Toc:

  • error 1
  • make[1]: *** [Makefile:111: chr_translate_bootstrap2.pl] Error 1
  • error 2
  • error: Bad exit status from /tmp/B.HL3cQ1/BUILD/tmp/rpm-tmp.73813 (%install)
  • error 3
  • RPM build errors:
  • error 4
  • error: No files produced.

Content:

YAPSHAREDIR=/tmp/B.HL3cQ1/BUILD/tmp/Yap-6.2.2-root-builder/usr/share/Yap YAPLIBDIR=/tmp/B.HL3cQ1/BUILD/tmp/Yap-6.2.2-root-builder/usr/lib/Yap /tmp/B.HL3cQ1/BUILD/tmp/Yap-6.2.2-root-builder/usr/bin/yap /tmp/B.HL3cQ1/BUILD/tmp/Yap-6.2.2-root-builder/usr/lib/Yap/startup.yss -f none -g make -t halt
% Restoring file /tmp/B.HL3cQ1/BUILD/tmp/Yap-6.2.2-root-builder/usr/lib/Yap/startup.yss
YAP 6.2.2 (i686-linux): Tue Mar  6 05:02:18 CET 2018
MYDDAS version MYDDAS-0.9.1
yes
% YAP execution halted
make[1]: Leaving directory '/tmp/B.HL3cQ1/BUILD/yap-6.2.2/packages/semweb'
(cd packages/tai; /usr/bin/make install)
make[1]: Entering directory '/tmp/B.HL3cQ1/BUILD/yap-6.2.2/packages/tai'
/usr/bin/install -c pl-tai.so /tmp/B.HL3cQ1/BUILD/tmp/Yap-6.2.2-root-builder/usr/lib/Yap
make[1]: Leaving directory '/tmp/B.HL3cQ1/BUILD/yap-6.2.2/packages/tai'
(cd packages/zlib; /usr/bin/make install)
make[1]: Entering directory '/tmp/B.HL3cQ1/BUILD/yap-6.2.2/packages/zlib'
mkdir -p /tmp/B.HL3cQ1/BUILD/tmp/Yap-6.2.2-root-builder/usr/lib/Yap
for f in zlib4pl.so; do \
	  /usr/bin/install -c $f /tmp/B.HL3cQ1/BUILD/tmp/Yap-6.2.2-root-builder/usr/lib/Yap; \
	done
mkdir -p /tmp/B.HL3cQ1/BUILD/tmp/Yap-6.2.2-root-builder/usr/share/Yap
for f in ./zlib.pl; do \
	  /usr/bin/install -c -m 644 $f /tmp/B.HL3cQ1/BUILD/tmp/Yap-6.2.2-root-builder/usr/share/Yap; \
	done
YAPSHAREDIR=/tmp/B.HL3cQ1/BUILD/tmp/Yap-6.2.2-root-builder/usr/share/Yap YAPLIBDIR=/tmp/B.HL3cQ1/BUILD/tmp/Yap-6.2.2-root-builder/usr/lib/Yap /tmp/B.HL3cQ1/BUILD/tmp/Yap-6.2.2-root-builder/usr/bin/yap /tmp/B.HL3cQ1/BUILD/tmp/Yap-6.2.2-root-builder/usr/lib/Yap/startup.yss -f none -g make -t halt
% Restoring file /tmp/B.HL3cQ1/BUILD/tmp/Yap-6.2.2-root-builder/usr/lib/Yap/startup.yss
YAP 6.2.2 (i686-linux): Tue Mar  6 05:02:18 CET 2018
MYDDAS version MYDDAS-0.9.1
yes
% YAP execution halted
make[1]: Leaving directory '/tmp/B.HL3cQ1/BUILD/yap-6.2.2/packages/zlib'
(cd packages/swi-minisat2/C; /usr/bin/make install)
make[1]: Entering directory '/tmp/B.HL3cQ1/BUILD/yap-6.2.2/packages/swi-minisat2/C'
/usr/bin/install -c pl-minisat.so /tmp/B.HL3cQ1/BUILD/tmp/Yap-6.2.2-root-builder/usr/lib/Yap
make[1]: Leaving directory '/tmp/B.HL3cQ1/BUILD/yap-6.2.2/packages/swi-minisat2/C'
#@#  (cd packages/pyswip; /usr/bin/make install)
mkdir -p /tmp/B.HL3cQ1/BUILD/tmp/Yap-6.2.2-root-builder/usr/include/Yap
/usr/bin/install -c ./H/TermExt.h ./H/Atoms.h ./H/Tags_32bits.h ./H/Tags_32Ops.h ./H/Tags_32LowTag.h ./H/Tags_64bits.h ./H/Tags_24bits.h ./H/sshift.h ./H/Yap.h ./H/Yatom.h ./H/YapHeap.h ./H/Regs.h ./H/Yapproto.h ./H/absmi.h ./H/alloc.h ./H/amidefs.h ./H/amiops.h ./H/arrays.h ./H/arith2.h ./H/attvar.h ./H/clause.h ./H/compile.h ./H/corout.h ./H/dlmalloc.h ./H/dglobals.h ./H/dhstruct.h ./H/eval.h ./H/heapgc.h ./H/hglobals.h ./H/hstruct.h ./H/iglobals.h ./H/ihstruct.h ./H/index.h ./H/iopreds.h ./H/iswiatoms.h ./H/rclause.h ./H/rglobals.h ./H/rheap.h ./H/rhstruct.h ./H/threads.h ./H/tracer.h ./H/trim_trail.h ./H/yapio.h ./BEAM/eam.h ./BEAM/eamamasm.h ./OPTYap/opt.config.h ./OPTYap/opt.proto.h ./OPTYap/opt.structs.h ./OPTYap/opt.macros.h ./OPTYap/or.macros.h ./OPTYap/or.sbaamiops.h ./OPTYap/or.sbaunify.h ./OPTYap/tab.structs.h ./OPTYap/locks_x86.h ./OPTYap/locks_sparc.h ./OPTYap/locks_mips.h ./OPTYap/locks_mips_funcs.h ./OPTYap/locks_alpha.h ./OPTYap/locks_alpha_funcs.h ./OPTYap/locks_pthread.h ./H/cut_c.h ./H/iatoms.h ./H/ratoms.h ./H/tatoms.h ./library/dialect/swi/fli/swi.h ./MYDDAS/myddas.h ./MYDDAS/myddas_structs.h ./MYDDAS/myddas_statistics.h ./MYDDAS/myddas_statistics_structs.h ./MYDDAS/myddas_wkb.h ./MYDDAS/myddas_wkb2prolog.h /tmp/B.HL3cQ1/BUILD/tmp/Yap-6.2.2-root-builder/usr/include/Yap
for h in ./include/c_interface.h ./include/clause_list.h ./include/dswiatoms.h ./include/udi.h ./include/rtree_udi.h ./include/yap_structs.h ./include/YapInterface.h ./include/SWI-Prolog.h ./include/SWI-Stream.h; do /usr/bin/install -c $h /tmp/B.HL3cQ1/BUILD/tmp/Yap-6.2.2-root-builder/usr/include/Yap; done
/usr/bin/install -c config.h /tmp/B.HL3cQ1/BUILD/tmp/Yap-6.2.2-root-builder/usr/include/Yap/config.h
/usr/bin/install -c parms.h /tmp/B.HL3cQ1/BUILD/tmp/Yap-6.2.2-root-builder/usr/include/Yap/parms.h
make[1]: Entering directory '/tmp/B.HL3cQ1/BUILD/yap-6.2.2/packages/ProbLog'
mkdir -p /tmp/B.HL3cQ1/BUILD/tmp/Yap-6.2.2-root-builder/usr/share/Yap
mkdir -p /tmp/B.HL3cQ1/BUILD/tmp/Yap-6.2.2-root-builder/usr/share/Yap/problog
mkdir -p /tmp/B.HL3cQ1/BUILD/tmp/Yap-6.2.2-root-builder/usr/share/Yap/problog_examples
for p in ./problog.yap ./problog_lfi.yap ./dtproblog.yap ./aproblog.yap ./problog_learning.yap; do /usr/bin/install -c -m 644 $p /tmp/B.HL3cQ1/BUILD/tmp/Yap-6.2.2-root-builder/usr/share/Yap; done
for p in ./problog/extlists.yap ./problog/flags.yap ./problog/gflags.yap ./problog/grounder.yap ./problog/hash_table.yap ./problog/intervals.yap ./problog/logger.yap ./problog/mc_DNF_sampling.yap ./problog/os.yap ./problog/print.yap ./problog/sampling.yap ./problog/tabling.yap ./problog/timer.yap ./problog/ptree.yap ./problog/variable_elimination.yap ./problog/print_learning.yap ./problog/utils_learning.yap ./problog/version_control.yap ./problog/nestedtries.yap ./problog/utils.yap ./problog/ad_converter.yap ./problog/termhandling.yap ./problog/completion.yap ./problog/discrete.yap ./problog/bdd.yap ./problog/variables.yap; do /usr/bin/install -c -m 644 $p /tmp/B.HL3cQ1/BUILD/tmp/Yap-6.2.2-root-builder/usr/share/Yap/problog; done
for p in ./problog_examples/alarm.pl ./problog_examples/graph.pl ./problog_examples/graph_tabled.pl ./problog_examples/learn_graph.pl ./problog_examples/office.pl ./problog_examples/viralmarketing.pl ./problog_examples/aProbLog_examples.pl ./problog_examples/viralmarketing_tabled.pl; do /usr/bin/install -c -m 644 $p /tmp/B.HL3cQ1/BUILD/tmp/Yap-6.2.2-root-builder/usr/share/Yap/problog_examples; done
make[1]: Leaving directory '/tmp/B.HL3cQ1/BUILD/yap-6.2.2/packages/ProbLog'
(cd packages/chr ; /usr/bin/make install)
make[1]: Entering directory '/tmp/B.HL3cQ1/BUILD/yap-6.2.2/packages/chr'
YAPSHAREDIR=/tmp/B.HL3cQ1/BUILD/tmp/Yap-6.2.2-root-builder/usr/share/Yap YAPLIBDIR=/tmp/B.HL3cQ1/BUILD/tmp/Yap-6.2.2-root-builder/usr/lib/Yap /tmp/B.HL3cQ1/BUILD/tmp/Yap-6.2.2-root-builder/usr/bin/yap /tmp/B.HL3cQ1/BUILD/tmp/Yap-6.2.2-root-builder/usr/lib/Yap/startup.yss -q -f ./chr_swi_bootstrap.pl \
	      -g "chr_compile_step1('chr_translate_bootstrap1.chr','chr_translate_bootstrap1.pl'),halt" \
	      -t 'halt(1)'
dlopen of /tmp/B.HL3cQ1/BUILD/tmp/Yap-6.2.2-root-builder/usr/lib/Yap/pl-tai.so failed with error libplstream.so: cannot open shared object file: No such file or directory
:- system:load_foreign_files([pl-tai],[],install) failed.
YAPSHAREDIR=/tmp/B.HL3cQ1/BUILD/tmp/Yap-6.2.2-root-builder/usr/share/Yap YAPLIBDIR=/tmp/B.HL3cQ1/BUILD/tmp/Yap-6.2.2-root-builder/usr/lib/Yap /tmp/B.HL3cQ1/BUILD/tmp/Yap-6.2.2-root-builder/usr/bin/yap /tmp/B.HL3cQ1/BUILD/tmp/Yap-6.2.2-root-builder/usr/lib/Yap/startup.yss -q -f ./chr_swi_bootstrap.pl \
	      -g "chr_compile_step2('chr_translate_bootstrap1.chr','chr_translate_bootstrap1.pl'),halt" \
	      -t 'halt(1)'
dlopen of /tmp/B.HL3cQ1/BUILD/tmp/Yap-6.2.2-root-builder/usr/lib/Yap/pl-tai.so failed with error libplstream.so: cannot open shared object file: No such file or directory
:- system:load_foreign_files([pl-tai],[],install) failed.
make[1]: Leaving directory '/tmp/B.HL3cQ1/BUILD/yap-6.2.2/packages/chr'
make[1]: Entering directory '/tmp/B.HL3cQ1/BUILD/yap-6.2.2/packages/chr'
YAPSHAREDIR=/tmp/B.HL3cQ1/BUILD/tmp/Yap-6.2.2-root-builder/usr/share/Yap YAPLIBDIR=/tmp/B.HL3cQ1/BUILD/tmp/Yap-6.2.2-root-builder/usr/lib/Yap /tmp/B.HL3cQ1/BUILD/tmp/Yap-6.2.2-root-builder/usr/bin/yap /tmp/B.HL3cQ1/BUILD/tmp/Yap-6.2.2-root-builder/usr/lib/Yap/startup.yss -q -f ./chr_swi_bootstrap.pl \
	      -g "chr_compile_step2('chr_translate_bootstrap2.chr','chr_translate_bootstrap2.pl'),halt" \
	      -t 'halt(1)'
dlopen of /tmp/B.HL3cQ1/BUILD/tmp/Yap-6.2.2-root-builder/usr/lib/Yap/pl-tai.so failed with error libplstream.so: cannot open shared object file: No such file or directory
:- system:load_foreign_files([pl-tai],[],install) failed.
%
%
% YAP OOOPS: tried to access illegal address 0x6a281010!!!!.
%
%
2203KB of Code Space (0x10000000--0x10226db0)
%
% PC: chr_translate_bootstrap1:attached/2__0/3 at clause 1 
%   Continuation: chr_translate_bootstrap1:attached/2__0/3 at clause 1 
%    817KB of Global Stack (0x103ea000--0x104b6544)
%    0KB of Local Stack (0x10515d74--0x10516000)
%    0KB of Trail (0x10516004--0x10516070)
%    Performed 0 garbage collections
% All Active Calls and
%         Goals With Alternatives Open  (Global In Use--Local In Use)
%
%         chr_runtime:sbag_member/3 (817KB--0KB)
%  chr_translate_bootstrap1:attached/2__0/3 at clause 1 
%  chr_translate_bootstrap1:check_attachment_heads2/3 at clause 2 
%  chr_translate_bootstrap1:check_attachments_/1 at clause 2 
%  chr_translate_bootstrap1:chr_translate/2 at clause 1 
%  chr:chr_compile/3 at clause 1 
%  prolog:$call/4 at clause 3 
%  prolog:once/1 at clause 1 
%  prolog:$do_yes_no/2 at clause 2 
%  prolog:$yes_no/2 at clause 1 
%         prolog:$catch/3 (514KB--0KB)
%  prolog:$system_catch/4 at clause 1 
%  prolog:$startup_goals/0 at clause 2 
%  prolog:$init_system/0 at clause 1 
%  prolog:$live/0 at clause 1 
%  meta-call

   Exiting ....
make[1]: *** [Makefile:111: chr_translate_bootstrap2.pl] Error 1
make[1]: Leaving directory '/tmp/B.HL3cQ1/BUILD/yap-6.2.2/packages/chr'
make: *** [Makefile:645: install_data] Error 2
error: Bad exit status from /tmp/B.HL3cQ1/BUILD/tmp/rpm-tmp.73813 (%install)


RPM build errors:
    Bad exit status from /tmp/B.HL3cQ1/BUILD/tmp/rpm-tmp.73813 (%install)
ended at: Tue Mar  6 05:02:51 2018, done in 0:01:00.498934
error: No files produced.
+ chmod -R u+rwX /tmp/B.HL3cQ1/BUILD
+ rm -rf /tmp/B.HL3cQ1/tmp /tmp/B.HL3cQ1/BUILD
+ rm -rf /tmp/B.HL3cQ1
Begin-PLD-Builder-Info
Build-Time: user:93.47s sys:6.44s real:64.94s (faults io:1 non-io:2445128)

End-PLD-Builder-Info
[Back to list of logs] [View rpm -qa of builder]