FailedOk

th/SRPMS[OK]
th/x32[OK]
th/i686[OK]
th/x86_64[OK]

ac/SRPMS[OK]
ac/i386[OK]
ac/i586[OK]
ac/i686[OK]
ac/alpha[OK]
ac/amd64[OK]
ac/athlon[OK]
ac/ppc[OK]
ac/sparc[OK]
ac/sparc64[OK]

Advanced Search
main()
Powered by PLD Linux
(c) 2002-2018 PLD Team
$Revision: 1.37 $
Powered by computron.
Your IP: 54.90.109.231

apache-mod_clamav a1246949-e718-4fd0-93b4-846874962600

Status:Failed
Source URL:ftp://buildlogs.pld-linux.org/th/i686/FAIL/apache-mod_clamav,a1246949-e718-4fd0-93b4-846874962600.bz2
text/plain URL:View!
full text:View!
rpm -qa of builder:View!
Date:2018/12/06 21:44:07
Runtime:0:00:09.899255

Toc:

  • error 1
  • rpm: error: Failed build dependencies:
  • error 2
  • rpm: error: Failed build dependencies:
  • prep
  • Executing(%prep): /bin/sh -e /tmp/B.5GSnlD/BUILD/tmp/rpm-tmp.38707
  • build
  • Executing(%build): /bin/sh -e /tmp/B.5GSnlD/BUILD/tmp/rpm-tmp.38707
  • error 3
  • filter.c:137:7: error: 'CL_CLEAN' undeclared (first use in this function); did you mean 'EUCLEAN'?
  • error 4
  • filter.c:137:18: error: 'CL_VIRUS' undeclared (first use in this function); did you mean 'S_IRUSR'?
  • error 5
  • filter.c:146:34: error: 'CL_SCAN_ARCHIVE' undeclared (first use in this function)
  • error 6
  • filter.c:482:9: error: 'CL_VIRUS' undeclared (first use in this function); did you mean 'S_IRUSR'?
  • error 7
  • filter.c:811:6: error: 'CL_VIRUS' undeclared (first use in this function); did you mean 'S_IRUSR'?
  • error 8
  • make[1]: *** [Makefile:537: mod_clamav_la-filter.lo] Error 1
  • error 9
  • init.c:22:29: error: 'CL_INIT_DEFAULT' undeclared (first use in this function); did you mean 'APR_LOCK_DEFAULT'?
  • error 10
  • init.c:38:51: error: 'CL_ENGINE_MAX_FILES' undeclared (first use in this function); did you mean 'CLONE_FILES'?
  • error 11
  • init.c:40:51: error: 'CL_ENGINE_MAX_FILESIZE' undeclared (first use in this function)
  • error 12
  • init.c:42:51: error: 'CL_ENGINE_MAX_RECURSION' undeclared (first use in this function)
  • error 13
  • init.c:52:10: error: 'CL_DB_STDOPT' undeclared (first use in this function); did you mean 'CLD_STOPPED'?
  • error 14
  • make[1]: *** [Makefile:530: mod_clamav_la-init.lo] Error 1
  • error 15
  • error: Bad exit status from /tmp/B.5GSnlD/BUILD/tmp/rpm-tmp.38707 (%build)
  • error 16
  • RPM build errors:
  • error 17
  • error: No files produced.

Content:

checking if we should skip the build
started at: Thu Dec  6 21:43:27 2018
killing old processes on a builder
sending signal 9 to pid -1
Killed
cleaning up /tmp
fetching https://srcbuilder.pld-linux.org/th//srpms/a1246949-e718-4fd0-93b4-846874962600/apache-mod_clamav-0.23-2.src.rpm
fetched 354655 bytes, 458.9 K/s
installing srpm: apache-mod_clamav-0.23-2.src.rpm
+ install -d /tmp/B.5GSnlD/BUILD /tmp/B.5GSnlD/RPMS
+ LC_ALL=en_US.UTF-8
+ rpm -qp --changelog apache-mod_clamav-0.23-2.src.rpm
* Thu Dec 06 2018 PLD Linux Team <feedback@pld-linux.org>
- For complete changelog see: http://git.pld-linux.org/?p=packages/apache-mod_clamav.git;a=log;h=master
+ rpm -Uhv --nodeps --define '_topdir /tmp/B.5GSnlD' --define '_specdir %{_topdir}' --define '_sourcedir %{_specdir}' --define '_rpmdir %{_topdir}/RPMS' --define '_builddir %{_topdir}/BUILD' apache-mod_clamav-0.23-2.src.rpm Preparing... ################################################## apache-mod_clamav ################################################## + rm -f apache-mod_clamav-0.23-2.src.rpm + install -m 700 -d /tmp/B.5GSnlD/BUILD/tmp + TMPDIR=/tmp/B.5GSnlD/BUILD/tmp + exec nice -n 0 rpmbuild -bp --short-circuit --nodeps --define '_topdir /tmp/B.5GSnlD' --define '_specdir %{_topdir}' --define '_sourcedir %{_specdir}' --define '_rpmdir %{_topdir}/RPMS' --define '_builddir %{_topdir}/BUILD' --target i686-pld-linux --define 'prep exit 0' /tmp/B.5GSnlD/apache-mod_clamav.spec Building target platforms: i686-pld-linux checking BuildConflict-ing packages no BuildConflicts found checking BR rpm: error: Failed build dependencies: rpm: clamav-devel is needed by apache-mod_clamav-0.23-2.src rpm: Building target platforms: i686-pld-linux updating poldek cache... ready is up to date Retrieving th::packages.ndir.md... th is up to date Retrieving th::packages.ndir.md... th is up to date Retrieving th-ready::packages.ndir.md... th-ready is up to date Retrieving th-ready::packages.ndir.md... th-ready is up to date Retrieving th-test::packages.ndir.md... Retrieving th-test::packages.ndir.diff.toc.gz... Retrieving diff::packages.ndir.2018.12.05-19.48.02.gz... ..............................done Retrieving diff::packages.ndir.dscr.2018.12.05-19.48.02.gz... Loading [pndir]th-test... Applying packages.ndir.2018.12.05-19.48.02.gz... Retrieving diff::packages.ndir.2018.12.05-20.02.01.gz... Retrieving diff::packages.ndir.dscr.2018.12.05-20.02.01.gz... Applying packages.ndir.2018.12.05-20.02.01.gz... Retrieving diff::packages.ndir.2018.12.05-20.05.02.gz... Retrieving diff::packages.ndir.dscr.2018.12.05-20.05.02.gz... Applying packages.ndir.2018.12.05-20.05.02.gz... Retrieving diff::packages.ndir.2018.12.05-20.10.02.gz... Retrieving diff::packages.ndir.dscr.2018.12.05-20.10.02.gz... Applying packages.ndir.2018.12.05-20.10.02.gz... Retrieving diff::packages.ndir.2018.12.05-20.14.01.gz... Retrieving diff::packages.ndir.dscr.2018.12.05-20.14.01.gz... Applying packages.ndir.2018.12.05-20.14.01.gz... Retrieving diff::packages.ndir.2018.12.06-15.02.01.gz... ..............................done Retrieving diff::packages.ndir.dscr.2018.12.06-15.02.01.gz... ..............................done Applying packages.ndir.2018.12.06-15.02.01.gz... Retrieving diff::packages.ndir.2018.12.06-15.18.02.gz... ..............................done Retrieving diff::packages.ndir.dscr.2018.12.06-15.18.02.gz... ..............................done Applying packages.ndir.2018.12.06-15.18.02.gz... Writing /root/tmp/poldek-cache-root/[...]/packages.ndir.gz... Retrieving th-test::packages.ndir.md... Retrieving th-test::packages.ndir.diff.toc.gz... Retrieving diff::packages.ndir.2018.12.05-19.42.02.gz... ..............................done Retrieving diff::packages.ndir.dscr.2018.12.05-19.42.02.gz... Loading [pndir]th-test... Applying packages.ndir.2018.12.05-19.42.02.gz... Retrieving diff::packages.ndir.2018.12.05-20.07.01.gz... Retrieving diff::packages.ndir.dscr.2018.12.05-20.07.01.gz... Applying packages.ndir.2018.12.05-20.07.01.gz... Retrieving diff::packages.ndir.2018.12.05-20.08.01.gz... Retrieving diff::packages.ndir.dscr.2018.12.05-20.08.01.gz... Applying packages.ndir.2018.12.05-20.08.01.gz... Retrieving diff::packages.ndir.2018.12.05-20.19.02.gz... Retrieving diff::packages.ndir.dscr.2018.12.05-20.19.02.gz... Applying packages.ndir.2018.12.05-20.19.02.gz... Retrieving diff::packages.ndir.2018.12.05-20.21.02.gz... Retrieving diff::packages.ndir.dscr.2018.12.05-20.21.02.gz... Applying packages.ndir.2018.12.05-20.21.02.gz... Retrieving diff::packages.ndir.2018.12.05-20.22.01.gz... Applying packages.ndir.2018.12.05-20.22.01.gz... Retrieving diff::packages.ndir.2018.12.06-02.47.02.gz... ..............................done Retrieving diff::packages.ndir.dscr.2018.12.06-02.47.02.gz... Applying packages.ndir.2018.12.06-02.47.02.gz... Retrieving diff::packages.ndir.2018.12.06-15.18.01.gz... ..............................done Retrieving diff::packages.ndir.dscr.2018.12.06-15.18.01.gz... Applying packages.ndir.2018.12.06-15.18.01.gz... Writing /root/tmp/poldek-cache-root/[...]/packages.ndir.gz... checking conflicting packages in BRed packages poldek: Loading [pndir]ready... poldek: Loading [pndir]th-test... poldek: Loading [pndir]th-test... poldek: Loading [pndir]th-ready... poldek: Loading [pndir]th-ready... poldek: Loading [pndir]th... poldek: Loading [pndir]th... poldek: 28564 packages read poldek: Removed 1443 duplicate packages from available set poldek: Processing dependencies... poldek: clamav-devel-0.101.0-1.i686 marks clamav-libs-0.101.0-1.i686 (cap clamav-libs = 0.101.0-1) poldek: There are 2 packages to install (1 marked by dependencies): poldek: I clamav-devel-0.101.0-1.i686 poldek: D clamav-libs-0.101.0-1.i686 poldek: This operation will use 11.1MB of disk space. poldek: Need to get 3.2MB of archives. poldek: Executing pm-command.sh --upgrade -vh --test --root / --define _check_dirname_deps 1... poldek: Preparing... ################################################## no conflicts found checking BR rpm: error: Failed build dependencies: rpm: clamav-devel is needed by apache-mod_clamav-0.23-2.src rpm: Building target platforms: i686-pld-linux installing BR: clamav\-devel + poldek --noask --caplookup -Q -v '--ignore=hhvm-*' '--ignore=php4-*' '--ignore=php52-*' '--ignore=php54-*' '--ignore=php55-*' '--ignore=php56-*' '--ignore=php70-*' '--ignore=php71-*' '--ignore=php72-*' '--ignore=php73-*' --upgrade clamav-devel Loading [pndir]ready... Loading [pndir]th-test... Loading [pndir]th-test... Loading [pndir]th-ready... Loading [pndir]th-ready... Loading [pndir]th... Loading [pndir]th... 28564 packages read Removed 1443 duplicate packages from available set Processing dependencies... clamav-devel-0.101.0-1.i686 marks clamav-libs-0.101.0-1.i686 (cap clamav-libs = 0.101.0-1) There are 2 packages to install (1 marked by dependencies): I clamav-devel-0.101.0-1.i686 D clamav-libs-0.101.0-1.i686 This operation will use 11.1MB of disk space. Need to get 3.2MB of archives. Executing pm-command.sh --upgrade -vh --root / --define _check_dirname_deps 1... Preparing... ################################################## clamav-libs ################################################## clamav-devel ################################################## building RPM using: set -ex; : build-id: a1246949-e718-4fd0-93b4-846874962600; TMPDIR=/tmp/B.5GSnlD/BUILD/tmp exec nice -n 0 rpmbuild -bb --define '_smp_mflags -j9' --define '_make_opts -Otarget' --define '_pld_builder 1' --define '_topdir /tmp/B.5GSnlD' --define '_specdir %{_topdir}' --define '_sourcedir %{_specdir}' --define '_rpmdir %{_topdir}/RPMS' --define '_builddir %{_topdir}/BUILD' --target i686-pld-linux /tmp/B.5GSnlD/apache-mod_clamav.spec + : build-id: a1246949-e718-4fd0-93b4-846874962600 + TMPDIR=/tmp/B.5GSnlD/BUILD/tmp + exec nice -n 0 rpmbuild -bb --define '_smp_mflags -j9' --define '_make_opts -Otarget' --define '_pld_builder 1' --define '_topdir /tmp/B.5GSnlD' --define '_specdir %{_topdir}' --define '_sourcedir %{_specdir}' --define '_rpmdir %{_topdir}/RPMS' --define '_builddir %{_topdir}/BUILD' --target i686-pld-linux /tmp/B.5GSnlD/apache-mod_clamav.spec Building target platforms: i686-pld-linux Executing(%prep): /bin/sh -e /tmp/B.5GSnlD/BUILD/tmp/rpm-tmp.38707 + umask 022 + cd /tmp/B.5GSnlD/BUILD + cd /tmp/B.5GSnlD/BUILD + rm -rf mod_clamav-0.23 + /usr/bin/gzip -dc /tmp/B.5GSnlD/mod_clamav-0.23.tar.gz + /bin/tar -xf - + STATUS=0 + '[' 0 -ne 0 ']' + cd mod_clamav-0.23 + /bin/id -u + '[' 1001 '=' 0 ']' + /bin/id -u + '[' 1001 '=' 0 ']' + /bin/chmod -Rf a+rX,u+w,g-w,o-w . + exit 0 Executing(%build): /bin/sh -e /tmp/B.5GSnlD/BUILD/tmp/rpm-tmp.38707 TMP=/home/users/builder/tmp HOME=/home/users/builder PATH=/usr/local/bin:/usr/bin:/bin:/home/users/builder/bin TMPDIR=/tmp/B.5GSnlD/BUILD/tmp + umask 022 + cd /tmp/B.5GSnlD/BUILD + cd mod_clamav-0.23 + libtoolize --copy --force --install libtoolize: putting auxiliary files in '.'. libtoolize: copying file './config.guess' libtoolize: copying file './config.sub' libtoolize: copying file './install-sh' libtoolize: copying file './ltmain.sh' libtoolize: You should add the contents of the following files to 'aclocal.m4': libtoolize: '/usr/share/aclocal/libtool.m4' libtoolize: '/usr/share/aclocal/ltoptions.m4' libtoolize: '/usr/share/aclocal/ltsugar.m4' libtoolize: '/usr/share/aclocal/ltversion.m4' libtoolize: '/usr/share/aclocal/lt~obsolete.m4' libtoolize: Consider adding 'AC_CONFIG_MACRO_DIRS([m4])' to configure.in, libtoolize: and rerunning libtoolize and aclocal. libtoolize: Consider adding '-I m4' to ACLOCAL_AMFLAGS in Makefile.am. + aclocal aclocal: warning: autoconf input should be named 'configure.ac', not 'configure.in' + autoconf + automake -a -c -f --foreign automake: warning: autoconf input should be named 'configure.ac', not 'configure.in' configure.in:10: warning: AM_INIT_AUTOMAKE: two- and three-arguments forms are deprecated. For more info, see: configure.in:10: https://www.gnu.org/software/automake/manual/automake.html#Modernize-AM_005fINIT_005fAUTOMAKE-invocation configure.in:58: installing './compile' configure.in:10: installing './missing' automake: warning: autoconf input should be named 'configure.ac', not 'configure.in' Makefile.am: installing './depcomp' + /usr/bin/apr-1-config --includedir + /usr/bin/apu-1-config --includedir + CPPFLAGS='-I /usr/include/apr -I /usr/include/apr-util' + ./configure 'LDFLAGS=-Wl,--as-needed -Wl,--no-copy-dt-needed-entries -Wl,-z,relro -Wl,-z,combreloc ' 'CFLAGS=-O2 -fwrapv -pipe -Wformat -Werror=format-security -gdwarf-4 -fno-debug-types-section -fvar-tracking-assignments -g2 -Wp,-D_FORTIFY_SOURCE=2 -fstack-protector-strong --param=ssp-buffer-size=4 -fomit-frame-pointer -march=i686 -fasynchronous-unwind-tables -mtune=pentium4 -gdwarf-4 -fno-debug-types-section -fvar-tracking-assignments -g2 ' 'CXXFLAGS=-O2 -fwrapv -pipe -Wformat -Werror=format-security -gdwarf-4 -fno-debug-types-section -fvar-tracking-assignments -g2 -Wp,-D_FORTIFY_SOURCE=2 -fstack-protector-strong --param=ssp-buffer-size=4 -fomit-frame-pointer -march=i686 -fasynchronous-unwind-tables -mtune=pentium4 -gdwarf-4 -fno-debug-types-section -fvar-tracking-assignments -g2 ' 'FFLAGS=-O2 -fwrapv -pipe -Wformat -Werror=format-security -gdwarf-4 -fno-debug-types-section -fvar-tracking-assignments -g2 -Wp,-D_FORTIFY_SOURCE=2 -fstack-protector-strong --param=ssp-buffer-size=4 -fomit-frame-pointer -march=i686 -fasynchronous-unwind-tables -mtune=pentium4 -gdwarf-4 -fno-debug-types-section -fvar-tracking-assignments -g2 ' 'FCFLAGS=-O2 -fwrapv -pipe -Wformat -Werror=format-security -gdwarf-4 -fno-debug-types-section -fvar-tracking-assignments -g2 -Wp,-D_FORTIFY_SOURCE=2 -fstack-protector-strong --param=ssp-buffer-size=4 -fomit-frame-pointer -march=i686 -fasynchronous-unwind-tables -mtune=pentium4 -gdwarf-4 -fno-debug-types-section -fvar-tracking-assignments -g2 ' 'CPPFLAGS=-I /usr/include/apr -I /usr/include/apr-util' 'CC=i686-pld-linux-gcc' 'CXX=i686-pld-linux-g++' '--host=i686-pld-linux' '--build=i686-pld-linux' '--prefix=/usr' '--exec-prefix=/usr' '--bindir=/usr/bin' '--sbindir=/usr/sbin' '--sysconfdir=/etc/httpd/conf.d' '--datadir=/usr/share' '--includedir=/usr/include' '--libdir=/usr/lib' '--libexecdir=/usr/libexec' '--localstatedir=/var' '--sharedstatedir=/var/lib' '--mandir=/usr/share/man' '--infodir=/usr/share/info' '--x-libraries=/usr/lib' '--with-apxs=/usr/sbin/apxs' checking for a BSD-compatible install... /usr/bin/install -c checking whether build environment is sane... yes checking for a thread-safe mkdir -p... /bin/mkdir -p checking for mawk... mawk checking whether make sets $(MAKE)... yes checking whether make supports nested variables... yes checking for APXS tool... using /usr/sbin/apxs checking for apr-1-config tool... checking for i686-pld-linux-gcc... i686-pld-linux-gcc checking whether the C compiler works... yes checking for C compiler default output file name... a.out checking for suffix of executables... checking whether we are cross compiling... no checking for suffix of object files... o checking whether we are using the GNU C compiler... yes checking whether i686-pld-linux-gcc accepts -g... yes checking for i686-pld-linux-gcc option to accept ISO C89... none needed checking whether i686-pld-linux-gcc understands -c and -o together... yes checking whether make supports the include directive... yes (GNU style) checking dependency style of i686-pld-linux-gcc... gcc3 checking build system type... i686-pld-linux-gnu checking host system type... i686-pld-linux-gnu checking how to print strings... print -r checking for a sed that does not truncate output... /bin/sed checking for grep that handles long lines and -e... /bin/grep checking for egrep... /bin/grep -E checking for fgrep... /bin/grep -F checking for ld used by i686-pld-linux-gcc... /usr/bin/ld checking if the linker (/usr/bin/ld) is GNU ld... yes checking for BSD- or MS-compatible name lister (nm)... /usr/bin/nm -B checking the name lister (/usr/bin/nm -B) interface... BSD nm checking whether ln -s works... yes checking the maximum length of command line arguments... 1572864 checking how to convert i686-pld-linux-gnu file names to i686-pld-linux-gnu format... func_convert_file_noop checking how to convert i686-pld-linux-gnu file names to toolchain format... func_convert_file_noop checking for /usr/bin/ld option to reload object files... -r checking for i686-pld-linux-objdump... no checking for objdump... objdump checking how to recognize dependent libraries... pass_all checking for i686-pld-linux-dlltool... no checking for dlltool... no checking how to associate runtime and link libraries... print -r -- checking for i686-pld-linux-ar... no checking for ar... ar checking for archiver @FILE support... @ checking for i686-pld-linux-strip... no checking for strip... strip checking for i686-pld-linux-ranlib... no checking for ranlib... ranlib checking command to parse /usr/bin/nm -B output from i686-pld-linux-gcc object... ok checking for sysroot... no checking for a working dd... /bin/dd checking how to truncate binary pipes... /bin/dd bs=4096 count=1 checking for i686-pld-linux-mt... no checking for mt... no checking if : is a manifest tool... no checking how to run the C preprocessor... i686-pld-linux-gcc -E checking for ANSI C header files... yes checking for sys/types.h... yes checking for sys/stat.h... yes checking for stdlib.h... yes checking for string.h... yes checking for memory.h... yes checking for strings.h... yes checking for inttypes.h... yes checking for stdint.h... yes checking for unistd.h... yes checking for dlfcn.h... yes checking for objdir... .libs checking if i686-pld-linux-gcc supports -fno-rtti -fno-exceptions... no checking for i686-pld-linux-gcc option to produce PIC... -fPIC -DPIC checking if i686-pld-linux-gcc PIC flag -fPIC -DPIC works... yes checking if i686-pld-linux-gcc static flag -static works... yes checking if i686-pld-linux-gcc supports -c -o file.o... yes checking if i686-pld-linux-gcc supports -c -o file.o... (cached) yes checking whether the i686-pld-linux-gcc linker (/usr/bin/ld) supports shared libraries... yes checking whether -lc should be explicitly linked in... no checking dynamic linker characteristics... GNU/Linux ld.so checking how to hardcode library paths into programs... immediate checking whether stripping libraries is possible... yes checking if libtool supports shared libraries... yes checking whether to build shared libraries... yes checking whether to build static libraries... no checking for cl_scanfile in -lclamav... yes checking for mkstemp... yes checking alloca.h usability... yes checking alloca.h presence... yes checking for alloca.h... yes checking regex.h usability... yes checking regex.h presence... yes checking for regex.h... yes checking sys/time.h usability... yes checking sys/time.h presence... yes checking for sys/time.h... yes checking ctype.h usability... yes checking ctype.h presence... yes checking for ctype.h... yes checking sys/un.h usability... yes checking sys/un.h presence... yes checking for sys/un.h... yes checking sys/socket.h usability... yes checking sys/socket.h presence... yes checking for sys/socket.h... yes checking for string.h... (cached) yes checking errno.h usability... yes checking errno.h presence... yes checking for errno.h... yes checking fcntl.h usability... yes checking fcntl.h presence... yes checking for fcntl.h... yes checking clamav.h usability... no checking clamav.h presence... no checking for clamav.h... no checking arpa/inet.h usability... yes checking arpa/inet.h presence... yes checking for arpa/inet.h... yes checking netinet/in.h usability... yes checking netinet/in.h presence... yes checking for netinet/in.h... yes checking that generated files are newer than configure... done configure: creating ./config.status config.status: creating Makefile config.status: creating mod_clamav_version.h config.status: creating mod_clamav.html config.status: creating config.h config.status: executing depfiles commands config.status: executing libtool commands + /usr/bin/make -Otarget -j9 (CDPATH="${ZSH_VERSION+.}:" && cd . && /bin/sh /tmp/B.5GSnlD/BUILD/mod_clamav-0.23/missing autoheader) rm -f stamp-h1 touch config.h.in cd . && /bin/sh ./config.status config.h config.status: creating config.h /usr/bin/make all-am make[1]: Entering directory '/tmp/B.5GSnlD/BUILD/mod_clamav-0.23' /bin/sh ./libtool --tag=CC --mode=compile `/usr/sbin/apxs -q CC` -DHAVE_CONFIG_H -I. `apr-1-config --cppflags` `apr-1-config --includes` -I`/usr/sbin/apxs -q INCLUDEDIR` -I /usr/include/apr -I /usr/include/apr-util `apr-1-config --cflags` `/usr/sbin/apxs -q CFLAGS_SHLIB` -O2 -fwrapv -pipe -Wformat -Werror=format-security -gdwarf-4 -fno-debug-types-section -fvar-tracking-assignments -g2 -Wp,-D_FORTIFY_SOURCE=2 -fstack-protector-strong --param=ssp-buffer-size=4 -fomit-frame-pointer -march=i686 -fasynchronous-unwind-tables -mtune=pentium4 -gdwarf-4 -fno-debug-types-section -fvar-tracking-assignments -g2 -MT mod_clamav_la-mod_clamav.lo -MD -MP -MF .deps/mod_clamav_la-mod_clamav.Tpo -c -o mod_clamav_la-mod_clamav.lo `test -f 'mod_clamav.c' || echo './'`mod_clamav.c libtool: compile: i686-pld-linux-gcc -DHAVE_CONFIG_H -I. -DLINUX -D_REENTRANT -D_GNU_SOURCE -D_LARGEFILE64_SOURCE -I/usr/include/apr -I/usr/include/apache -I /usr/include/apr -I /usr/include/apr-util -pthread -O2 -fwrapv -pipe -Wformat -Werror=format-security -gdwarf-4 -fno-debug-types-section -fvar-tracking-assignments -g2 -Wp,-D_FORTIFY_SOURCE=2 -fstack-protector-strong --param=ssp-buffer-size=4 -fomit-frame-pointer -march=i686 -fasynchronous-unwind-tables -mtune=pentium4 -gdwarf-4 -fno-debug-types-section -fvar-tracking-assignments -g2 -MT mod_clamav_la-mod_clamav.lo -MD -MP -MF .deps/mod_clamav_la-mod_clamav.Tpo -c mod_clamav.c -fPIC -DPIC -o .libs/mod_clamav_la-mod_clamav.o mv -f .deps/mod_clamav_la-mod_clamav.Tpo .deps/mod_clamav_la-mod_clamav.Plo make[1]: Leaving directory '/tmp/B.5GSnlD/BUILD/mod_clamav-0.23' make[1]: Entering directory '/tmp/B.5GSnlD/BUILD/mod_clamav-0.23' /bin/sh ./libtool --tag=CC --mode=compile `/usr/sbin/apxs -q CC` -DHAVE_CONFIG_H -I. `apr-1-config --cppflags` `apr-1-config --includes` -I`/usr/sbin/apxs -q INCLUDEDIR` -I /usr/include/apr -I /usr/include/apr-util `apr-1-config --cflags` `/usr/sbin/apxs -q CFLAGS_SHLIB` -O2 -fwrapv -pipe -Wformat -Werror=format-security -gdwarf-4 -fno-debug-types-section -fvar-tracking-assignments -g2 -Wp,-D_FORTIFY_SOURCE=2 -fstack-protector-strong --param=ssp-buffer-size=4 -fomit-frame-pointer -march=i686 -fasynchronous-unwind-tables -mtune=pentium4 -gdwarf-4 -fno-debug-types-section -fvar-tracking-assignments -g2 -MT mod_clamav_la-shmem.lo -MD -MP -MF .deps/mod_clamav_la-shmem.Tpo -c -o mod_clamav_la-shmem.lo `test -f 'shmem.c' || echo './'`shmem.c libtool: compile: i686-pld-linux-gcc -DHAVE_CONFIG_H -I. -DLINUX -D_REENTRANT -D_GNU_SOURCE -D_LARGEFILE64_SOURCE -I/usr/include/apr -I/usr/include/apache -I /usr/include/apr -I /usr/include/apr-util -pthread -O2 -fwrapv -pipe -Wformat -Werror=format-security -gdwarf-4 -fno-debug-types-section -fvar-tracking-assignments -g2 -Wp,-D_FORTIFY_SOURCE=2 -fstack-protector-strong --param=ssp-buffer-size=4 -fomit-frame-pointer -march=i686 -fasynchronous-unwind-tables -mtune=pentium4 -gdwarf-4 -fno-debug-types-section -fvar-tracking-assignments -g2 -MT mod_clamav_la-shmem.lo -MD -MP -MF .deps/mod_clamav_la-shmem.Tpo -c shmem.c -fPIC -DPIC -o .libs/mod_clamav_la-shmem.o mv -f .deps/mod_clamav_la-shmem.Tpo .deps/mod_clamav_la-shmem.Plo make[1]: Leaving directory '/tmp/B.5GSnlD/BUILD/mod_clamav-0.23' make[1]: Entering directory '/tmp/B.5GSnlD/BUILD/mod_clamav-0.23' /bin/sh ./libtool --tag=CC --mode=compile `/usr/sbin/apxs -q CC` -DHAVE_CONFIG_H -I. `apr-1-config --cppflags` `apr-1-config --includes` -I`/usr/sbin/apxs -q INCLUDEDIR` -I /usr/include/apr -I /usr/include/apr-util `apr-1-config --cflags` `/usr/sbin/apxs -q CFLAGS_SHLIB` -O2 -fwrapv -pipe -Wformat -Werror=format-security -gdwarf-4 -fno-debug-types-section -fvar-tracking-assignments -g2 -Wp,-D_FORTIFY_SOURCE=2 -fstack-protector-strong --param=ssp-buffer-size=4 -fomit-frame-pointer -march=i686 -fasynchronous-unwind-tables -mtune=pentium4 -gdwarf-4 -fno-debug-types-section -fvar-tracking-assignments -g2 -MT mod_clamav_la-locking.lo -MD -MP -MF .deps/mod_clamav_la-locking.Tpo -c -o mod_clamav_la-locking.lo `test -f 'locking.c' || echo './'`locking.c libtool: compile: i686-pld-linux-gcc -DHAVE_CONFIG_H -I. -DLINUX -D_REENTRANT -D_GNU_SOURCE -D_LARGEFILE64_SOURCE -I/usr/include/apr -I/usr/include/apache -I /usr/include/apr -I /usr/include/apr-util -pthread -O2 -fwrapv -pipe -Wformat -Werror=format-security -gdwarf-4 -fno-debug-types-section -fvar-tracking-assignments -g2 -Wp,-D_FORTIFY_SOURCE=2 -fstack-protector-strong --param=ssp-buffer-size=4 -fomit-frame-pointer -march=i686 -fasynchronous-unwind-tables -mtune=pentium4 -gdwarf-4 -fno-debug-types-section -fvar-tracking-assignments -g2 -MT mod_clamav_la-locking.lo -MD -MP -MF .deps/mod_clamav_la-locking.Tpo -c locking.c -fPIC -DPIC -o .libs/mod_clamav_la-locking.o mv -f .deps/mod_clamav_la-locking.Tpo .deps/mod_clamav_la-locking.Plo make[1]: Leaving directory '/tmp/B.5GSnlD/BUILD/mod_clamav-0.23' make[1]: Entering directory '/tmp/B.5GSnlD/BUILD/mod_clamav-0.23' /bin/sh ./libtool --tag=CC --mode=compile `/usr/sbin/apxs -q CC` -DHAVE_CONFIG_H -I. `apr-1-config --cppflags` `apr-1-config --includes` -I`/usr/sbin/apxs -q INCLUDEDIR` -I /usr/include/apr -I /usr/include/apr-util `apr-1-config --cflags` `/usr/sbin/apxs -q CFLAGS_SHLIB` -O2 -fwrapv -pipe -Wformat -Werror=format-security -gdwarf-4 -fno-debug-types-section -fvar-tracking-assignments -g2 -Wp,-D_FORTIFY_SOURCE=2 -fstack-protector-strong --param=ssp-buffer-size=4 -fomit-frame-pointer -march=i686 -fasynchronous-unwind-tables -mtune=pentium4 -gdwarf-4 -fno-debug-types-section -fvar-tracking-assignments -g2 -MT mod_clamav_la-filter.lo -MD -MP -MF .deps/mod_clamav_la-filter.Tpo -c -o mod_clamav_la-filter.lo `test -f 'filter.c' || echo './'`filter.c libtool: compile: i686-pld-linux-gcc -DHAVE_CONFIG_H -I. -DLINUX -D_REENTRANT -D_GNU_SOURCE -D_LARGEFILE64_SOURCE -I/usr/include/apr -I/usr/include/apache -I /usr/include/apr -I /usr/include/apr-util -pthread -O2 -fwrapv -pipe -Wformat -Werror=format-security -gdwarf-4 -fno-debug-types-section -fvar-tracking-assignments -g2 -Wp,-D_FORTIFY_SOURCE=2 -fstack-protector-strong --param=ssp-buffer-size=4 -fomit-frame-pointer -march=i686 -fasynchronous-unwind-tables -mtune=pentium4 -gdwarf-4 -fno-debug-types-section -fvar-tracking-assignments -g2 -MT mod_clamav_la-filter.lo -MD -MP -MF .deps/mod_clamav_la-filter.Tpo -c filter.c -fPIC -DPIC -o .libs/mod_clamav_la-filter.o filter.c: In function 'mod_clamav_scanfile': filter.c:137:7: error: 'CL_CLEAN' undeclared (first use in this function); did you mean 'EUCLEAN'? ? CL_CLEAN : CL_VIRUS; ^~~~~~~~ EUCLEAN filter.c:137:7: note: each undeclared identifier is reported only once for each function it appears in filter.c:137:18: error: 'CL_VIRUS' undeclared (first use in this function); did you mean 'S_IRUSR'? ? CL_CLEAN : CL_VIRUS; ^~~~~~~~ S_IRUSR filter.c:145:9: warning: implicit declaration of function 'cl_scanfile'; did you mean 'flockfile'? [-Wimplicit-function-declaration] return cl_scanfile(ctx->filename, virname, (unsigned long *)len, ^~~~~~~~~~~ flockfile filter.c:146:34: error: 'CL_SCAN_ARCHIVE' undeclared (first use in this function) rec->common->local->engine, CL_SCAN_ARCHIVE); ^~~~~~~~~~~~~~~ filter.c: In function 'mod_clamav_check_file': filter.c:482:9: error: 'CL_VIRUS' undeclared (first use in this function); did you mean 'S_IRUSR'? if (CL_VIRUS == ret) { ^~~~~~~~ S_IRUSR filter.c: In function 'mod_clamav_filter': filter.c:811:6: error: 'CL_VIRUS' undeclared (first use in this function); did you mean 'S_IRUSR'? if (CL_VIRUS == mod_clamav_check_file(rec, f)) { ^~~~~~~~ S_IRUSR make[1]: *** [Makefile:537: mod_clamav_la-filter.lo] Error 1 make[1]: Leaving directory '/tmp/B.5GSnlD/BUILD/mod_clamav-0.23' make[1]: *** Waiting for unfinished jobs.... make[1]: Entering directory '/tmp/B.5GSnlD/BUILD/mod_clamav-0.23' /bin/sh ./libtool --tag=CC --mode=compile `/usr/sbin/apxs -q CC` -DHAVE_CONFIG_H -I. `apr-1-config --cppflags` `apr-1-config --includes` -I`/usr/sbin/apxs -q INCLUDEDIR` -I /usr/include/apr -I /usr/include/apr-util `apr-1-config --cflags` `/usr/sbin/apxs -q CFLAGS_SHLIB` -O2 -fwrapv -pipe -Wformat -Werror=format-security -gdwarf-4 -fno-debug-types-section -fvar-tracking-assignments -g2 -Wp,-D_FORTIFY_SOURCE=2 -fstack-protector-strong --param=ssp-buffer-size=4 -fomit-frame-pointer -march=i686 -fasynchronous-unwind-tables -mtune=pentium4 -gdwarf-4 -fno-debug-types-section -fvar-tracking-assignments -g2 -MT mod_clamav_la-init.lo -MD -MP -MF .deps/mod_clamav_la-init.Tpo -c -o mod_clamav_la-init.lo `test -f 'init.c' || echo './'`init.c libtool: compile: i686-pld-linux-gcc -DHAVE_CONFIG_H -I. -DLINUX -D_REENTRANT -D_GNU_SOURCE -D_LARGEFILE64_SOURCE -I/usr/include/apr -I/usr/include/apache -I /usr/include/apr -I /usr/include/apr-util -pthread -O2 -fwrapv -pipe -Wformat -Werror=format-security -gdwarf-4 -fno-debug-types-section -fvar-tracking-assignments -g2 -Wp,-D_FORTIFY_SOURCE=2 -fstack-protector-strong --param=ssp-buffer-size=4 -fomit-frame-pointer -march=i686 -fasynchronous-unwind-tables -mtune=pentium4 -gdwarf-4 -fno-debug-types-section -fvar-tracking-assignments -g2 -MT mod_clamav_la-init.lo -MD -MP -MF .deps/mod_clamav_la-init.Tpo -c init.c -fPIC -DPIC -o .libs/mod_clamav_la-init.o init.c: In function 'mod_clamav_init_local': init.c:22:21: warning: implicit declaration of function 'cl_init'; did you mean 'sem_init'? [-Wimplicit-function-declaration] if (0 != (ret = cl_init(CL_INIT_DEFAULT))) { ^~~~~~~ sem_init init.c:22:29: error: 'CL_INIT_DEFAULT' undeclared (first use in this function); did you mean 'APR_LOCK_DEFAULT'? if (0 != (ret = cl_init(CL_INIT_DEFAULT))) { ^~~~~~~~~~~~~~~ APR_LOCK_DEFAULT init.c:22:29: note: each undeclared identifier is reported only once for each function it appears in In file included from ./mod_clamav.h:21, from init.c:11: init.c:25:6: warning: implicit declaration of function 'cl_strerror'; did you mean 'strerror'? [-Wimplicit-function-declaration] cl_strerror(ret)); ^~~~~~~~~~~ /usr/include/apache/http_log.h:455:63: note: in definition of macro 'ap_log_rerror__' ap_log_rerror_(file, line, mi, level, status, r, __VA_ARGS__); \ ^~~~~~~~~~~ init.c:23:2: note: in expansion of macro 'ap_log_rerror' ap_log_rerror(APLOG_MARK, APLOG_ERR, 0, f->r, ^~~~~~~~~~~~~ init.c:24:6: warning: format '%s' expects argument of type 'char *', but argument 9 has type 'int' [-Wformat=] "[%d] cannot initialize clamav: %s", (int)getpid(), ^~~~~~~~~~~~~~~~~~~~~~~~~~~~~~~~~~~ cl_strerror(ret)); ~~~~~~~~~~~~~~~~ /usr/include/apache/http_log.h:455:63: note: in definition of macro 'ap_log_rerror__' ap_log_rerror_(file, line, mi, level, status, r, __VA_ARGS__); \ ^~~~~~~~~~~ init.c:23:2: note: in expansion of macro 'ap_log_rerror' ap_log_rerror(APLOG_MARK, APLOG_ERR, 0, f->r, ^~~~~~~~~~~~~ init.c:33:31: warning: implicit declaration of function 'cl_engine_new' [-Wimplicit-function-declaration] rec->common->local->engine = cl_engine_new(); ^~~~~~~~~~~~~ init.c:33:29: warning: assignment to 'struct cl_engine *' from 'int' makes pointer from integer without a cast [-Wint-conversion] rec->common->local->engine = cl_engine_new(); ^ init.c:38:5: warning: implicit declaration of function 'cl_engine_set_num' [-Wimplicit-function-declaration] cl_engine_set_num(rec->common->local->engine, CL_ENGINE_MAX_FILES, ^~~~~~~~~~~~~~~~~ init.c:38:51: error: 'CL_ENGINE_MAX_FILES' undeclared (first use in this function); did you mean 'CLONE_FILES'? cl_engine_set_num(rec->common->local->engine, CL_ENGINE_MAX_FILES, ^~~~~~~~~~~~~~~~~~~ CLONE_FILES init.c:40:51: error: 'CL_ENGINE_MAX_FILESIZE' undeclared (first use in this function) cl_engine_set_num(rec->common->local->engine, CL_ENGINE_MAX_FILESIZE, ^~~~~~~~~~~~~~~~~~~~~~ init.c:42:51: error: 'CL_ENGINE_MAX_RECURSION' undeclared (first use in this function) cl_engine_set_num(rec->common->local->engine, CL_ENGINE_MAX_RECURSION, ^~~~~~~~~~~~~~~~~~~~~~~ init.c:47:15: warning: implicit declaration of function 'cl_retdbdir'; did you mean 'readdir'? [-Wimplicit-function-declaration] rec->dbdir = cl_retdbdir(); ^~~~~~~~~~~ readdir init.c:47:13: warning: assignment to 'const char *' from 'int' makes pointer from integer without a cast [-Wint-conversion] rec->dbdir = cl_retdbdir(); ^ init.c:51:21: warning: implicit declaration of function 'cl_load' [-Wimplicit-function-declaration] if (0 != (ret = cl_load(rec->dbdir, rec->common->local->engine, ^~~~~~~ init.c:52:10: error: 'CL_DB_STDOPT' undeclared (first use in this function); did you mean 'CLD_STOPPED'? &signo, CL_DB_STDOPT))) { ^~~~~~~~~~~~ CLD_STOPPED In file included from ./mod_clamav.h:21, from init.c:11: init.c:54:6: warning: format '%s' expects argument of type 'char *', but argument 9 has type 'int' [-Wformat=] "[%d] cannot load clamav patterns: %s", (int)getpid(), ^~~~~~~~~~~~~~~~~~~~~~~~~~~~~~~~~~~~~~ cl_strerror(ret)); ~~~~~~~~~~~~~~~~ /usr/include/apache/http_log.h:455:63: note: in definition of macro 'ap_log_rerror__' ap_log_rerror_(file, line, mi, level, status, r, __VA_ARGS__); \ ^~~~~~~~~~~ init.c:53:2: note: in expansion of macro 'ap_log_rerror' ap_log_rerror(APLOG_MARK, APLOG_ERR, 0, f->r, ^~~~~~~~~~~~~ init.c: In function 'mod_clamav_engine_ready': init.c:166:6: warning: implicit declaration of function 'cl_engine_free' [-Wimplicit-function-declaration] cl_engine_free(rec->common->local->engine); ^~~~~~~~~~~~~~ make[1]: *** [Makefile:530: mod_clamav_la-init.lo] Error 1 make[1]: Leaving directory '/tmp/B.5GSnlD/BUILD/mod_clamav-0.23' make[1]: Entering directory '/tmp/B.5GSnlD/BUILD/mod_clamav-0.23' /bin/sh ./libtool --tag=CC --mode=compile `/usr/sbin/apxs -q CC` -DHAVE_CONFIG_H -I. `apr-1-config --cppflags` `apr-1-config --includes` -I`/usr/sbin/apxs -q INCLUDEDIR` -I /usr/include/apr -I /usr/include/apr-util `apr-1-config --cflags` `/usr/sbin/apxs -q CFLAGS_SHLIB` -O2 -fwrapv -pipe -Wformat -Werror=format-security -gdwarf-4 -fno-debug-types-section -fvar-tracking-assignments -g2 -Wp,-D_FORTIFY_SOURCE=2 -fstack-protector-strong --param=ssp-buffer-size=4 -fomit-frame-pointer -march=i686 -fasynchronous-unwind-tables -mtune=pentium4 -gdwarf-4 -fno-debug-types-section -fvar-tracking-assignments -g2 -MT mod_clamav_la-bypass.lo -MD -MP -MF .deps/mod_clamav_la-bypass.Tpo -c -o mod_clamav_la-bypass.lo `test -f 'bypass.c' || echo './'`bypass.c libtool: compile: i686-pld-linux-gcc -DHAVE_CONFIG_H -I. -DLINUX -D_REENTRANT -D_GNU_SOURCE -D_LARGEFILE64_SOURCE -I/usr/include/apr -I/usr/include/apache -I /usr/include/apr -I /usr/include/apr-util -pthread -O2 -fwrapv -pipe -Wformat -Werror=format-security -gdwarf-4 -fno-debug-types-section -fvar-tracking-assignments -g2 -Wp,-D_FORTIFY_SOURCE=2 -fstack-protector-strong --param=ssp-buffer-size=4 -fomit-frame-pointer -march=i686 -fasynchronous-unwind-tables -mtune=pentium4 -gdwarf-4 -fno-debug-types-section -fvar-tracking-assignments -g2 -MT mod_clamav_la-bypass.lo -MD -MP -MF .deps/mod_clamav_la-bypass.Tpo -c bypass.c -fPIC -DPIC -o .libs/mod_clamav_la-bypass.o mv -f .deps/mod_clamav_la-bypass.Tpo .deps/mod_clamav_la-bypass.Plo make[1]: Leaving directory '/tmp/B.5GSnlD/BUILD/mod_clamav-0.23' make[1]: Entering directory '/tmp/B.5GSnlD/BUILD/mod_clamav-0.23' /bin/sh ./libtool --tag=CC --mode=compile `/usr/sbin/apxs -q CC` -DHAVE_CONFIG_H -I. `apr-1-config --cppflags` `apr-1-config --includes` -I`/usr/sbin/apxs -q INCLUDEDIR` -I /usr/include/apr -I /usr/include/apr-util `apr-1-config --cflags` `/usr/sbin/apxs -q CFLAGS_SHLIB` -O2 -fwrapv -pipe -Wformat -Werror=format-security -gdwarf-4 -fno-debug-types-section -fvar-tracking-assignments -g2 -Wp,-D_FORTIFY_SOURCE=2 -fstack-protector-strong --param=ssp-buffer-size=4 -fomit-frame-pointer -march=i686 -fasynchronous-unwind-tables -mtune=pentium4 -gdwarf-4 -fno-debug-types-section -fvar-tracking-assignments -g2 -MT mod_clamav_la-config.lo -MD -MP -MF .deps/mod_clamav_la-config.Tpo -c -o mod_clamav_la-config.lo `test -f 'config.c' || echo './'`config.c libtool: compile: i686-pld-linux-gcc -DHAVE_CONFIG_H -I. -DLINUX -D_REENTRANT -D_GNU_SOURCE -D_LARGEFILE64_SOURCE -I/usr/include/apr -I/usr/include/apache -I /usr/include/apr -I /usr/include/apr-util -pthread -O2 -fwrapv -pipe -Wformat -Werror=format-security -gdwarf-4 -fno-debug-types-section -fvar-tracking-assignments -g2 -Wp,-D_FORTIFY_SOURCE=2 -fstack-protector-strong --param=ssp-buffer-size=4 -fomit-frame-pointer -march=i686 -fasynchronous-unwind-tables -mtune=pentium4 -gdwarf-4 -fno-debug-types-section -fvar-tracking-assignments -g2 -MT mod_clamav_la-config.lo -MD -MP -MF .deps/mod_clamav_la-config.Tpo -c config.c -fPIC -DPIC -o .libs/mod_clamav_la-config.o mv -f .deps/mod_clamav_la-config.Tpo .deps/mod_clamav_la-config.Plo make[1]: Leaving directory '/tmp/B.5GSnlD/BUILD/mod_clamav-0.23' make[1]: Entering directory '/tmp/B.5GSnlD/BUILD/mod_clamav-0.23' /bin/sh ./libtool --tag=CC --mode=compile `/usr/sbin/apxs -q CC` -DHAVE_CONFIG_H -I. `apr-1-config --cppflags` `apr-1-config --includes` -I`/usr/sbin/apxs -q INCLUDEDIR` -I /usr/include/apr -I /usr/include/apr-util `apr-1-config --cflags` `/usr/sbin/apxs -q CFLAGS_SHLIB` -O2 -fwrapv -pipe -Wformat -Werror=format-security -gdwarf-4 -fno-debug-types-section -fvar-tracking-assignments -g2 -Wp,-D_FORTIFY_SOURCE=2 -fstack-protector-strong --param=ssp-buffer-size=4 -fomit-frame-pointer -march=i686 -fasynchronous-unwind-tables -mtune=pentium4 -gdwarf-4 -fno-debug-types-section -fvar-tracking-assignments -g2 -MT mod_clamav_la-handler.lo -MD -MP -MF .deps/mod_clamav_la-handler.Tpo -c -o mod_clamav_la-handler.lo `test -f 'handler.c' || echo './'`handler.c libtool: compile: i686-pld-linux-gcc -DHAVE_CONFIG_H -I. -DLINUX -D_REENTRANT -D_GNU_SOURCE -D_LARGEFILE64_SOURCE -I/usr/include/apr -I/usr/include/apache -I /usr/include/apr -I /usr/include/apr-util -pthread -O2 -fwrapv -pipe -Wformat -Werror=format-security -gdwarf-4 -fno-debug-types-section -fvar-tracking-assignments -g2 -Wp,-D_FORTIFY_SOURCE=2 -fstack-protector-strong --param=ssp-buffer-size=4 -fomit-frame-pointer -march=i686 -fasynchronous-unwind-tables -mtune=pentium4 -gdwarf-4 -fno-debug-types-section -fvar-tracking-assignments -g2 -MT mod_clamav_la-handler.lo -MD -MP -MF .deps/mod_clamav_la-handler.Tpo -c handler.c -fPIC -DPIC -o .libs/mod_clamav_la-handler.o mv -f .deps/mod_clamav_la-handler.Tpo .deps/mod_clamav_la-handler.Plo make[1]: Leaving directory '/tmp/B.5GSnlD/BUILD/mod_clamav-0.23' make: *** [Makefile:388: all] Error 2 error: Bad exit status from /tmp/B.5GSnlD/BUILD/tmp/rpm-tmp.38707 (%build) RPM build errors: Bad exit status from /tmp/B.5GSnlD/BUILD/tmp/rpm-tmp.38707 (%build) ended at: Thu Dec 6 21:44:07 2018, done in 0:00:09.899255 error: No files produced. + chmod -R u+rwX /tmp/B.5GSnlD/BUILD + rm -rf /tmp/B.5GSnlD/tmp /tmp/B.5GSnlD/BUILD + rm -rf /tmp/B.5GSnlD Begin-PLD-Builder-Info Build-Time: user:17.95s sys:4.77s real:41.28s (faults io:0 non-io:744354) End-PLD-Builder-Info
[Back to list of logs] [View rpm -qa of builder]