FailedOk

th/SRPMS[OK]
th/x32[OK]
th/i686[OK]
th/x86_64[OK]

ac/SRPMS[OK]
ac/i386[OK]
ac/i586[OK]
ac/i686[OK]
ac/alpha[OK]
ac/amd64[OK]
ac/athlon[OK]
ac/ppc[OK]
ac/sparc[OK]
ac/sparc64[OK]

Advanced Search
main()
Powered by PLD Linux
(c) 2002-2018 PLD Team
$Revision: 1.37 $
Powered by ed.
Your IP: 54.90.109.231

avscan e1abb98a-b466-410a-919b-d6398b4ac2c0

Status:Failed
Source URL:ftp://buildlogs.pld-linux.org/th/i686/FAIL/avscan,e1abb98a-b466-410a-919b-d6398b4ac2c0.bz2
text/plain URL:View!
full text:View!
rpm -qa of builder:View!
Date:2018/12/06 21:44:32
Runtime:0:00:03.474379

Toc:

  • error 1
  • rpm: error: Failed build dependencies:
  • error 2
  • rpm: error: Failed build dependencies:
  • prep
  • Executing(%prep): /bin/sh -e /tmp/B.ALliZj/BUILD/tmp/rpm-tmp.3827
  • build
  • Executing(%build): /bin/sh -e /tmp/B.ALliZj/BUILD/tmp/rpm-tmp.3827
  • error 3
  • /usr/include/clamav.h:68:10: fatal error: cltypes.h: No such file or directory
  • error 4
  • compilation terminated.
  • error 5
  • make[1]: *** [Makefile:54: avs_main.o] Error 1
  • error 6
  • /usr/include/clamav.h:68:10: fatal error: cltypes.h: No such file or directory
  • error 7
  • compilation terminated.
  • error 8
  • make[1]: *** [Makefile:54: avs_avengine_scan.o] Error 1
  • error 9
  • /usr/include/clamav.h:68:10: fatal error: cltypes.h: No such file or directory
  • error 10
  • compilation terminated.
  • error 11
  • make[1]: *** [Makefile:54: avs_win_db.o] Error 1
  • error 12
  • error: Bad exit status from /tmp/B.ALliZj/BUILD/tmp/rpm-tmp.3827 (%build)
  • error 13
  • RPM build errors:
  • error 14
  • error: No files produced.

Content:

checking if we should skip the build
started at: Thu Dec  6 21:44:11 2018
killing old processes on a builder
sending signal 9 to pid -1
Killed
cleaning up /tmp
fetching https://srcbuilder.pld-linux.org/th//srpms/e1abb98a-b466-410a-919b-d6398b4ac2c0/avscan-5.1.1-2.src.rpm
fetched 592385 bytes, 780.6 K/s
installing srpm: avscan-5.1.1-2.src.rpm
+ install -d /tmp/B.ALliZj/BUILD /tmp/B.ALliZj/RPMS
+ LC_ALL=en_US.UTF-8
+ rpm -qp --changelog avscan-5.1.1-2.src.rpm
* Thu Dec 06 2018 PLD Linux Team <feedback@pld-linux.org>
- For complete changelog see: http://git.pld-linux.org/?p=packages/avscan.git;a=log;h=master
+ rpm -Uhv --nodeps --define '_topdir /tmp/B.ALliZj' --define '_specdir %{_topdir}' --define '_sourcedir %{_specdir}' --define '_rpmdir %{_topdir}/RPMS' --define '_builddir %{_topdir}/BUILD' avscan-5.1.1-2.src.rpm Preparing... ################################################## avscan ################################################## + rm -f avscan-5.1.1-2.src.rpm + install -m 700 -d /tmp/B.ALliZj/BUILD/tmp + TMPDIR=/tmp/B.ALliZj/BUILD/tmp + exec nice -n 0 rpmbuild -bp --short-circuit --nodeps --define '_topdir /tmp/B.ALliZj' --define '_specdir %{_topdir}' --define '_sourcedir %{_specdir}' --define '_rpmdir %{_topdir}/RPMS' --define '_builddir %{_topdir}/BUILD' --target i686-pld-linux --define 'prep exit 0' /tmp/B.ALliZj/avscan.spec Building target platforms: i686-pld-linux checking BuildConflict-ing packages no BuildConflicts found checking BR rpm: error: Failed build dependencies: rpm: endeavour-devel >= 3 is needed by avscan-5.1.1-2.src rpm: Building target platforms: i686-pld-linux updating poldek cache... ready is up to date Retrieving th::packages.ndir.md... th is up to date Retrieving th::packages.ndir.md... th is up to date Retrieving th-ready::packages.ndir.md... th-ready is up to date Retrieving th-ready::packages.ndir.md... th-ready is up to date Retrieving th-test::packages.ndir.md... th-test is up to date Retrieving th-test::packages.ndir.md... th-test is up to date checking conflicting packages in BRed packages poldek: Loading [pndir]ready... poldek: Loading [pndir]th-test... poldek: Loading [pndir]th-test... poldek: Loading [pndir]th-ready... poldek: Loading [pndir]th-ready... poldek: Loading [pndir]th... poldek: Loading [pndir]th... poldek: 28564 packages read poldek: Removed 1443 duplicate packages from available set poldek: Processing dependencies... poldek: endeavour-devel-3.1.4-7.i686 marks endeavour-libs-3.1.4-7.i686 (cap endeavour-libs = 3.1.4-7) poldek: There are 2 packages to install (1 marked by dependencies): poldek: I endeavour-devel-3.1.4-7.i686 poldek: D endeavour-libs-3.1.4-7.i686 poldek: This operation will use 466.4KB of disk space. poldek: Need to get 134.6KB of archives (134.6KB to download). poldek: poldek: Retrieving [1/2] th::endeavour-libs-3.1.4-7.i686.rpm... poldek: ..............................done poldek: Retrieving [2/2] th::endeavour-devel-3.1.4-7.i686.rpm... poldek: ..............................done poldek: Executing pm-command.sh --upgrade -vh --test --root / --define _check_dirname_deps 1... poldek: Preparing... ################################################## no conflicts found checking BR rpm: error: Failed build dependencies: rpm: endeavour-devel >= 3 is needed by avscan-5.1.1-2.src rpm: Building target platforms: i686-pld-linux installing BR: endeavour\-devel + poldek --noask --caplookup -Q -v '--ignore=hhvm-*' '--ignore=php4-*' '--ignore=php52-*' '--ignore=php54-*' '--ignore=php55-*' '--ignore=php56-*' '--ignore=php70-*' '--ignore=php71-*' '--ignore=php72-*' '--ignore=php73-*' --upgrade endeavour-devel Loading [pndir]ready... Loading [pndir]th-test... Loading [pndir]th-test... Loading [pndir]th-ready... Loading [pndir]th-ready... Loading [pndir]th... Loading [pndir]th... 28564 packages read Removed 1443 duplicate packages from available set Processing dependencies... endeavour-devel-3.1.4-7.i686 marks endeavour-libs-3.1.4-7.i686 (cap endeavour-libs = 3.1.4-7) There are 2 packages to install (1 marked by dependencies): I endeavour-devel-3.1.4-7.i686 D endeavour-libs-3.1.4-7.i686 This operation will use 466.4KB of disk space. Need to get 134.6KB of archives. Executing pm-command.sh --upgrade -vh --root / --define _check_dirname_deps 1... Preparing... ################################################## endeavour-libs ################################################## endeavour-devel ################################################## building RPM using: set -ex; : build-id: e1abb98a-b466-410a-919b-d6398b4ac2c0; TMPDIR=/tmp/B.ALliZj/BUILD/tmp exec nice -n 0 rpmbuild -bb --define '_smp_mflags -j9' --define '_make_opts -Otarget' --define '_pld_builder 1' --define '_topdir /tmp/B.ALliZj' --define '_specdir %{_topdir}' --define '_sourcedir %{_specdir}' --define '_rpmdir %{_topdir}/RPMS' --define '_builddir %{_topdir}/BUILD' --target i686-pld-linux /tmp/B.ALliZj/avscan.spec + : build-id: e1abb98a-b466-410a-919b-d6398b4ac2c0 + TMPDIR=/tmp/B.ALliZj/BUILD/tmp + exec nice -n 0 rpmbuild -bb --define '_smp_mflags -j9' --define '_make_opts -Otarget' --define '_pld_builder 1' --define '_topdir /tmp/B.ALliZj' --define '_specdir %{_topdir}' --define '_sourcedir %{_specdir}' --define '_rpmdir %{_topdir}/RPMS' --define '_builddir %{_topdir}/BUILD' --target i686-pld-linux /tmp/B.ALliZj/avscan.spec Building target platforms: i686-pld-linux Executing(%prep): /bin/sh -e /tmp/B.ALliZj/BUILD/tmp/rpm-tmp.3827 + umask 022 + cd /tmp/B.ALliZj/BUILD + cd /tmp/B.ALliZj/BUILD + rm -rf avscan-5.1.1-openssl + /usr/bin/bzip2 -dc /tmp/B.ALliZj/avscan-5.1.1-openssl.tar.bz2 + /bin/tar -xf - + STATUS=0 + '[' 0 -ne 0 ']' + cd avscan-5.1.1-openssl + /bin/id -u + '[' 1001 '=' 0 ']' + /bin/id -u + '[' 1001 '=' 0 ']' + /bin/chmod -Rf a+rX,u+w,g-w,o-w . + echo 'Patch #0 (avscan-verbose.patch):' Patch #0 (avscan-verbose.patch): + '[' -f /tmp/B.ALliZj/avscan-verbose.patch ']' + /bin/cat /tmp/B.ALliZj/avscan-verbose.patch + /usr/bin/patch -s -p1 + exit 0 Executing(%build): /bin/sh -e /tmp/B.ALliZj/BUILD/tmp/rpm-tmp.3827 TMP=/home/users/builder/tmp HOME=/home/users/builder PATH=/usr/local/bin:/usr/bin:/bin:/home/users/builder/bin TMPDIR=/tmp/B.ALliZj/BUILD/tmp + umask 022 + cd /tmp/B.ALliZj/BUILD + cd avscan-5.1.1-openssl + ./configure Linux Collecting information about this platform... Generating Platform Configurator and testing system's compiler... rm -f *.o a.out core pconf cc fio.c main.c proc.c utils.c -o pconf -Wall proc.c: In function 'PConfCheckDepends': proc.c:1087:6: warning: variable 'depend_progress_ratio' set but not used [-Wunused-but-set-variable] int depend_progress_ratio = 0; /* In percent. */ ^~~~~~~~~~~~~~~~~~~~~ Compiler passed all compatibility tests! Configuring for platform `Linux'... Checking this platform... Checking Dependency: i486... Preferred (not required) feature `arch-i486' not detected and disabled. Checking Dependency: i586... Preferred (not required) feature `arch-i586' not detected and disabled. Checking Dependency: i686... Preferred feature `arch-i686' detected and enabled. Checking Dependency: pentiumpro... Preferred (not required) feature `arch-pentiumpro' not detected and disabled. Checking Dependency: libclamav-devel... Preferred feature `libclamav' detected and enabled. Checking Dependency: gtk-devel... Checking Dependency: endeavour2-base-devel... Preferred feature `libendeavour2-base' detected and enabled. Generating output Makefile `avscan/Makefile.pconf'...  Platform configuration completed! -------------------------------------------------------------------------------- Type 'gmake all' or 'make all' to compile the program. + gtk-config --cflags + clamav-config --cflags + endeavour2-base-config --cflags + /usr/bin/make -Otarget -j9 'CC=i686-pld-linux-gcc' 'CPP=i686-pld-linux-g++' $'CFLAGS=-O2 -fwrapv -pipe -Wformat -Werror=format-security -gdwarf-4 -fno-debug-types-section -fvar-tracking-assignments -g2 -Wp,-D_FORTIFY_SOURCE=2 -fstack-protector-strong --param=ssp-buffer-size=4 -fomit-frame-pointer -march=i686 -fasynchronous-unwind-tables -mtune=pentium4 -gdwarf-4 -fno-debug-types-section -fvar-tracking-assignments -g2 -Wall \t\t-I/usr/include/gtk-1.2 -I/usr/include/glib-1.2 -I/usr/lib/glib/include \t\t-DHAVE_CLAMAV -I/usr/include -O2 -fwrapv -pipe -Wformat -Werror=format-security -gdwarf-4 -fno-debug-types-section -fvar-tracking-assignments -g2 -Wp,-D_FORTIFY_SOURCE=2 -fstack-protector-strong --param=ssp-buffer-size=4 -fomit-frame-pointer -march=i686 -fasynchronous-unwind-tables -mtune=pentium4 -gdwarf-4 -fno-debug-types-section -fvar-tracking-assignments -g2 -Wall -W -Wmissing-prototypes -Wmissing-declarations -std=gnu99 -fno-strict-aliasing -D_LARGEFILE_SOURCE -D_LARGEFILE64_SOURCE -D_FILE_OFFSET_BITS=64 \t\t-DHAVE_LIBENDEAVOUR2 -I/usr/include/endeavour2' make[1]: Entering directory '/tmp/B.ALliZj/BUILD/avscan-5.1.1-openssl/avscan' Building program "avscan"... make[1]: Leaving directory '/tmp/B.ALliZj/BUILD/avscan-5.1.1-openssl/avscan' make[1]: Entering directory '/tmp/B.ALliZj/BUILD/avscan-5.1.1-openssl/avscan' Compiling resources make[1]: Leaving directory '/tmp/B.ALliZj/BUILD/avscan-5.1.1-openssl/avscan' make[1]: Entering directory '/tmp/B.ALliZj/BUILD/avscan-5.1.1-openssl/avscan' i686-pld-linux-gcc -c avs_main.c -O2 -fwrapv -pipe -Wformat -Werror=format-security -gdwarf-4 -fno-debug-types-section -fvar-tracking-assignments -g2 -Wp,-D_FORTIFY_SOURCE=2 -fstack-protector-strong --param=ssp-buffer-size=4 -fomit-frame-pointer -march=i686 -fasynchronous-unwind-tables -mtune=pentium4 -gdwarf-4 -fno-debug-types-section -fvar-tracking-assignments -g2 -Wall -I/usr/include/gtk-1.2 -I/usr/include/glib-1.2 -I/usr/lib/glib/include -DHAVE_CLAMAV -I/usr/include -O2 -fwrapv -pipe -Wformat -Werror=format-security -gdwarf-4 -fno-debug-types-section -fvar-tracking-assignments -g2 -Wp,-D_FORTIFY_SOURCE=2 -fstack-protector-strong --param=ssp-buffer-size=4 -fomit-frame-pointer -march=i686 -fasynchronous-unwind-tables -mtune=pentium4 -gdwarf-4 -fno-debug-types-section -fvar-tracking-assignments -g2 -Wall -W -Wmissing-prototypes -Wmissing-declarations -std=gnu99 -fno-strict-aliasing -D_LARGEFILE_SOURCE -D_LARGEFILE64_SOURCE -D_FILE_OFFSET_BITS=64 -DHAVE_LIBENDEAVOUR2 -I/usr/include/endeavour2 In file included from avs_main.c:6: /usr/include/clamav.h:68:10: fatal error: cltypes.h: No such file or directory #include "cltypes.h" ^~~~~~~~~~~ compilation terminated. make[1]: *** [Makefile:54: avs_main.o] Error 1 make[1]: Leaving directory '/tmp/B.ALliZj/BUILD/avscan-5.1.1-openssl/avscan' make[1]: *** Waiting for unfinished jobs.... make[1]: Entering directory '/tmp/B.ALliZj/BUILD/avscan-5.1.1-openssl/avscan' i686-pld-linux-gcc -c avs_avengine_scan.c -O2 -fwrapv -pipe -Wformat -Werror=format-security -gdwarf-4 -fno-debug-types-section -fvar-tracking-assignments -g2 -Wp,-D_FORTIFY_SOURCE=2 -fstack-protector-strong --param=ssp-buffer-size=4 -fomit-frame-pointer -march=i686 -fasynchronous-unwind-tables -mtune=pentium4 -gdwarf-4 -fno-debug-types-section -fvar-tracking-assignments -g2 -Wall -I/usr/include/gtk-1.2 -I/usr/include/glib-1.2 -I/usr/lib/glib/include -DHAVE_CLAMAV -I/usr/include -O2 -fwrapv -pipe -Wformat -Werror=format-security -gdwarf-4 -fno-debug-types-section -fvar-tracking-assignments -g2 -Wp,-D_FORTIFY_SOURCE=2 -fstack-protector-strong --param=ssp-buffer-size=4 -fomit-frame-pointer -march=i686 -fasynchronous-unwind-tables -mtune=pentium4 -gdwarf-4 -fno-debug-types-section -fvar-tracking-assignments -g2 -Wall -W -Wmissing-prototypes -Wmissing-declarations -std=gnu99 -fno-strict-aliasing -D_LARGEFILE_SOURCE -D_LARGEFILE64_SOURCE -D_FILE_OFFSET_BITS=64 -DHAVE_LIBENDEAVOUR2 -I/usr/include/endeavour2 In file included from avs_avengine_scan.c:13: /usr/include/clamav.h:68:10: fatal error: cltypes.h: No such file or directory #include "cltypes.h" ^~~~~~~~~~~ compilation terminated. make[1]: *** [Makefile:54: avs_avengine_scan.o] Error 1 make[1]: Leaving directory '/tmp/B.ALliZj/BUILD/avscan-5.1.1-openssl/avscan' make[1]: Entering directory '/tmp/B.ALliZj/BUILD/avscan-5.1.1-openssl/avscan' i686-pld-linux-gcc -c avs_win_db.c -O2 -fwrapv -pipe -Wformat -Werror=format-security -gdwarf-4 -fno-debug-types-section -fvar-tracking-assignments -g2 -Wp,-D_FORTIFY_SOURCE=2 -fstack-protector-strong --param=ssp-buffer-size=4 -fomit-frame-pointer -march=i686 -fasynchronous-unwind-tables -mtune=pentium4 -gdwarf-4 -fno-debug-types-section -fvar-tracking-assignments -g2 -Wall -I/usr/include/gtk-1.2 -I/usr/include/glib-1.2 -I/usr/lib/glib/include -DHAVE_CLAMAV -I/usr/include -O2 -fwrapv -pipe -Wformat -Werror=format-security -gdwarf-4 -fno-debug-types-section -fvar-tracking-assignments -g2 -Wp,-D_FORTIFY_SOURCE=2 -fstack-protector-strong --param=ssp-buffer-size=4 -fomit-frame-pointer -march=i686 -fasynchronous-unwind-tables -mtune=pentium4 -gdwarf-4 -fno-debug-types-section -fvar-tracking-assignments -g2 -Wall -W -Wmissing-prototypes -Wmissing-declarations -std=gnu99 -fno-strict-aliasing -D_LARGEFILE_SOURCE -D_LARGEFILE64_SOURCE -D_FILE_OFFSET_BITS=64 -DHAVE_LIBENDEAVOUR2 -I/usr/include/endeavour2 In file included from avs_win_db.c:7: /usr/include/clamav.h:68:10: fatal error: cltypes.h: No such file or directory #include "cltypes.h" ^~~~~~~~~~~ compilation terminated. make[1]: *** [Makefile:54: avs_win_db.o] Error 1 make[1]: Leaving directory '/tmp/B.ALliZj/BUILD/avscan-5.1.1-openssl/avscan' make[1]: Entering directory '/tmp/B.ALliZj/BUILD/avscan-5.1.1-openssl/avscan' i686-pld-linux-gcc -c avs_help.c -O2 -fwrapv -pipe -Wformat -Werror=format-security -gdwarf-4 -fno-debug-types-section -fvar-tracking-assignments -g2 -Wp,-D_FORTIFY_SOURCE=2 -fstack-protector-strong --param=ssp-buffer-size=4 -fomit-frame-pointer -march=i686 -fasynchronous-unwind-tables -mtune=pentium4 -gdwarf-4 -fno-debug-types-section -fvar-tracking-assignments -g2 -Wall -I/usr/include/gtk-1.2 -I/usr/include/glib-1.2 -I/usr/lib/glib/include -DHAVE_CLAMAV -I/usr/include -O2 -fwrapv -pipe -Wformat -Werror=format-security -gdwarf-4 -fno-debug-types-section -fvar-tracking-assignments -g2 -Wp,-D_FORTIFY_SOURCE=2 -fstack-protector-strong --param=ssp-buffer-size=4 -fomit-frame-pointer -march=i686 -fasynchronous-unwind-tables -mtune=pentium4 -gdwarf-4 -fno-debug-types-section -fvar-tracking-assignments -g2 -Wall -W -Wmissing-prototypes -Wmissing-declarations -std=gnu99 -fno-strict-aliasing -D_LARGEFILE_SOURCE -D_LARGEFILE64_SOURCE -D_FILE_OFFSET_BITS=64 -DHAVE_LIBENDEAVOUR2 -I/usr/include/endeavour2 make[1]: Leaving directory '/tmp/B.ALliZj/BUILD/avscan-5.1.1-openssl/avscan' make[1]: Entering directory '/tmp/B.ALliZj/BUILD/avscan-5.1.1-openssl/avscan' i686-pld-linux-gcc -c avs_win_animicon.c -O2 -fwrapv -pipe -Wformat -Werror=format-security -gdwarf-4 -fno-debug-types-section -fvar-tracking-assignments -g2 -Wp,-D_FORTIFY_SOURCE=2 -fstack-protector-strong --param=ssp-buffer-size=4 -fomit-frame-pointer -march=i686 -fasynchronous-unwind-tables -mtune=pentium4 -gdwarf-4 -fno-debug-types-section -fvar-tracking-assignments -g2 -Wall -I/usr/include/gtk-1.2 -I/usr/include/glib-1.2 -I/usr/lib/glib/include -DHAVE_CLAMAV -I/usr/include -O2 -fwrapv -pipe -Wformat -Werror=format-security -gdwarf-4 -fno-debug-types-section -fvar-tracking-assignments -g2 -Wp,-D_FORTIFY_SOURCE=2 -fstack-protector-strong --param=ssp-buffer-size=4 -fomit-frame-pointer -march=i686 -fasynchronous-unwind-tables -mtune=pentium4 -gdwarf-4 -fno-debug-types-section -fvar-tracking-assignments -g2 -Wall -W -Wmissing-prototypes -Wmissing-declarations -std=gnu99 -fno-strict-aliasing -D_LARGEFILE_SOURCE -D_LARGEFILE64_SOURCE -D_FILE_OFFSET_BITS=64 -DHAVE_LIBENDEAVOUR2 -I/usr/include/endeavour2 make[1]: Leaving directory '/tmp/B.ALliZj/BUILD/avscan-5.1.1-openssl/avscan' make[1]: Entering directory '/tmp/B.ALliZj/BUILD/avscan-5.1.1-openssl/avscan' i686-pld-linux-gcc -c avs_win_dnd.c -O2 -fwrapv -pipe -Wformat -Werror=format-security -gdwarf-4 -fno-debug-types-section -fvar-tracking-assignments -g2 -Wp,-D_FORTIFY_SOURCE=2 -fstack-protector-strong --param=ssp-buffer-size=4 -fomit-frame-pointer -march=i686 -fasynchronous-unwind-tables -mtune=pentium4 -gdwarf-4 -fno-debug-types-section -fvar-tracking-assignments -g2 -Wall -I/usr/include/gtk-1.2 -I/usr/include/glib-1.2 -I/usr/lib/glib/include -DHAVE_CLAMAV -I/usr/include -O2 -fwrapv -pipe -Wformat -Werror=format-security -gdwarf-4 -fno-debug-types-section -fvar-tracking-assignments -g2 -Wp,-D_FORTIFY_SOURCE=2 -fstack-protector-strong --param=ssp-buffer-size=4 -fomit-frame-pointer -march=i686 -fasynchronous-unwind-tables -mtune=pentium4 -gdwarf-4 -fno-debug-types-section -fvar-tracking-assignments -g2 -Wall -W -Wmissing-prototypes -Wmissing-declarations -std=gnu99 -fno-strict-aliasing -D_LARGEFILE_SOURCE -D_LARGEFILE64_SOURCE -D_FILE_OFFSET_BITS=64 -DHAVE_LIBENDEAVOUR2 -I/usr/include/endeavour2 avs_win_dnd.c: In function 'avs_win_dnd_drag_data_received_nexus': avs_win_dnd.c:278:30: warning: cast between incompatible function types from 'void (*)(void *)' to 'void (*)(void *, void *)' [-Wcast-function-type] g_list_foreach(paths_list, (GFunc)g_free, NULL); ^ avs_win_dnd.c:79:18: warning: unused parameter 'dc' [-Wunused-parameter] GdkDragContext *dc, ~~~~~~~~~~~~~~~~^~ avs_win_dnd.c:82:29: warning: unused parameter 'column' [-Wunused-parameter] const gint row, const gint column ~~~~~~~~~~~^~~~~~ avs_win_dnd.c: In function 'avs_win_dnd_anim_icon_drag_data_received_cb': avs_win_dnd.c:539:7: warning: unused parameter 'x' [-Wunused-parameter] gint x, gint y, ~~~~~^ avs_win_dnd.c:539:15: warning: unused parameter 'y' [-Wunused-parameter] gint x, gint y, ~~~~~^ avs_win_dnd.c:540:54: warning: unused parameter 't' [-Wunused-parameter] GtkSelectionData *selection_data, guint info, guint t, ~~~~~~^ avs_win_dnd.c: In function 'avs_win_dnd_list_drag_data_get_cb': avs_win_dnd.c:642:4: warning: pointer targets in passing argument 4 of 'gtk_selection_data_set' differ in signedness [-Wpointer-sign] s, /* Data */ ^ In file included from /usr/include/gtk-1.2/gtk/gtkdnd.h:33, from /usr/include/gtk-1.2/gtk/gtk.h:56, from avs_win_dnd.c:3: /usr/include/gtk-1.2/gtk/gtkselection.h:103:6: note: expected 'const guchar *' {aka 'const unsigned char *'} but argument is of type 'const gchar *' {aka 'const char *'} void gtk_selection_data_set (GtkSelectionData *selection_data, ^~~~~~~~~~~~~~~~~~~~~~ avs_win_dnd.c:560:42: warning: unused parameter 'info' [-Wunused-parameter] GtkSelectionData *selection_data, guint info, guint t, ~~~~~~^~~~ avs_win_dnd.c:560:54: warning: unused parameter 't' [-Wunused-parameter] GtkSelectionData *selection_data, guint info, guint t, ~~~~~~^ avs_win_dnd.c: In function 'avs_win_dnd_list_drag_data_received_cb': avs_win_dnd.c:655:54: warning: unused parameter 't' [-Wunused-parameter] GtkSelectionData *selection_data, guint info, guint t, ~~~~~~^ avs_win_dnd.c: In function 'avs_win_dnd_entry_drag_data_received_cb': avs_win_dnd.c:748:7: warning: unused parameter 'x' [-Wunused-parameter] gint x, gint y, ~~~~~^ avs_win_dnd.c:748:15: warning: unused parameter 'y' [-Wunused-parameter] gint x, gint y, ~~~~~^ avs_win_dnd.c:749:54: warning: unused parameter 't' [-Wunused-parameter] GtkSelectionData *selection_data, guint info, guint t, ~~~~~~^ make[1]: Leaving directory '/tmp/B.ALliZj/BUILD/avscan-5.1.1-openssl/avscan' make[1]: Entering directory '/tmp/B.ALliZj/BUILD/avscan-5.1.1-openssl/avscan' i686-pld-linux-gcc -c animicon.c -O2 -fwrapv -pipe -Wformat -Werror=format-security -gdwarf-4 -fno-debug-types-section -fvar-tracking-assignments -g2 -Wp,-D_FORTIFY_SOURCE=2 -fstack-protector-strong --param=ssp-buffer-size=4 -fomit-frame-pointer -march=i686 -fasynchronous-unwind-tables -mtune=pentium4 -gdwarf-4 -fno-debug-types-section -fvar-tracking-assignments -g2 -Wall -I/usr/include/gtk-1.2 -I/usr/include/glib-1.2 -I/usr/lib/glib/include -DHAVE_CLAMAV -I/usr/include -O2 -fwrapv -pipe -Wformat -Werror=format-security -gdwarf-4 -fno-debug-types-section -fvar-tracking-assignments -g2 -Wp,-D_FORTIFY_SOURCE=2 -fstack-protector-strong --param=ssp-buffer-size=4 -fomit-frame-pointer -march=i686 -fasynchronous-unwind-tables -mtune=pentium4 -gdwarf-4 -fno-debug-types-section -fvar-tracking-assignments -g2 -Wall -W -Wmissing-prototypes -Wmissing-declarations -std=gnu99 -fno-strict-aliasing -D_LARGEFILE_SOURCE -D_LARGEFILE64_SOURCE -D_FILE_OFFSET_BITS=64 -DHAVE_LIBENDEAVOUR2 -I/usr/include/endeavour2 animicon.c: In function 'AnimIconEventCB': animicon.c:174:18: warning: variable 'expose' set but not used [-Wunused-but-set-variable] GdkEventExpose *expose; ^~~~~~ In file included from /usr/include/gtk-1.2/gtk/gtkarg.h:31, from /usr/include/gtk-1.2/gtk/gtkobject.h:31, from /usr/include/gtk-1.2/gtk/gtkaccelgroup.h:35, from /usr/include/gtk-1.2/gtk/gtk.h:32, from animicon.c:3: animicon.c: In function 'AnimIconNew': /usr/include/gtk-1.2/gtk/gtktypeutils.h:158:30: warning: cast between incompatible function types from 'gint (*)(GtkWidget *, GdkEvent *, void *)' {aka 'int (*)(struct _GtkWidget *, union _GdkEvent *, void *)'} to 'void (*)()' [-Wcast-function-type] #define GTK_SIGNAL_FUNC(f) ((GtkSignalFunc) f) ^ animicon.c:427:6: note: in expansion of macro 'GTK_SIGNAL_FUNC' GTK_SIGNAL_FUNC(AnimIconEventCB), a ^~~~~~~~~~~~~~~ /usr/include/gtk-1.2/gtk/gtktypeutils.h:158:30: warning: cast between incompatible function types from 'gint (*)(GtkWidget *, GdkEvent *, void *)' {aka 'int (*)(struct _GtkWidget *, union _GdkEvent *, void *)'} to 'void (*)()' [-Wcast-function-type] #define GTK_SIGNAL_FUNC(f) ((GtkSignalFunc) f) ^ animicon.c:431:6: note: in expansion of macro 'GTK_SIGNAL_FUNC' GTK_SIGNAL_FUNC(AnimIconEventCB), a ^~~~~~~~~~~~~~~ make[1]: Leaving directory '/tmp/B.ALliZj/BUILD/avscan-5.1.1-openssl/avscan' make[1]: Entering directory '/tmp/B.ALliZj/BUILD/avscan-5.1.1-openssl/avscan' i686-pld-linux-gcc -c avs_win_cb.c -O2 -fwrapv -pipe -Wformat -Werror=format-security -gdwarf-4 -fno-debug-types-section -fvar-tracking-assignments -g2 -Wp,-D_FORTIFY_SOURCE=2 -fstack-protector-strong --param=ssp-buffer-size=4 -fomit-frame-pointer -march=i686 -fasynchronous-unwind-tables -mtune=pentium4 -gdwarf-4 -fno-debug-types-section -fvar-tracking-assignments -g2 -Wall -I/usr/include/gtk-1.2 -I/usr/include/glib-1.2 -I/usr/lib/glib/include -DHAVE_CLAMAV -I/usr/include -O2 -fwrapv -pipe -Wformat -Werror=format-security -gdwarf-4 -fno-debug-types-section -fvar-tracking-assignments -g2 -Wp,-D_FORTIFY_SOURCE=2 -fstack-protector-strong --param=ssp-buffer-size=4 -fomit-frame-pointer -march=i686 -fasynchronous-unwind-tables -mtune=pentium4 -gdwarf-4 -fno-debug-types-section -fvar-tracking-assignments -g2 -Wall -W -Wmissing-prototypes -Wmissing-declarations -std=gnu99 -fno-strict-aliasing -D_LARGEFILE_SOURCE -D_LARGEFILE64_SOURCE -D_FILE_OFFSET_BITS=64 -DHAVE_LIBENDEAVOUR2 -I/usr/include/endeavour2 avs_win_cb.c: In function 'avs_win_event_cb': avs_win_cb.c:123:16: warning: variable 'state' set but not used [-Wunused-but-set-variable] guint keyval, state; ^~~~~ avs_win_cb.c: In function 'avs_win_op_enter_event_cb': avs_win_cb.c:180:13: warning: unused parameter 'widget' [-Wunused-parameter] GtkWidget *widget, GdkEventCrossing *crossing, gpointer data ~~~~~~~~~~~^~~~~~ avs_win_cb.c:180:39: warning: unused parameter 'crossing' [-Wunused-parameter] GtkWidget *widget, GdkEventCrossing *crossing, gpointer data ~~~~~~~~~~~~~~~~~~^~~~~~~~ avs_win_cb.c: In function 'avs_win_op_leave_event_cb': avs_win_cb.c:204:13: warning: unused parameter 'widget' [-Wunused-parameter] GtkWidget *widget, GdkEventCrossing *crossing, gpointer data ~~~~~~~~~~~^~~~~~ avs_win_cb.c:204:39: warning: unused parameter 'crossing' [-Wunused-parameter] GtkWidget *widget, GdkEventCrossing *crossing, gpointer data ~~~~~~~~~~~~~~~~~~^~~~~~~~ avs_win_cb.c: In function 'avs_win_tool_bar_item_cb': avs_win_cb.c:229:26: warning: unused parameter 'id' [-Wunused-parameter] ToolBarItem *item, gint id, gpointer data ~~~~~^~ avs_win_cb.c: In function 'avs_win_tool_bar_item_enter_cb': avs_win_cb.c:255:26: warning: unused parameter 'id' [-Wunused-parameter] ToolBarItem *item, gint id, gpointer data ~~~~~^~ avs_win_cb.c: In function 'avs_win_tool_bar_item_leave_cb': avs_win_cb.c:273:26: warning: unused parameter 'id' [-Wunused-parameter] ToolBarItem *item, gint id, gpointer data ~~~~~^~ avs_win_cb.c: In function 'avs_win_notebook_switch_page_cb': avs_win_cb.c:292:15: warning: unused parameter 'notebook' [-Wunused-parameter] GtkNotebook *notebook, GtkNotebookPage *page, guint page_num, ~~~~~~~~~~~~~^~~~~~~~ avs_win_cb.c:292:42: warning: unused parameter 'page' [-Wunused-parameter] GtkNotebook *notebook, GtkNotebookPage *page, guint page_num, ~~~~~~~~~~~~~~~~~^~~~ avs_win_cb.c: In function 'avs_win_list_event_cb': avs_win_cb.c:417:18: warning: variable 'motion' set but not used [-Wunused-but-set-variable] GdkEventMotion *motion; ^~~~~~ avs_win_cb.c: In function 'WinListResizeColumnCB': avs_win_cb.c:523:24: warning: unused parameter 'column' [-Wunused-parameter] GtkCList *clist, gint column, gint width, gpointer data ~~~~~^~~~~~ avs_win_cb.c:523:37: warning: unused parameter 'width' [-Wunused-parameter] GtkCList *clist, gint column, gint width, gpointer data ~~~~~^~~~~ avs_win_cb.c: In function 'avs_win_list_select_row_cb': avs_win_cb.c:579:11: warning: variable 'core' set but not used [-Wunused-but-set-variable] AVSCore *core; ^~~~ avs_win_cb.c:574:34: warning: unused parameter 'column' [-Wunused-parameter] GtkCList *clist, gint row, gint column, GdkEvent *event, ~~~~~^~~~~~ avs_win_cb.c: In function 'avs_win_list_unselect_row_cb': avs_win_cb.c:757:24: warning: unused parameter 'row' [-Wunused-parameter] GtkCList *clist, gint row, gint column, GdkEvent *event, ~~~~~^~~ avs_win_cb.c:757:34: warning: unused parameter 'column' [-Wunused-parameter] GtkCList *clist, gint row, gint column, GdkEvent *event, ~~~~~^~~~~~ avs_win_cb.c:757:52: warning: unused parameter 'event' [-Wunused-parameter] GtkCList *clist, gint row, gint column, GdkEvent *event, ~~~~~~~~~~^~~~~ avs_win_cb.c: In function 'avs_win_tree_select_row_cb': avs_win_cb.c:791:44: warning: unused parameter 'column' [-Wunused-parameter] GtkCTree *ctree, GtkCTreeNode *node, gint column, ~~~~~^~~~~~ avs_win_cb.c: In function 'avs_win_tree_unselect_row_cb': avs_win_cb.c:859:33: warning: unused parameter 'node' [-Wunused-parameter] GtkCTree *ctree, GtkCTreeNode *node, gint column, ~~~~~~~~~~~~~~^~~~ avs_win_cb.c:859:44: warning: unused parameter 'column' [-Wunused-parameter] GtkCTree *ctree, GtkCTreeNode *node, gint column, ~~~~~^~~~~~ avs_win_cb.c: In function 'avs_win_tree_expand_cb': avs_win_cb.c:887:33: warning: unused parameter 'node' [-Wunused-parameter] GtkCTree *ctree, GtkCTreeNode *node, gpointer data ~~~~~~~~~~~~~~^~~~ avs_win_cb.c: In function 'avs_win_tree_collapse_cb': avs_win_cb.c:906:33: warning: unused parameter 'node' [-Wunused-parameter] GtkCTree *ctree, GtkCTreeNode *node, gpointer data ~~~~~~~~~~~~~~^~~~ make[1]: Leaving directory '/tmp/B.ALliZj/BUILD/avscan-5.1.1-openssl/avscan' make[1]: Entering directory '/tmp/B.ALliZj/BUILD/avscan-5.1.1-openssl/avscan' i686-pld-linux-gcc -c avs_win.c -O2 -fwrapv -pipe -Wformat -Werror=format-security -gdwarf-4 -fno-debug-types-section -fvar-tracking-assignments -g2 -Wp,-D_FORTIFY_SOURCE=2 -fstack-protector-strong --param=ssp-buffer-size=4 -fomit-frame-pointer -march=i686 -fasynchronous-unwind-tables -mtune=pentium4 -gdwarf-4 -fno-debug-types-section -fvar-tracking-assignments -g2 -Wall -I/usr/include/gtk-1.2 -I/usr/include/glib-1.2 -I/usr/lib/glib/include -DHAVE_CLAMAV -I/usr/include -O2 -fwrapv -pipe -Wformat -Werror=format-security -gdwarf-4 -fno-debug-types-section -fvar-tracking-assignments -g2 -Wp,-D_FORTIFY_SOURCE=2 -fstack-protector-strong --param=ssp-buffer-size=4 -fomit-frame-pointer -march=i686 -fasynchronous-unwind-tables -mtune=pentium4 -gdwarf-4 -fno-debug-types-section -fvar-tracking-assignments -g2 -Wall -W -Wmissing-prototypes -Wmissing-declarations -std=gnu99 -fno-strict-aliasing -D_LARGEFILE_SOURCE -D_LARGEFILE64_SOURCE -D_FILE_OFFSET_BITS=64 -DHAVE_LIBENDEAVOUR2 -I/usr/include/endeavour2 avs_win.c: In function 'avs_win_strdup_shorten': avs_win.c:353:14: warning: implicit declaration of function 'strlen' [-Wimplicit-function-declaration] len = (gint)strlen((const char *)s); ^~~~~~ avs_win.c:353:14: warning: incompatible implicit declaration of built-in function 'strlen' avs_win.c:353:14: note: include '<string.h>' or provide a declaration of 'strlen' avs_win.c:66:1: +#include <string.h> avs_win.c:353:14: len = (gint)strlen((const char *)s); ^~~~~~ avs_win.c: In function 'avs_win_scan_list_open_file': avs_win.c:380:14: warning: variable 'edv_ctx' set but not used [-Wunused-but-set-variable] EDVContext *edv_ctx; ^~~~~~~ avs_win.c: In function 'avs_win_ops_list_delete': avs_win.c:1185:24: warning: cast between incompatible function types from 'void (*)(AVSWinOp *)' {aka 'void (*)(struct _AVSWinOp *)'} to 'void (*)(void *, void *)' [-Wcast-function-type] g_list_foreach(glist, (GFunc)avs_win_op_delete, NULL); ^ avs_win.c: In function 'avs_win_build_tool_bar': avs_win.c:1732:4: warning: cast between incompatible function types from 'void (*)(ToolBarItem *)' {aka 'void (*)(struct _ToolBarItem *)'} to 'void (*)(void *, void *)' [-Wcast-function-type] (GFunc)ToolBarItemDelete, ^ In file included from /usr/include/gtk-1.2/gtk/gtkarg.h:31, from /usr/include/gtk-1.2/gtk/gtkobject.h:31, from /usr/include/gtk-1.2/gtk/gtkaccelgroup.h:35, from /usr/include/gtk-1.2/gtk/gtk.h:32, from avs_win.c:1: avs_win.c: In function 'avs_win_build_lists': /usr/include/gtk-1.2/gtk/gtktypeutils.h:158:30: warning: cast between incompatible function types from 'gint (*)(GtkWidget *, GdkEvent *, void *)' {aka 'int (*)(struct _GtkWidget *, union _GdkEvent *, void *)'} to 'void (*)()' [-Wcast-function-type] #define GTK_SIGNAL_FUNC(f) ((GtkSignalFunc) f) ^ avs_win.c:2000:3: note: in expansion of macro 'GTK_SIGNAL_FUNC' GTK_SIGNAL_FUNC(avs_win_list_event_cb), win ^~~~~~~~~~~~~~~ /usr/include/gtk-1.2/gtk/gtktypeutils.h:158:30: warning: cast between incompatible function types from 'gint (*)(GtkWidget *, GdkEvent *, void *)' {aka 'int (*)(struct _GtkWidget *, union _GdkEvent *, void *)'} to 'void (*)()' [-Wcast-function-type] #define GTK_SIGNAL_FUNC(f) ((GtkSignalFunc) f) ^ avs_win.c:2004:3: note: in expansion of macro 'GTK_SIGNAL_FUNC' GTK_SIGNAL_FUNC(avs_win_list_event_cb), win ^~~~~~~~~~~~~~~ /usr/include/gtk-1.2/gtk/gtktypeutils.h:158:30: warning: cast between incompatible function types from 'gint (*)(GtkWidget *, GdkEvent *, void *)' {aka 'int (*)(struct _GtkWidget *, union _GdkEvent *, void *)'} to 'void (*)()' [-Wcast-function-type] #define GTK_SIGNAL_FUNC(f) ((GtkSignalFunc) f) ^ avs_win.c:2008:3: note: in expansion of macro 'GTK_SIGNAL_FUNC' GTK_SIGNAL_FUNC(avs_win_list_event_cb), win ^~~~~~~~~~~~~~~ /usr/include/gtk-1.2/gtk/gtktypeutils.h:158:30: warning: cast between incompatible function types from 'gint (*)(GtkWidget *, GdkEvent *, void *)' {aka 'int (*)(struct _GtkWidget *, union _GdkEvent *, void *)'} to 'void (*)()' [-Wcast-function-type] #define GTK_SIGNAL_FUNC(f) ((GtkSignalFunc) f) ^ avs_win.c:2012:3: note: in expansion of macro 'GTK_SIGNAL_FUNC' GTK_SIGNAL_FUNC(avs_win_list_event_cb), win ^~~~~~~~~~~~~~~ /usr/include/gtk-1.2/gtk/gtktypeutils.h:158:30: warning: cast between incompatible function types from 'gint (*)(GtkWidget *, GdkEvent *, void *)' {aka 'int (*)(struct _GtkWidget *, union _GdkEvent *, void *)'} to 'void (*)()' [-Wcast-function-type] #define GTK_SIGNAL_FUNC(f) ((GtkSignalFunc) f) ^ avs_win.c:2016:3: note: in expansion of macro 'GTK_SIGNAL_FUNC' GTK_SIGNAL_FUNC(avs_win_list_event_cb), win ^~~~~~~~~~~~~~~ /usr/include/gtk-1.2/gtk/gtktypeutils.h:158:30: warning: cast between incompatible function types from 'gint (*)(GtkWidget *, GdkEventCrossing *, void *)' {aka 'int (*)(struct _GtkWidget *, struct _GdkEventCrossing *, void *)'} to 'void (*)()' [-Wcast-function-type] #define GTK_SIGNAL_FUNC(f) ((GtkSignalFunc) f) ^ avs_win.c:1852:4: note: in expansion of macro 'GTK_SIGNAL_FUNC' GTK_SIGNAL_FUNC(opid->enter_func_cb), opid \ ^~~~~~~~~~~~~~~ avs_win.c:2089:2: note: in expansion of macro 'NEW_ICON_LABEL_BTN' NEW_ICON_LABEL_BTN(AVS_WIN_OPID_ADD, parent5, FALSE); ^~~~~~~~~~~~~~~~~~ /usr/include/gtk-1.2/gtk/gtktypeutils.h:158:30: warning: cast between incompatible function types from 'gint (*)(GtkWidget *, GdkEventCrossing *, void *)' {aka 'int (*)(struct _GtkWidget *, struct _GdkEventCrossing *, void *)'} to 'void (*)()' [-Wcast-function-type] #define GTK_SIGNAL_FUNC(f) ((GtkSignalFunc) f) ^ avs_win.c:1856:4: note: in expansion of macro 'GTK_SIGNAL_FUNC' GTK_SIGNAL_FUNC(opid->leave_func_cb), opid \ ^~~~~~~~~~~~~~~ avs_win.c:2089:2: note: in expansion of macro 'NEW_ICON_LABEL_BTN' NEW_ICON_LABEL_BTN(AVS_WIN_OPID_ADD, parent5, FALSE); ^~~~~~~~~~~~~~~~~~ /usr/include/gtk-1.2/gtk/gtktypeutils.h:158:30: warning: cast between incompatible function types from 'gint (*)(GtkWidget *, GdkEventCrossing *, void *)' {aka 'int (*)(struct _GtkWidget *, struct _GdkEventCrossing *, void *)'} to 'void (*)()' [-Wcast-function-type] #define GTK_SIGNAL_FUNC(f) ((GtkSignalFunc) f) ^ avs_win.c:1852:4: note: in expansion of macro 'GTK_SIGNAL_FUNC' GTK_SIGNAL_FUNC(opid->enter_func_cb), opid \ ^~~~~~~~~~~~~~~ avs_win.c:2091:2: note: in expansion of macro 'NEW_ICON_LABEL_BTN' NEW_ICON_LABEL_BTN(AVS_WIN_OPID_EDIT, parent5, FALSE); ^~~~~~~~~~~~~~~~~~ /usr/include/gtk-1.2/gtk/gtktypeutils.h:158:30: warning: cast between incompatible function types from 'gint (*)(GtkWidget *, GdkEventCrossing *, void *)' {aka 'int (*)(struct _GtkWidget *, struct _GdkEventCrossing *, void *)'} to 'void (*)()' [-Wcast-function-type] #define GTK_SIGNAL_FUNC(f) ((GtkSignalFunc) f) ^ avs_win.c:1856:4: note: in expansion of macro 'GTK_SIGNAL_FUNC' GTK_SIGNAL_FUNC(opid->leave_func_cb), opid \ ^~~~~~~~~~~~~~~ avs_win.c:2091:2: note: in expansion of macro 'NEW_ICON_LABEL_BTN' NEW_ICON_LABEL_BTN(AVS_WIN_OPID_EDIT, parent5, FALSE); ^~~~~~~~~~~~~~~~~~ /usr/include/gtk-1.2/gtk/gtktypeutils.h:158:30: warning: cast between incompatible function types from 'gint (*)(GtkWidget *, GdkEventCrossing *, void *)' {aka 'int (*)(struct _GtkWidget *, struct _GdkEventCrossing *, void *)'} to 'void (*)()' [-Wcast-function-type] #define GTK_SIGNAL_FUNC(f) ((GtkSignalFunc) f) ^ avs_win.c:1852:4: note: in expansion of macro 'GTK_SIGNAL_FUNC' GTK_SIGNAL_FUNC(opid->enter_func_cb), opid \ ^~~~~~~~~~~~~~~ avs_win.c:2093:2: note: in expansion of macro 'NEW_ICON_LABEL_BTN' NEW_ICON_LABEL_BTN(AVS_WIN_OPID_REMOVE, parent5, FALSE); ^~~~~~~~~~~~~~~~~~ /usr/include/gtk-1.2/gtk/gtktypeutils.h:158:30: warning: cast between incompatible function types from 'gint (*)(GtkWidget *, GdkEventCrossing *, void *)' {aka 'int (*)(struct _GtkWidget *, struct _GdkEventCrossing *, void *)'} to 'void (*)()' [-Wcast-function-type] #define GTK_SIGNAL_FUNC(f) ((GtkSignalFunc) f) ^ avs_win.c:1856:4: note: in expansion of macro 'GTK_SIGNAL_FUNC' GTK_SIGNAL_FUNC(opid->leave_func_cb), opid \ ^~~~~~~~~~~~~~~ avs_win.c:2093:2: note: in expansion of macro 'NEW_ICON_LABEL_BTN' NEW_ICON_LABEL_BTN(AVS_WIN_OPID_REMOVE, parent5, FALSE); ^~~~~~~~~~~~~~~~~~ /usr/include/gtk-1.2/gtk/gtktypeutils.h:158:30: warning: cast between incompatible function types from 'gint (*)(GtkWidget *, GdkEventKey *, void *)' {aka 'int (*)(struct _GtkWidget *, struct _GdkEventKey *, void *)'} to 'void (*)()' [-Wcast-function-type] #define GTK_SIGNAL_FUNC(f) ((GtkSignalFunc) f) ^ avs_win.c:2139:3: note: in expansion of macro 'GTK_SIGNAL_FUNC' GTK_SIGNAL_FUNC(avs_win_entry_complete_path_key_event_cb), win ^~~~~~~~~~~~~~~ /usr/include/gtk-1.2/gtk/gtktypeutils.h:158:30: warning: cast between incompatible function types from 'gint (*)(GtkWidget *, GdkEventKey *, void *)' {aka 'int (*)(struct _GtkWidget *, struct _GdkEventKey *, void *)'} to 'void (*)()' [-Wcast-function-type] #define GTK_SIGNAL_FUNC(f) ((GtkSignalFunc) f) ^ avs_win.c:2143:3: note: in expansion of macro 'GTK_SIGNAL_FUNC' GTK_SIGNAL_FUNC(avs_win_entry_complete_path_key_event_cb), win ^~~~~~~~~~~~~~~ /usr/include/gtk-1.2/gtk/gtktypeutils.h:158:30: warning: cast between incompatible function types from 'gint (*)(GtkWidget *, GdkEventCrossing *, void *)' {aka 'int (*)(struct _GtkWidget *, struct _GdkEventCrossing *, void *)'} to 'void (*)()' [-Wcast-function-type] #define GTK_SIGNAL_FUNC(f) ((GtkSignalFunc) f) ^ avs_win.c:1875:3: note: in expansion of macro 'GTK_SIGNAL_FUNC' GTK_SIGNAL_FUNC(opid->enter_func_cb), opid \ ^~~~~~~~~~~~~~~ avs_win.c:2153:2: note: in expansion of macro 'SET_CROSSING' SET_CROSSING(AVS_WIN_OPID_LOCATION, w); ^~~~~~~~~~~~ /usr/include/gtk-1.2/gtk/gtktypeutils.h:158:30: warning: cast between incompatible function types from 'gint (*)(GtkWidget *, GdkEventCrossing *, void *)' {aka 'int (*)(struct _GtkWidget *, struct _GdkEventCrossing *, void *)'} to 'void (*)()' [-Wcast-function-type] #define GTK_SIGNAL_FUNC(f) ((GtkSignalFunc) f) ^ avs_win.c:1879:3: note: in expansion of macro 'GTK_SIGNAL_FUNC' GTK_SIGNAL_FUNC(opid->leave_func_cb), opid \ ^~~~~~~~~~~~~~~ avs_win.c:2153:2: note: in expansion of macro 'SET_CROSSING' SET_CROSSING(AVS_WIN_OPID_LOCATION, w); ^~~~~~~~~~~~ /usr/include/gtk-1.2/gtk/gtktypeutils.h:158:30: warning: cast between incompatible function types from 'gint (*)(GtkWidget *, GdkEventCrossing *, void *)' {aka 'int (*)(struct _GtkWidget *, struct _GdkEventCrossing *, void *)'} to 'void (*)()' [-Wcast-function-type] #define GTK_SIGNAL_FUNC(f) ((GtkSignalFunc) f) ^ avs_win.c:1875:3: note: in expansion of macro 'GTK_SIGNAL_FUNC' GTK_SIGNAL_FUNC(opid->enter_func_cb), opid \ ^~~~~~~~~~~~~~~ avs_win.c:2172:2: note: in expansion of macro 'SET_CROSSING' SET_CROSSING(AVS_WIN_OPID_RECURSIVE, w); ^~~~~~~~~~~~ /usr/include/gtk-1.2/gtk/gtktypeutils.h:158:30: warning: cast between incompatible function types from 'gint (*)(GtkWidget *, GdkEventCrossing *, void *)' {aka 'int (*)(struct _GtkWidget *, struct _GdkEventCrossing *, void *)'} to 'void (*)()' [-Wcast-function-type] #define GTK_SIGNAL_FUNC(f) ((GtkSignalFunc) f) ^ avs_win.c:1879:3: note: in expansion of macro 'GTK_SIGNAL_FUNC' GTK_SIGNAL_FUNC(opid->leave_func_cb), opid \ ^~~~~~~~~~~~~~~ avs_win.c:2172:2: note: in expansion of macro 'SET_CROSSING' SET_CROSSING(AVS_WIN_OPID_RECURSIVE, w); ^~~~~~~~~~~~ /usr/include/gtk-1.2/gtk/gtktypeutils.h:158:30: warning: cast between incompatible function types from 'gint (*)(GtkWidget *, GdkEventCrossing *, void *)' {aka 'int (*)(struct _GtkWidget *, struct _GdkEventCrossing *, void *)'} to 'void (*)()' [-Wcast-function-type] #define GTK_SIGNAL_FUNC(f) ((GtkSignalFunc) f) ^ avs_win.c:1875:3: note: in expansion of macro 'GTK_SIGNAL_FUNC' GTK_SIGNAL_FUNC(opid->enter_func_cb), opid \ ^~~~~~~~~~~~~~~ avs_win.c:2183:2: note: in expansion of macro 'SET_CROSSING' SET_CROSSING(AVS_WIN_OPID_EXECUTABLES_ONLY, w); ^~~~~~~~~~~~ /usr/include/gtk-1.2/gtk/gtktypeutils.h:158:30: warning: cast between incompatible function types from 'gint (*)(GtkWidget *, GdkEventCrossing *, void *)' {aka 'int (*)(struct _GtkWidget *, struct _GdkEventCrossing *, void *)'} to 'void (*)()' [-Wcast-function-type] #define GTK_SIGNAL_FUNC(f) ((GtkSignalFunc) f) ^ avs_win.c:1879:3: note: in expansion of macro 'GTK_SIGNAL_FUNC' GTK_SIGNAL_FUNC(opid->leave_func_cb), opid \ ^~~~~~~~~~~~~~~ avs_win.c:2183:2: note: in expansion of macro 'SET_CROSSING' SET_CROSSING(AVS_WIN_OPID_EXECUTABLES_ONLY, w); ^~~~~~~~~~~~ /usr/include/gtk-1.2/gtk/gtktypeutils.h:158:30: warning: cast between incompatible function types from 'gint (*)(GtkWidget *, GdkEventCrossing *, void *)' {aka 'int (*)(struct _GtkWidget *, struct _GdkEventCrossing *, void *)'} to 'void (*)()' [-Wcast-function-type] #define GTK_SIGNAL_FUNC(f) ((GtkSignalFunc) f) ^ avs_win.c:1875:3: note: in expansion of macro 'GTK_SIGNAL_FUNC' GTK_SIGNAL_FUNC(opid->enter_func_cb), opid \ ^~~~~~~~~~~~~~~ avs_win.c:2193:2: note: in expansion of macro 'SET_CROSSING' SET_CROSSING(AVS_WIN_OPID_EXECUTABLES_ONLY, w); ^~~~~~~~~~~~ /usr/include/gtk-1.2/gtk/gtktypeutils.h:158:30: warning: cast between incompatible function types from 'gint (*)(GtkWidget *, GdkEventCrossing *, void *)' {aka 'int (*)(struct _GtkWidget *, struct _GdkEventCrossing *, void *)'} to 'void (*)()' [-Wcast-function-type] #define GTK_SIGNAL_FUNC(f) ((GtkSignalFunc) f) ^ avs_win.c:1879:3: note: in expansion of macro 'GTK_SIGNAL_FUNC' GTK_SIGNAL_FUNC(opid->leave_func_cb), opid \ ^~~~~~~~~~~~~~~ avs_win.c:2193:2: note: in expansion of macro 'SET_CROSSING' SET_CROSSING(AVS_WIN_OPID_EXECUTABLES_ONLY, w); ^~~~~~~~~~~~ /usr/include/gtk-1.2/gtk/gtktypeutils.h:158:30: warning: cast between incompatible function types from 'gint (*)(GtkWidget *, GdkEventCrossing *, void *)' {aka 'int (*)(struct _GtkWidget *, struct _GdkEventCrossing *, void *)'} to 'void (*)()' [-Wcast-function-type] #define GTK_SIGNAL_FUNC(f) ((GtkSignalFunc) f) ^ avs_win.c:1808:4: note: in expansion of macro 'GTK_SIGNAL_FUNC' GTK_SIGNAL_FUNC(opid->enter_func_cb), opid \ ^~~~~~~~~~~~~~~ avs_win.c:2200:2: note: in expansion of macro 'NEW_ICON_BTN' NEW_ICON_BTN(AVS_WIN_OPID_SCANNER_SETTINGS, parent5, TRUE); ^~~~~~~~~~~~ /usr/include/gtk-1.2/gtk/gtktypeutils.h:158:30: warning: cast between incompatible function types from 'gint (*)(GtkWidget *, GdkEventCrossing *, void *)' {aka 'int (*)(struct _GtkWidget *, struct _GdkEventCrossing *, void *)'} to 'void (*)()' [-Wcast-function-type] #define GTK_SIGNAL_FUNC(f) ((GtkSignalFunc) f) ^ avs_win.c:1812:4: note: in expansion of macro 'GTK_SIGNAL_FUNC' GTK_SIGNAL_FUNC(opid->leave_func_cb), opid \ ^~~~~~~~~~~~~~~ avs_win.c:2200:2: note: in expansion of macro 'NEW_ICON_BTN' NEW_ICON_BTN(AVS_WIN_OPID_SCANNER_SETTINGS, parent5, TRUE); ^~~~~~~~~~~~ /usr/include/gtk-1.2/gtk/gtktypeutils.h:158:30: warning: cast between incompatible function types from 'gint (*)(GtkWidget *, GdkEventCrossing *, void *)' {aka 'int (*)(struct _GtkWidget *, struct _GdkEventCrossing *, void *)'} to 'void (*)()' [-Wcast-function-type] #define GTK_SIGNAL_FUNC(f) ((GtkSignalFunc) f) ^ avs_win.c:1808:4: note: in expansion of macro 'GTK_SIGNAL_FUNC' GTK_SIGNAL_FUNC(opid->enter_func_cb), opid \ ^~~~~~~~~~~~~~~ avs_win.c:2202:2: note: in expansion of macro 'NEW_ICON_BTN' NEW_ICON_BTN(AVS_WIN_OPID_DB_LOCATION, parent5, TRUE); ^~~~~~~~~~~~ /usr/include/gtk-1.2/gtk/gtktypeutils.h:158:30: warning: cast between incompatible function types from 'gint (*)(GtkWidget *, GdkEventCrossing *, void *)' {aka 'int (*)(struct _GtkWidget *, struct _GdkEventCrossing *, void *)'} to 'void (*)()' [-Wcast-function-type] #define GTK_SIGNAL_FUNC(f) ((GtkSignalFunc) f) ^ avs_win.c:1812:4: note: in expansion of macro 'GTK_SIGNAL_FUNC' GTK_SIGNAL_FUNC(opid->leave_func_cb), opid \ ^~~~~~~~~~~~~~~ avs_win.c:2202:2: note: in expansion of macro 'NEW_ICON_BTN' NEW_ICON_BTN(AVS_WIN_OPID_DB_LOCATION, parent5, TRUE); ^~~~~~~~~~~~ /usr/include/gtk-1.2/gtk/gtktypeutils.h:158:30: warning: cast between incompatible function types from 'gint (*)(GtkWidget *, GdkEventCrossing *, void *)' {aka 'int (*)(struct _GtkWidget *, struct _GdkEventCrossing *, void *)'} to 'void (*)()' [-Wcast-function-type] #define GTK_SIGNAL_FUNC(f) ((GtkSignalFunc) f) ^ avs_win.c:1852:4: note: in expansion of macro 'GTK_SIGNAL_FUNC' GTK_SIGNAL_FUNC(opid->enter_func_cb), opid \ ^~~~~~~~~~~~~~~ avs_win.c:2300:2: note: in expansion of macro 'NEW_ICON_LABEL_BTN' NEW_ICON_LABEL_BTN(AVS_WIN_OPID_RESULTS_REPORT, parent6, FALSE); ^~~~~~~~~~~~~~~~~~ /usr/include/gtk-1.2/gtk/gtktypeutils.h:158:30: warning: cast between incompatible function types from 'gint (*)(GtkWidget *, GdkEventCrossing *, void *)' {aka 'int (*)(struct _GtkWidget *, struct _GdkEventCrossing *, void *)'} to 'void (*)()' [-Wcast-function-type] #define GTK_SIGNAL_FUNC(f) ((GtkSignalFunc) f) ^ avs_win.c:1856:4: note: in expansion of macro 'GTK_SIGNAL_FUNC' GTK_SIGNAL_FUNC(opid->leave_func_cb), opid \ ^~~~~~~~~~~~~~~ avs_win.c:2300:2: note: in expansion of macro 'NEW_ICON_LABEL_BTN' NEW_ICON_LABEL_BTN(AVS_WIN_OPID_RESULTS_REPORT, parent6, FALSE); ^~~~~~~~~~~~~~~~~~ /usr/include/gtk-1.2/gtk/gtktypeutils.h:158:30: warning: cast between incompatible function types from 'gint (*)(GtkWidget *, GdkEvent *, void *)' {aka 'int (*)(struct _GtkWidget *, union _GdkEvent *, void *)'} to 'void (*)()' [-Wcast-function-type] #define GTK_SIGNAL_FUNC(f) ((GtkSignalFunc) f) ^ avs_win.c:2335:3: note: in expansion of macro 'GTK_SIGNAL_FUNC' GTK_SIGNAL_FUNC(avs_win_list_event_cb), win ^~~~~~~~~~~~~~~ /usr/include/gtk-1.2/gtk/gtktypeutils.h:158:30: warning: cast between incompatible function types from 'gint (*)(GtkWidget *, GdkEvent *, void *)' {aka 'int (*)(struct _GtkWidget *, union _GdkEvent *, void *)'} to 'void (*)()' [-Wcast-function-type] #define GTK_SIGNAL_FUNC(f) ((GtkSignalFunc) f) ^ avs_win.c:2339:3: note: in expansion of macro 'GTK_SIGNAL_FUNC' GTK_SIGNAL_FUNC(avs_win_list_event_cb), win ^~~~~~~~~~~~~~~ /usr/include/gtk-1.2/gtk/gtktypeutils.h:158:30: warning: cast between incompatible function types from 'gint (*)(GtkWidget *, GdkEvent *, void *)' {aka 'int (*)(struct _GtkWidget *, union _GdkEvent *, void *)'} to 'void (*)()' [-Wcast-function-type] #define GTK_SIGNAL_FUNC(f) ((GtkSignalFunc) f) ^ avs_win.c:2343:3: note: in expansion of macro 'GTK_SIGNAL_FUNC' GTK_SIGNAL_FUNC(avs_win_list_event_cb), win ^~~~~~~~~~~~~~~ /usr/include/gtk-1.2/gtk/gtktypeutils.h:158:30: warning: cast between incompatible function types from 'gint (*)(GtkWidget *, GdkEvent *, void *)' {aka 'int (*)(struct _GtkWidget *, union _GdkEvent *, void *)'} to 'void (*)()' [-Wcast-function-type] #define GTK_SIGNAL_FUNC(f) ((GtkSignalFunc) f) ^ avs_win.c:2347:3: note: in expansion of macro 'GTK_SIGNAL_FUNC' GTK_SIGNAL_FUNC(avs_win_list_event_cb), win ^~~~~~~~~~~~~~~ /usr/include/gtk-1.2/gtk/gtktypeutils.h:158:30: warning: cast between incompatible function types from 'gint (*)(GtkWidget *, GdkEvent *, void *)' {aka 'int (*)(struct _GtkWidget *, union _GdkEvent *, void *)'} to 'void (*)()' [-Wcast-function-type] #define GTK_SIGNAL_FUNC(f) ((GtkSignalFunc) f) ^ avs_win.c:2351:3: note: in expansion of macro 'GTK_SIGNAL_FUNC' GTK_SIGNAL_FUNC(avs_win_list_event_cb), win ^~~~~~~~~~~~~~~ /usr/include/gtk-1.2/gtk/gtktypeutils.h:158:30: warning: cast between incompatible function types from 'gint (*)(GtkWidget *, GdkEventCrossing *, void *)' {aka 'int (*)(struct _GtkWidget *, struct _GdkEventCrossing *, void *)'} to 'void (*)()' [-Wcast-function-type] #define GTK_SIGNAL_FUNC(f) ((GtkSignalFunc) f) ^ avs_win.c:1852:4: note: in expansion of macro 'GTK_SIGNAL_FUNC' GTK_SIGNAL_FUNC(opid->enter_func_cb), opid \ ^~~~~~~~~~~~~~~ avs_win.c:2411:2: note: in expansion of macro 'NEW_ICON_LABEL_BTN' NEW_ICON_LABEL_BTN(AVS_WIN_OPID_RESULTS_RECYCLE, parent5, FALSE); ^~~~~~~~~~~~~~~~~~ /usr/include/gtk-1.2/gtk/gtktypeutils.h:158:30: warning: cast between incompatible function types from 'gint (*)(GtkWidget *, GdkEventCrossing *, void *)' {aka 'int (*)(struct _GtkWidget *, struct _GdkEventCrossing *, void *)'} to 'void (*)()' [-Wcast-function-type] #define GTK_SIGNAL_FUNC(f) ((GtkSignalFunc) f) ^ avs_win.c:1856:4: note: in expansion of macro 'GTK_SIGNAL_FUNC' GTK_SIGNAL_FUNC(opid->leave_func_cb), opid \ ^~~~~~~~~~~~~~~ avs_win.c:2411:2: note: in expansion of macro 'NEW_ICON_LABEL_BTN' NEW_ICON_LABEL_BTN(AVS_WIN_OPID_RESULTS_RECYCLE, parent5, FALSE); ^~~~~~~~~~~~~~~~~~ /usr/include/gtk-1.2/gtk/gtktypeutils.h:158:30: warning: cast between incompatible function types from 'gint (*)(GtkWidget *, GdkEventCrossing *, void *)' {aka 'int (*)(struct _GtkWidget *, struct _GdkEventCrossing *, void *)'} to 'void (*)()' [-Wcast-function-type] #define GTK_SIGNAL_FUNC(f) ((GtkSignalFunc) f) ^ avs_win.c:1852:4: note: in expansion of macro 'GTK_SIGNAL_FUNC' GTK_SIGNAL_FUNC(opid->enter_func_cb), opid \ ^~~~~~~~~~~~~~~ avs_win.c:2413:2: note: in expansion of macro 'NEW_ICON_LABEL_BTN' NEW_ICON_LABEL_BTN(AVS_WIN_OPID_RESULTS_MOVE, parent5, FALSE); ^~~~~~~~~~~~~~~~~~ /usr/include/gtk-1.2/gtk/gtktypeutils.h:158:30: warning: cast between incompatible function types from 'gint (*)(GtkWidget *, GdkEventCrossing *, void *)' {aka 'int (*)(struct _GtkWidget *, struct _GdkEventCrossing *, void *)'} to 'void (*)()' [-Wcast-function-type] #define GTK_SIGNAL_FUNC(f) ((GtkSignalFunc) f) ^ avs_win.c:1856:4: note: in expansion of macro 'GTK_SIGNAL_FUNC' GTK_SIGNAL_FUNC(opid->leave_func_cb), opid \ ^~~~~~~~~~~~~~~ avs_win.c:2413:2: note: in expansion of macro 'NEW_ICON_LABEL_BTN' NEW_ICON_LABEL_BTN(AVS_WIN_OPID_RESULTS_MOVE, parent5, FALSE); ^~~~~~~~~~~~~~~~~~ /usr/include/gtk-1.2/gtk/gtktypeutils.h:158:30: warning: cast between incompatible function types from 'gint (*)(GtkWidget *, GdkEventCrossing *, void *)' {aka 'int (*)(struct _GtkWidget *, struct _GdkEventCrossing *, void *)'} to 'void (*)()' [-Wcast-function-type] #define GTK_SIGNAL_FUNC(f) ((GtkSignalFunc) f) ^ avs_win.c:1808:4: note: in expansion of macro 'GTK_SIGNAL_FUNC' GTK_SIGNAL_FUNC(opid->enter_func_cb), opid \ ^~~~~~~~~~~~~~~ avs_win.c:2417:2: note: in expansion of macro 'NEW_ICON_BTN' NEW_ICON_BTN(AVS_WIN_OPID_RESULTS_SAVE_AS, parent5, TRUE); ^~~~~~~~~~~~ /usr/include/gtk-1.2/gtk/gtktypeutils.h:158:30: warning: cast between incompatible function types from 'gint (*)(GtkWidget *, GdkEventCrossing *, void *)' {aka 'int (*)(struct _GtkWidget *, struct _GdkEventCrossing *, void *)'} to 'void (*)()' [-Wcast-function-type] #define GTK_SIGNAL_FUNC(f) ((GtkSignalFunc) f) ^ avs_win.c:1812:4: note: in expansion of macro 'GTK_SIGNAL_FUNC' GTK_SIGNAL_FUNC(opid->leave_func_cb), opid \ ^~~~~~~~~~~~~~~ avs_win.c:2417:2: note: in expansion of macro 'NEW_ICON_BTN' NEW_ICON_BTN(AVS_WIN_OPID_RESULTS_SAVE_AS, parent5, TRUE); ^~~~~~~~~~~~ /usr/include/gtk-1.2/gtk/gtktypeutils.h:158:30: warning: cast between incompatible function types from 'gint (*)(GtkWidget *, GdkEventCrossing *, void *)' {aka 'int (*)(struct _GtkWidget *, struct _GdkEventCrossing *, void *)'} to 'void (*)()' [-Wcast-function-type] #define GTK_SIGNAL_FUNC(f) ((GtkSignalFunc) f) ^ avs_win.c:1808:4: note: in expansion of macro 'GTK_SIGNAL_FUNC' GTK_SIGNAL_FUNC(opid->enter_func_cb), opid \ ^~~~~~~~~~~~~~~ avs_win.c:2419:2: note: in expansion of macro 'NEW_ICON_BTN' NEW_ICON_BTN(AVS_WIN_OPID_RESULTS_OPEN, parent5, TRUE); ^~~~~~~~~~~~ /usr/include/gtk-1.2/gtk/gtktypeutils.h:158:30: warning: cast between incompatible function types from 'gint (*)(GtkWidget *, GdkEventCrossing *, void *)' {aka 'int (*)(struct _GtkWidget *, struct _GdkEventCrossing *, void *)'} to 'void (*)()' [-Wcast-function-type] #define GTK_SIGNAL_FUNC(f) ((GtkSignalFunc) f) ^ avs_win.c:1812:4: note: in expansion of macro 'GTK_SIGNAL_FUNC' GTK_SIGNAL_FUNC(opid->leave_func_cb), opid \ ^~~~~~~~~~~~~~~ avs_win.c:2419:2: note: in expansion of macro 'NEW_ICON_BTN' NEW_ICON_BTN(AVS_WIN_OPID_RESULTS_OPEN, parent5, TRUE); ^~~~~~~~~~~~ /usr/include/gtk-1.2/gtk/gtktypeutils.h:158:30: warning: cast between incompatible function types from 'gint (*)(GtkWidget *, GdkEventCrossing *, void *)' {aka 'int (*)(struct _GtkWidget *, struct _GdkEventCrossing *, void *)'} to 'void (*)()' [-Wcast-function-type] #define GTK_SIGNAL_FUNC(f) ((GtkSignalFunc) f) ^ avs_win.c:1808:4: note: in expansion of macro 'GTK_SIGNAL_FUNC' GTK_SIGNAL_FUNC(opid->enter_func_cb), opid \ ^~~~~~~~~~~~~~~ avs_win.c:2421:2: note: in expansion of macro 'NEW_ICON_BTN' NEW_ICON_BTN(AVS_WIN_OPID_RESULTS_CLEAR, parent5, TRUE); ^~~~~~~~~~~~ /usr/include/gtk-1.2/gtk/gtktypeutils.h:158:30: warning: cast between incompatible function types from 'gint (*)(GtkWidget *, GdkEventCrossing *, void *)' {aka 'int (*)(struct _GtkWidget *, struct _GdkEventCrossing *, void *)'} to 'void (*)()' [-Wcast-function-type] #define GTK_SIGNAL_FUNC(f) ((GtkSignalFunc) f) ^ avs_win.c:1812:4: note: in expansion of macro 'GTK_SIGNAL_FUNC' GTK_SIGNAL_FUNC(opid->leave_func_cb), opid \ ^~~~~~~~~~~~~~~ avs_win.c:2421:2: note: in expansion of macro 'NEW_ICON_BTN' NEW_ICON_BTN(AVS_WIN_OPID_RESULTS_CLEAR, parent5, TRUE); ^~~~~~~~~~~~ /usr/include/gtk-1.2/gtk/gtktypeutils.h:158:30: warning: cast between incompatible function types from 'gint (*)(GtkWidget *, GdkEventCrossing *, void *)' {aka 'int (*)(struct _GtkWidget *, struct _GdkEventCrossing *, void *)'} to 'void (*)()' [-Wcast-function-type] #define GTK_SIGNAL_FUNC(f) ((GtkSignalFunc) f) ^ avs_win.c:1852:4: note: in expansion of macro 'GTK_SIGNAL_FUNC' GTK_SIGNAL_FUNC(opid->enter_func_cb), opid \ ^~~~~~~~~~~~~~~ avs_win.c:2638:2: note: in expansion of macro 'NEW_ICON_LABEL_BTN' NEW_ICON_LABEL_BTN(AVS_WIN_OPID_DB_LOCATION, parent6, FALSE); ^~~~~~~~~~~~~~~~~~ /usr/include/gtk-1.2/gtk/gtktypeutils.h:158:30: warning: cast between incompatible function types from 'gint (*)(GtkWidget *, GdkEventCrossing *, void *)' {aka 'int (*)(struct _GtkWidget *, struct _GdkEventCrossing *, void *)'} to 'void (*)()' [-Wcast-function-type] #define GTK_SIGNAL_FUNC(f) ((GtkSignalFunc) f) ^ avs_win.c:1856:4: note: in expansion of macro 'GTK_SIGNAL_FUNC' GTK_SIGNAL_FUNC(opid->leave_func_cb), opid \ ^~~~~~~~~~~~~~~ avs_win.c:2638:2: note: in expansion of macro 'NEW_ICON_LABEL_BTN' NEW_ICON_LABEL_BTN(AVS_WIN_OPID_DB_LOCATION, parent6, FALSE); ^~~~~~~~~~~~~~~~~~ /usr/include/gtk-1.2/gtk/gtktypeutils.h:158:30: warning: cast between incompatible function types from 'gint (*)(GtkWidget *, GdkEventCrossing *, void *)' {aka 'int (*)(struct _GtkWidget *, struct _GdkEventCrossing *, void *)'} to 'void (*)()' [-Wcast-function-type] #define GTK_SIGNAL_FUNC(f) ((GtkSignalFunc) f) ^ avs_win.c:1852:4: note: in expansion of macro 'GTK_SIGNAL_FUNC' GTK_SIGNAL_FUNC(opid->enter_func_cb), opid \ ^~~~~~~~~~~~~~~ avs_win.c:2641:2: note: in expansion of macro 'NEW_ICON_LABEL_BTN' NEW_ICON_LABEL_BTN(AVS_WIN_OPID_DB_UPDATE_NET, parent6, FALSE); ^~~~~~~~~~~~~~~~~~ /usr/include/gtk-1.2/gtk/gtktypeutils.h:158:30: warning: cast between incompatible function types from 'gint (*)(GtkWidget *, GdkEventCrossing *, void *)' {aka 'int (*)(struct _GtkWidget *, struct _GdkEventCrossing *, void *)'} to 'void (*)()' [-Wcast-function-type] #define GTK_SIGNAL_FUNC(f) ((GtkSignalFunc) f) ^ avs_win.c:1856:4: note: in expansion of macro 'GTK_SIGNAL_FUNC' GTK_SIGNAL_FUNC(opid->leave_func_cb), opid \ ^~~~~~~~~~~~~~~ avs_win.c:2641:2: note: in expansion of macro 'NEW_ICON_LABEL_BTN' NEW_ICON_LABEL_BTN(AVS_WIN_OPID_DB_UPDATE_NET, parent6, FALSE); ^~~~~~~~~~~~~~~~~~ /usr/include/gtk-1.2/gtk/gtktypeutils.h:158:30: warning: cast between incompatible function types from 'gint (*)(GtkWidget *, GdkEventCrossing *, void *)' {aka 'int (*)(struct _GtkWidget *, struct _GdkEventCrossing *, void *)'} to 'void (*)()' [-Wcast-function-type] #define GTK_SIGNAL_FUNC(f) ((GtkSignalFunc) f) ^ avs_win.c:1852:4: note: in expansion of macro 'GTK_SIGNAL_FUNC' GTK_SIGNAL_FUNC(opid->enter_func_cb), opid \ ^~~~~~~~~~~~~~~ avs_win.c:2696:2: note: in expansion of macro 'NEW_ICON_LABEL_BTN' NEW_ICON_LABEL_BTN(AVS_WIN_OPID_START, parent3, TRUE); ^~~~~~~~~~~~~~~~~~ /usr/include/gtk-1.2/gtk/gtktypeutils.h:158:30: warning: cast between incompatible function types from 'gint (*)(GtkWidget *, GdkEventCrossing *, void *)' {aka 'int (*)(struct _GtkWidget *, struct _GdkEventCrossing *, void *)'} to 'void (*)()' [-Wcast-function-type] #define GTK_SIGNAL_FUNC(f) ((GtkSignalFunc) f) ^ avs_win.c:1856:4: note: in expansion of macro 'GTK_SIGNAL_FUNC' GTK_SIGNAL_FUNC(opid->leave_func_cb), opid \ ^~~~~~~~~~~~~~~ avs_win.c:2696:2: note: in expansion of macro 'NEW_ICON_LABEL_BTN' NEW_ICON_LABEL_BTN(AVS_WIN_OPID_START, parent3, TRUE); ^~~~~~~~~~~~~~~~~~ /usr/include/gtk-1.2/gtk/gtktypeutils.h:158:30: warning: cast between incompatible function types from 'gint (*)(GtkWidget *, GdkEventCrossing *, void *)' {aka 'int (*)(struct _GtkWidget *, struct _GdkEventCrossing *, void *)'} to 'void (*)()' [-Wcast-function-type] #define GTK_SIGNAL_FUNC(f) ((GtkSignalFunc) f) ^ avs_win.c:1852:4: note: in expansion of macro 'GTK_SIGNAL_FUNC' GTK_SIGNAL_FUNC(opid->enter_func_cb), opid \ ^~~~~~~~~~~~~~~ avs_win.c:2698:2: note: in expansion of macro 'NEW_ICON_LABEL_BTN' NEW_ICON_LABEL_BTN(AVS_WIN_OPID_STOP, parent3, TRUE); ^~~~~~~~~~~~~~~~~~ /usr/include/gtk-1.2/gtk/gtktypeutils.h:158:30: warning: cast between incompatible function types from 'gint (*)(GtkWidget *, GdkEventCrossing *, void *)' {aka 'int (*)(struct _GtkWidget *, struct _GdkEventCrossing *, void *)'} to 'void (*)()' [-Wcast-function-type] #define GTK_SIGNAL_FUNC(f) ((GtkSignalFunc) f) ^ avs_win.c:1856:4: note: in expansion of macro 'GTK_SIGNAL_FUNC' GTK_SIGNAL_FUNC(opid->leave_func_cb), opid \ ^~~~~~~~~~~~~~~ avs_win.c:2698:2: note: in expansion of macro 'NEW_ICON_LABEL_BTN' NEW_ICON_LABEL_BTN(AVS_WIN_OPID_STOP, parent3, TRUE); ^~~~~~~~~~~~~~~~~~ /usr/include/gtk-1.2/gtk/gtktypeutils.h:158:30: warning: cast between incompatible function types from 'gint (*)(GtkWidget *, GdkEventCrossing *, void *)' {aka 'int (*)(struct _GtkWidget *, struct _GdkEventCrossing *, void *)'} to 'void (*)()' [-Wcast-function-type] #define GTK_SIGNAL_FUNC(f) ((GtkSignalFunc) f) ^ avs_win.c:1852:4: note: in expansion of macro 'GTK_SIGNAL_FUNC' GTK_SIGNAL_FUNC(opid->enter_func_cb), opid \ ^~~~~~~~~~~~~~~ avs_win.c:2700:2: note: in expansion of macro 'NEW_ICON_LABEL_BTN' NEW_ICON_LABEL_BTN(AVS_WIN_OPID_PAUSE_RESUME, parent3, TRUE); ^~~~~~~~~~~~~~~~~~ /usr/include/gtk-1.2/gtk/gtktypeutils.h:158:30: warning: cast between incompatible function types from 'gint (*)(GtkWidget *, GdkEventCrossing *, void *)' {aka 'int (*)(struct _GtkWidget *, struct _GdkEventCrossing *, void *)'} to 'void (*)()' [-Wcast-function-type] #define GTK_SIGNAL_FUNC(f) ((GtkSignalFunc) f) ^ avs_win.c:1856:4: note: in expansion of macro 'GTK_SIGNAL_FUNC' GTK_SIGNAL_FUNC(opid->leave_func_cb), opid \ ^~~~~~~~~~~~~~~ avs_win.c:2700:2: note: in expansion of macro 'NEW_ICON_LABEL_BTN' NEW_ICON_LABEL_BTN(AVS_WIN_OPID_PAUSE_RESUME, parent3, TRUE); ^~~~~~~~~~~~~~~~~~ /usr/include/gtk-1.2/gtk/gtktypeutils.h:158:30: warning: cast between incompatible function types from 'gint (*)(GtkWidget *, GdkEventCrossing *, void *)' {aka 'int (*)(struct _GtkWidget *, struct _GdkEventCrossing *, void *)'} to 'void (*)()' [-Wcast-function-type] #define GTK_SIGNAL_FUNC(f) ((GtkSignalFunc) f) ^ avs_win.c:1852:4: note: in expansion of macro 'GTK_SIGNAL_FUNC' GTK_SIGNAL_FUNC(opid->enter_func_cb), opid \ ^~~~~~~~~~~~~~~ avs_win.c:2709:2: note: in expansion of macro 'NEW_ICON_LABEL_BTN' NEW_ICON_LABEL_BTN(AVS_WIN_OPID_CLOSE, parent3, TRUE); ^~~~~~~~~~~~~~~~~~ /usr/include/gtk-1.2/gtk/gtktypeutils.h:158:30: warning: cast between incompatible function types from 'gint (*)(GtkWidget *, GdkEventCrossing *, void *)' {aka 'int (*)(struct _GtkWidget *, struct _GdkEventCrossing *, void *)'} to 'void (*)()' [-Wcast-function-type] #define GTK_SIGNAL_FUNC(f) ((GtkSignalFunc) f) ^ avs_win.c:1856:4: note: in expansion of macro 'GTK_SIGNAL_FUNC' GTK_SIGNAL_FUNC(opid->leave_func_cb), opid \ ^~~~~~~~~~~~~~~ avs_win.c:2709:2: note: in expansion of macro 'NEW_ICON_LABEL_BTN' NEW_ICON_LABEL_BTN(AVS_WIN_OPID_CLOSE, parent3, TRUE); ^~~~~~~~~~~~~~~~~~ avs_win.c: In function 'avs_win_new': /usr/include/gtk-1.2/gtk/gtktypeutils.h:158:30: warning: cast between incompatible function types from 'gint (*)(GtkWidget *, GdkEvent *, void *)' {aka 'int (*)(struct _GtkWidget *, union _GdkEvent *, void *)'} to 'void (*)()' [-Wcast-function-type] #define GTK_SIGNAL_FUNC(f) ((GtkSignalFunc) f) ^ avs_win.c:3059:3: note: in expansion of macro 'GTK_SIGNAL_FUNC' GTK_SIGNAL_FUNC(avs_win_event_cb), win ^~~~~~~~~~~~~~~ /usr/include/gtk-1.2/gtk/gtktypeutils.h:158:30: warning: cast between incompatible function types from 'gint (*)(GtkWidget *, GdkEvent *, void *)' {aka 'int (*)(struct _GtkWidget *, union _GdkEvent *, void *)'} to 'void (*)()' [-Wcast-function-type] #define GTK_SIGNAL_FUNC(f) ((GtkSignalFunc) f) ^ avs_win.c:3063:3: note: in expansion of macro 'GTK_SIGNAL_FUNC' GTK_SIGNAL_FUNC(avs_win_event_cb), win ^~~~~~~~~~~~~~~ /usr/include/gtk-1.2/gtk/gtktypeutils.h:158:30: warning: cast between incompatible function types from 'gint (*)(GtkWidget *, GdkEvent *, void *)' {aka 'int (*)(struct _GtkWidget *, union _GdkEvent *, void *)'} to 'void (*)()' [-Wcast-function-type] #define GTK_SIGNAL_FUNC(f) ((GtkSignalFunc) f) ^ avs_win.c:3090:3: note: in expansion of macro 'GTK_SIGNAL_FUNC' GTK_SIGNAL_FUNC(avs_win_event_cb), win ^~~~~~~~~~~~~~~ avs_win.c:3099:2: warning: implicit declaration of function 'memcpy' [-Wimplicit-function-declaration] memcpy((_ct_), (_cs_), sizeof(GdkColor)); \ ^~~~~~ avs_win.c:3114:3: note: in expansion of macro 'REALLOC_COLOR' REALLOC_COLOR(&style->fg[state], &c_fg); ^~~~~~~~~~~~~ avs_win.c:3099:2: warning: incompatible implicit declaration of built-in function 'memcpy' memcpy((_ct_), (_cs_), sizeof(GdkColor)); \ ^~~~~~ avs_win.c:3114:3: note: in expansion of macro 'REALLOC_COLOR' REALLOC_COLOR(&style->fg[state], &c_fg); ^~~~~~~~~~~~~ avs_win.c:3099:2: note: include '<string.h>' or provide a declaration of 'memcpy' memcpy((_ct_), (_cs_), sizeof(GdkColor)); \ ^~~~~~ avs_win.c:3114:3: note: in expansion of macro 'REALLOC_COLOR' REALLOC_COLOR(&style->fg[state], &c_fg); ^~~~~~~~~~~~~ avs_win.c:3099:2: warning: incompatible implicit declaration of built-in function 'memcpy' memcpy((_ct_), (_cs_), sizeof(GdkColor)); \ ^~~~~~ avs_win.c:3115:3: note: in expansion of macro 'REALLOC_COLOR' REALLOC_COLOR(&style->text[state], &c_fg); ^~~~~~~~~~~~~ avs_win.c:3099:2: note: include '<string.h>' or provide a declaration of 'memcpy' memcpy((_ct_), (_cs_), sizeof(GdkColor)); \ ^~~~~~ avs_win.c:3115:3: note: in expansion of macro 'REALLOC_COLOR' REALLOC_COLOR(&style->text[state], &c_fg); ^~~~~~~~~~~~~ avs_win.c:3099:2: warning: incompatible implicit declaration of built-in function 'memcpy' memcpy((_ct_), (_cs_), sizeof(GdkColor)); \ ^~~~~~ avs_win.c:3116:3: note: in expansion of macro 'REALLOC_COLOR' REALLOC_COLOR(&style->bg[state], &c_bg); ^~~~~~~~~~~~~ avs_win.c:3099:2: note: include '<string.h>' or provide a declaration of 'memcpy' memcpy((_ct_), (_cs_), sizeof(GdkColor)); \ ^~~~~~ avs_win.c:3116:3: note: in expansion of macro 'REALLOC_COLOR' REALLOC_COLOR(&style->bg[state], &c_bg); ^~~~~~~~~~~~~ avs_win.c:3099:2: warning: incompatible implicit declaration of built-in function 'memcpy' memcpy((_ct_), (_cs_), sizeof(GdkColor)); \ ^~~~~~ avs_win.c:3117:3: note: in expansion of macro 'REALLOC_COLOR' REALLOC_COLOR(&style->base[state], &c_bg); ^~~~~~~~~~~~~ avs_win.c:3099:2: note: include '<string.h>' or provide a declaration of 'memcpy' memcpy((_ct_), (_cs_), sizeof(GdkColor)); \ ^~~~~~ avs_win.c:3117:3: note: in expansion of macro 'REALLOC_COLOR' REALLOC_COLOR(&style->base[state], &c_bg); ^~~~~~~~~~~~~ avs_win.c:3099:2: warning: incompatible implicit declaration of built-in function 'memcpy' memcpy((_ct_), (_cs_), sizeof(GdkColor)); \ ^~~~~~ avs_win.c:3120:3: note: in expansion of macro 'REALLOC_COLOR' REALLOC_COLOR(&style->fg[state], &c_fg); ^~~~~~~~~~~~~ avs_win.c:3099:2: note: include '<string.h>' or provide a declaration of 'memcpy' memcpy((_ct_), (_cs_), sizeof(GdkColor)); \ ^~~~~~ avs_win.c:3120:3: note: in expansion of macro 'REALLOC_COLOR' REALLOC_COLOR(&style->fg[state], &c_fg); ^~~~~~~~~~~~~ avs_win.c:3099:2: warning: incompatible implicit declaration of built-in function 'memcpy' memcpy((_ct_), (_cs_), sizeof(GdkColor)); \ ^~~~~~ avs_win.c:3121:3: note: in expansion of macro 'REALLOC_COLOR' REALLOC_COLOR(&style->text[state], &c_fg); ^~~~~~~~~~~~~ avs_win.c:3099:2: note: include '<string.h>' or provide a declaration of 'memcpy' memcpy((_ct_), (_cs_), sizeof(GdkColor)); \ ^~~~~~ avs_win.c:3121:3: note: in expansion of macro 'REALLOC_COLOR' REALLOC_COLOR(&style->text[state], &c_fg); ^~~~~~~~~~~~~ avs_win.c:3099:2: warning: incompatible implicit declaration of built-in function 'memcpy' memcpy((_ct_), (_cs_), sizeof(GdkColor)); \ ^~~~~~ avs_win.c:3122:3: note: in expansion of macro 'REALLOC_COLOR' REALLOC_COLOR(&style->bg[state], &c_bg); ^~~~~~~~~~~~~ avs_win.c:3099:2: note: include '<string.h>' or provide a declaration of 'memcpy' memcpy((_ct_), (_cs_), sizeof(GdkColor)); \ ^~~~~~ avs_win.c:3122:3: note: in expansion of macro 'REALLOC_COLOR' REALLOC_COLOR(&style->bg[state], &c_bg); ^~~~~~~~~~~~~ avs_win.c:3099:2: warning: incompatible implicit declaration of built-in function 'memcpy' memcpy((_ct_), (_cs_), sizeof(GdkColor)); \ ^~~~~~ avs_win.c:3123:3: note: in expansion of macro 'REALLOC_COLOR' REALLOC_COLOR(&style->base[state], &c_bg); ^~~~~~~~~~~~~ avs_win.c:3099:2: note: include '<string.h>' or provide a declaration of 'memcpy' memcpy((_ct_), (_cs_), sizeof(GdkColor)); \ ^~~~~~ avs_win.c:3123:3: note: in expansion of macro 'REALLOC_COLOR' REALLOC_COLOR(&style->base[state], &c_bg); ^~~~~~~~~~~~~ avs_win.c:3099:2: warning: incompatible implicit declaration of built-in function 'memcpy' memcpy((_ct_), (_cs_), sizeof(GdkColor)); \ ^~~~~~ avs_win.c:3126:3: note: in expansion of macro 'REALLOC_COLOR' REALLOC_COLOR(&style->fg[state], &c_fg); ^~~~~~~~~~~~~ avs_win.c:3099:2: note: include '<string.h>' or provide a declaration of 'memcpy' memcpy((_ct_), (_cs_), sizeof(GdkColor)); \ ^~~~~~ avs_win.c:3126:3: note: in expansion of macro 'REALLOC_COLOR' REALLOC_COLOR(&style->fg[state], &c_fg); ^~~~~~~~~~~~~ avs_win.c:3099:2: warning: incompatible implicit declaration of built-in function 'memcpy' memcpy((_ct_), (_cs_), sizeof(GdkColor)); \ ^~~~~~ avs_win.c:3127:3: note: in expansion of macro 'REALLOC_COLOR' REALLOC_COLOR(&style->text[state], &c_fg); ^~~~~~~~~~~~~ avs_win.c:3099:2: note: include '<string.h>' or provide a declaration of 'memcpy' memcpy((_ct_), (_cs_), sizeof(GdkColor)); \ ^~~~~~ avs_win.c:3127:3: note: in expansion of macro 'REALLOC_COLOR' REALLOC_COLOR(&style->text[state], &c_fg); ^~~~~~~~~~~~~ avs_win.c:3099:2: warning: incompatible implicit declaration of built-in function 'memcpy' memcpy((_ct_), (_cs_), sizeof(GdkColor)); \ ^~~~~~ avs_win.c:3128:3: note: in expansion of macro 'REALLOC_COLOR' REALLOC_COLOR(&style->bg[state], &c_bg); ^~~~~~~~~~~~~ avs_win.c:3099:2: note: include '<string.h>' or provide a declaration of 'memcpy' memcpy((_ct_), (_cs_), sizeof(GdkColor)); \ ^~~~~~ avs_win.c:3128:3: note: in expansion of macro 'REALLOC_COLOR' REALLOC_COLOR(&style->bg[state], &c_bg); ^~~~~~~~~~~~~ avs_win.c:3099:2: warning: incompatible implicit declaration of built-in function 'memcpy' memcpy((_ct_), (_cs_), sizeof(GdkColor)); \ ^~~~~~ avs_win.c:3129:3: note: in expansion of macro 'REALLOC_COLOR' REALLOC_COLOR(&style->base[state], &c_bg); ^~~~~~~~~~~~~ avs_win.c:3099:2: note: include '<string.h>' or provide a declaration of 'memcpy' memcpy((_ct_), (_cs_), sizeof(GdkColor)); \ ^~~~~~ avs_win.c:3129:3: note: in expansion of macro 'REALLOC_COLOR' REALLOC_COLOR(&style->base[state], &c_bg); ^~~~~~~~~~~~~ avs_win.c:3099:2: warning: incompatible implicit declaration of built-in function 'memcpy' memcpy((_ct_), (_cs_), sizeof(GdkColor)); \ ^~~~~~ avs_win.c:3132:3: note: in expansion of macro 'REALLOC_COLOR' REALLOC_COLOR(&style->fg[state], &c_fg2); ^~~~~~~~~~~~~ avs_win.c:3099:2: note: include '<string.h>' or provide a declaration of 'memcpy' memcpy((_ct_), (_cs_), sizeof(GdkColor)); \ ^~~~~~ avs_win.c:3132:3: note: in expansion of macro 'REALLOC_COLOR' REALLOC_COLOR(&style->fg[state], &c_fg2); ^~~~~~~~~~~~~ avs_win.c:3099:2: warning: incompatible implicit declaration of built-in function 'memcpy' memcpy((_ct_), (_cs_), sizeof(GdkColor)); \ ^~~~~~ avs_win.c:3133:3: note: in expansion of macro 'REALLOC_COLOR' REALLOC_COLOR(&style->text[state], &c_fg2); ^~~~~~~~~~~~~ avs_win.c:3099:2: note: include '<string.h>' or provide a declaration of 'memcpy' memcpy((_ct_), (_cs_), sizeof(GdkColor)); \ ^~~~~~ avs_win.c:3133:3: note: in expansion of macro 'REALLOC_COLOR' REALLOC_COLOR(&style->text[state], &c_fg2); ^~~~~~~~~~~~~ avs_win.c:3099:2: warning: incompatible implicit declaration of built-in function 'memcpy' memcpy((_ct_), (_cs_), sizeof(GdkColor)); \ ^~~~~~ avs_win.c:3134:3: note: in expansion of macro 'REALLOC_COLOR' REALLOC_COLOR(&style->bg[state], &c_bg2); ^~~~~~~~~~~~~ avs_win.c:3099:2: note: include '<string.h>' or provide a declaration of 'memcpy' memcpy((_ct_), (_cs_), sizeof(GdkColor)); \ ^~~~~~ avs_win.c:3134:3: note: in expansion of macro 'REALLOC_COLOR' REALLOC_COLOR(&style->bg[state], &c_bg2); ^~~~~~~~~~~~~ avs_win.c:3099:2: warning: incompatible implicit declaration of built-in function 'memcpy' memcpy((_ct_), (_cs_), sizeof(GdkColor)); \ ^~~~~~ avs_win.c:3135:3: note: in expansion of macro 'REALLOC_COLOR' REALLOC_COLOR(&style->base[state], &c_bg2); ^~~~~~~~~~~~~ avs_win.c:3099:2: note: include '<string.h>' or provide a declaration of 'memcpy' memcpy((_ct_), (_cs_), sizeof(GdkColor)); \ ^~~~~~ avs_win.c:3135:3: note: in expansion of macro 'REALLOC_COLOR' REALLOC_COLOR(&style->base[state], &c_bg2); ^~~~~~~~~~~~~ avs_win.c:2999:26: warning: variable 'parent2' set but not used [-Wunused-but-set-variable] GtkWidget *w, *parent, *parent2; ^~~~~~~ make[1]: Leaving directory '/tmp/B.ALliZj/BUILD/avscan-5.1.1-openssl/avscan' make: *** [Makefile:42: all] Error 2 error: Bad exit status from /tmp/B.ALliZj/BUILD/tmp/rpm-tmp.3827 (%build) RPM build errors: Bad exit status from /tmp/B.ALliZj/BUILD/tmp/rpm-tmp.3827 (%build) ended at: Thu Dec 6 21:44:32 2018, done in 0:00:03.474379 error: No files produced. + chmod -R u+rwX /tmp/B.ALliZj/BUILD + rm -rf /tmp/B.ALliZj/tmp /tmp/B.ALliZj/BUILD + rm -rf /tmp/B.ALliZj Begin-PLD-Builder-Info Build-Time: user:13.01s sys:2.11s real:21.21s (faults io:1 non-io:273001) End-PLD-Builder-Info
[Back to list of logs] [View rpm -qa of builder]