FailedOk

th/SRPMS[OK]
th/x32[OK]
th/i686[OK]
th/x86_64[OK]

ac/SRPMS[OK]
ac/i386[OK]
ac/i586[OK]
ac/i686[OK]
ac/alpha[OK]
ac/amd64[OK]
ac/athlon[OK]
ac/ppc[OK]
ac/sparc[OK]
ac/sparc64[OK]

Advanced Search
main()
Powered by PLD Linux
(c) 2002-2021 PLD Team
$Revision: 1.37 $
Powered by /dev/null.
Your IP: 3.214.224.207

bacula 97ce43d6-4fcd-447e-940c-03bb001a6dd4

Status:Failed
Source URL:https://buildlogs.pld-linux.org/pld/th/i686/FAIL/bacula,97ce43d6-4fcd-447e-940c-03bb001a6dd4.bz2
text/plain URL:View!
rpm -qa of builder:View!
Date:2021/09/26 10:01:22
Runtime:0:00:53.035182

Toc:

  • prep
  • Executing(%prep): /bin/sh -e /tmp/B.0ikkxwir/BUILD/tmp/rpm-tmp.SJDZpk
  • build
  • Executing(%build): /bin/sh -e /tmp/B.0ikkxwir/BUILD/tmp/rpm-tmp.iqhW8i
  • error 1
  • fstype.c:207:12: error: narrowing conversion of '4283649346' from 'unsigned int' to 'int' [-Wnarrowing]
  • error 2
  • fstype.c:216:12: error: narrowing conversion of '4187351113' from 'unsigned int' to 'int' [-Wnarrowing]
  • error 3
  • fstype.c:217:12: error: narrowing conversion of '2508478710' from 'unsigned int' to 'int' [-Wnarrowing]
  • error 4
  • fstype.c:234:12: error: narrowing conversion of '2768370933' from 'unsigned int' to 'int' [-Wnarrowing]
  • error 5
  • fstype.c:237:12: error: narrowing conversion of '2435016766' from 'unsigned int' to 'int' [-Wnarrowing]
  • error 6
  • make[1]: *** [Makefile:150: fstype.lo] Error 1
  • error 7
  • error: Bad exit status from /tmp/B.0ikkxwir/BUILD/tmp/rpm-tmp.iqhW8i (%build)
  • error 8
  • RPM build errors:
  • error 9
  • error: No files produced.

Content:

request from: baggins
checking if we should skip the build
started at: Sun Sep 26 10:00:27 2021
killing old processes on a builder
sending signal 9 to pid -1
cleaning up /tmp
fetching https://srcbuilder.pld-linux.org/th//srpms/97ce43d6-4fcd-447e-940c-03bb001a6dd4/bacula-9.4.2-4.src.rpm
fetched 4305802 bytes, 5523.8 K/s
installing srpm: bacula-9.4.2-4.src.rpm
+ install -d /tmp/B.0ikkxwir/BUILD /tmp/B.0ikkxwir/RPMS
+ LC_ALL=en_US.UTF-8
+ rpm -qp --changelog bacula-9.4.2-4.src.rpm
* Sun Sep 26 2021 PLD Linux Team <feedback@pld-linux.org>
- For complete changelog see: http://git.pld-linux.org/?p=packages/bacula.git;a=log;h=master
* Sun Sep 26 2021 Jan Rękorajski <baggins@pld-linux.org> 6129bbb
- fix deps that are incorrect in rpm 4 - rediff patches - fix for new configure trying to find its files before BUILD_DIR is set - rel 4 * Sun Oct 20 2019 Jan Rękorajski <baggins@pld-linux.org> 09aae03
- disable s3, bacula version of s3 library is broken - rel 3 * Thu Oct 17 2019 Arkadiusz Miśkiewicz <arekm@maven.pl> db68e7f
- release 2 (by relup.sh) * Tue Mar 05 2019 Jacek Konieczny <j.konieczny@eggsoft.pl> 7ce8b38
- attempt to fix libs3 linking * Tue Mar 05 2019 Jacek Konieczny <j.konieczny@eggsoft.pl> 8b0a640
- x32.patch updated * Tue Mar 05 2019 Jacek Konieczny <j.konieczny@eggsoft.pl> 59779a0
- drop broken obsolete * Tue Mar 05 2019 Jacek Konieczny <j.konieczny@eggsoft.pl> 3e309ba
- missing Source1-md5 added * Mon Mar 04 2019 Jacek Konieczny <j.konieczny@eggsoft.pl> 55b5244
- Version: 9.4.2, Amazon S3 driver, Qt5 * Mon Mar 04 2019 Jacek Konieczny <j.konieczny@eggsoft.pl> 7e41e9e
- Version: 9.2.2 * Tue Sep 18 2018 Arkadiusz Miśkiewicz <arekm@maven.pl> f05466b
- rel 2; fix x32 build * Sun Sep 16 2018 Arkadiusz Miśkiewicz <arekm@maven.pl> 8470f70
- up to 9.2.1 * Sat Sep 15 2018 Arkadiusz Miśkiewicz <arekm@maven.pl> a91f443
- release 3 (by relup.sh) * Sun Mar 18 2018 Jan Rękorajski <baggins@pld-linux.org> c10faab
- switch to libexecdir - rel 2 * Tue Feb 28 2017 Jan Rękorajski <baggins@pld-linux.org> 7563ecc
- typo * Tue Feb 28 2017 Jan Rękorajski <baggins@pld-linux.org> 61a46f0
- fix building on x32 * Tue Jan 31 2017 Mariusz Mazur <mmazur@axeos.com> 09ca754
- Up to 7.4.4 * Tue Oct 18 2016 Jan Rękorajski <baggins@pld-linux.org> 77a4fc1
- rebuild with readline 7.0 - release 2 (by relup.sh) * Wed Apr 20 2016 Elan Ruusamäe <glen@delfi.ee> 7a67c9d
- drop old note * Fri Jan 15 2016 Jan Rękorajski <baggins@pld-linux.org> 99d6b58
- rel 1 * Mon Oct 05 2015 Elan Ruusamäe <glen@delfi.ee> 377f2ef
- add missing R systemd-units for subpackages + rpm -Uhv --nodeps --define '_topdir /tmp/B.0ikkxwir' --define '_specdir %{_topdir}' --define '_sourcedir %{_specdir}' --define '_rpmdir %{_topdir}/RPMS' --define '_builddir %{_topdir}/BUILD' bacula-9.4.2-4.src.rpm Updating / installing... bacula-9.4.2-4 ######################################## + rm -f bacula-9.4.2-4.src.rpm + install -m 700 -d /tmp/B.0ikkxwir/BUILD/tmp + TMPDIR=/tmp/B.0ikkxwir/BUILD/tmp + exec nice -n 0 rpmbuild -bp --short-circuit --nodeps --define '_topdir /tmp/B.0ikkxwir' --define '_specdir %{_topdir}' --define '_sourcedir %{_specdir}' --define '_rpmdir %{_topdir}/RPMS' --define '_builddir %{_topdir}/BUILD' --target i686-pld-linux --define 'prep exit 0' /tmp/B.0ikkxwir/bacula.spec warning: line 170: It's not recommended to have unversioned Obsoletes: Obsoletes: bacula-updatedb warning: line 333: It's not recommended to have unversioned Obsoletes: Obsoletes: bacula-db warning: line 348: It's not recommended to have unversioned Obsoletes: Obsoletes: bacula-db warning: line 363: It's not recommended to have unversioned Obsoletes: Obsoletes: bacula-db warning: Macro expanded in comment on line 738: %{name}-docs-%{version}/manual/{*.pdf,bacula} warning: Could not canonicalize hostname: nereid Building target platforms: i686-pld-linux Building for target i686-pld-linux checking BuildConflict-ing packages rpm: warning: line 170: It's not recommended to have unversioned Obsoletes: Obsoletes: bacula-updatedb rpm: warning: line 333: It's not recommended to have unversioned Obsoletes: Obsoletes: bacula-db rpm: warning: line 348: It's not recommended to have unversioned Obsoletes: Obsoletes: bacula-db rpm: warning: line 363: It's not recommended to have unversioned Obsoletes: Obsoletes: bacula-db rpm: warning: Macro expanded in comment on line 738: %{name}-docs-%{version}/manual/{*.pdf,bacula} rpm: rpm: warning: Could not canonicalize hostname: nereid rpm: Building target platforms: i686-pld-linux rpm: Building for target i686-pld-linux no BuildConflicts found checking BR rpm: warning: line 170: It's not recommended to have unversioned Obsoletes: Obsoletes: bacula-updatedb rpm: warning: line 333: It's not recommended to have unversioned Obsoletes: Obsoletes: bacula-db rpm: warning: line 348: It's not recommended to have unversioned Obsoletes: Obsoletes: bacula-db rpm: warning: line 363: It's not recommended to have unversioned Obsoletes: Obsoletes: bacula-db rpm: warning: Macro expanded in comment on line 738: %{name}-docs-%{version}/manual/{*.pdf,bacula} rpm: rpm: warning: Could not canonicalize hostname: nereid rpm: Building target platforms: i686-pld-linux rpm: Building for target i686-pld-linux no BR needed building RPM using: set -ex; : build-id: 97ce43d6-4fcd-447e-940c-03bb001a6dd4; TMPDIR=/tmp/B.0ikkxwir/BUILD/tmp exec nice -n 0 rpmbuild -bb --define '_smp_mflags -j9' --define '_make_opts -Otarget' --define '_pld_builder 1' --define '_topdir /tmp/B.0ikkxwir' --define '_specdir %{_topdir}' --define '_sourcedir %{_specdir}' --define '_rpmdir %{_topdir}/RPMS' --define '_builddir %{_topdir}/BUILD' --target i686-pld-linux /tmp/B.0ikkxwir/bacula.spec + : build-id: 97ce43d6-4fcd-447e-940c-03bb001a6dd4 + TMPDIR=/tmp/B.0ikkxwir/BUILD/tmp + exec nice -n 0 rpmbuild -bb --define '_smp_mflags -j9' --define '_make_opts -Otarget' --define '_pld_builder 1' --define '_topdir /tmp/B.0ikkxwir' --define '_specdir %{_topdir}' --define '_sourcedir %{_specdir}' --define '_rpmdir %{_topdir}/RPMS' --define '_builddir %{_topdir}/BUILD' --target i686-pld-linux /tmp/B.0ikkxwir/bacula.spec warning: line 170: It's not recommended to have unversioned Obsoletes: Obsoletes: bacula-updatedb warning: line 333: It's not recommended to have unversioned Obsoletes: Obsoletes: bacula-db warning: line 348: It's not recommended to have unversioned Obsoletes: Obsoletes: bacula-db warning: line 363: It's not recommended to have unversioned Obsoletes: Obsoletes: bacula-db warning: Macro expanded in comment on line 738: %{name}-docs-%{version}/manual/{*.pdf,bacula} warning: Could not canonicalize hostname: nereid Building target platforms: i686-pld-linux Building for target i686-pld-linux Executing(%prep): /bin/sh -e /tmp/B.0ikkxwir/BUILD/tmp/rpm-tmp.SJDZpk + umask 022 + cd /tmp/B.0ikkxwir/BUILD + cd /tmp/B.0ikkxwir/BUILD + rm -rf bacula-9.4.2 + /bin/gzip -dc /tmp/B.0ikkxwir/bacula-9.4.2.tar.gz + /bin/tar -xof - + STATUS=0 + '[' 0 -ne 0 ']' + cd bacula-9.4.2 + /bin/gzip -dc /tmp/B.0ikkxwir/libs3-20181010.tar.gz + /bin/tar -xof - + STATUS=0 + '[' 0 -ne 0 ']' + /bin/chmod -Rf a+rX,u+w,g-w,o-w . + echo 'Patch #0 (bacula-mtx-changer.patch):' Patch #0 (bacula-mtx-changer.patch): + </tmp/B.0ikkxwir/bacula-mtx-changer.patch + /usr/bin/patch -s -p1 '--fuzz=0' + echo 'Patch #1 (bacula-branding.patch):' Patch #1 (bacula-branding.patch): + </tmp/B.0ikkxwir/bacula-branding.patch + /usr/bin/patch -s -p1 '--fuzz=0' + echo 'Patch #2 (bacula-desktop.patch):' Patch #2 (bacula-desktop.patch): + </tmp/B.0ikkxwir/bacula-desktop.patch + /usr/bin/patch -s -p1 '--fuzz=0' + echo 'Patch #3 (make_catalog_backup-setup-home.patch):' Patch #3 (make_catalog_backup-setup-home.patch): + </tmp/B.0ikkxwir/make_catalog_backup-setup-home.patch + /usr/bin/patch -s -p1 '--fuzz=0' + echo 'Patch #4 (bacula-no_lockmgr.patch):' Patch #4 (bacula-no_lockmgr.patch): + </tmp/B.0ikkxwir/bacula-no_lockmgr.patch + /usr/bin/patch -s -p1 '--fuzz=0' + sed -i -e 's#bindir=.*#bindir=/usr/bin#g' src/cats/create_bacula_database.in src/cats/create_mysql_database.in src/cats/create_postgresql_database.in src/cats/create_sqlite3_database.in src/cats/create_test_database src/cats/delete_catalog_backup.in src/cats/drop_bacula_database.in src/cats/drop_bacula_tables.in src/cats/drop_mysql_database.in src/cats/drop_mysql_tables.in src/cats/drop_postgresql_database.in src/cats/drop_postgresql_tables.in src/cats/drop_sqlite3_database.in src/cats/drop_sqlite3_tables.in src/cats/drop_test_tables src/cats/grant_bacula_privileges.in src/cats/grant_mysql_privileges.in src/cats/grant_postgresql_privileges.in src/cats/grant_privileges src/cats/grant_sqlite3_privileges.in src/cats/make_bacula_tables.in src/cats/make_catalog_backup.in src/cats/make_catalog_backup.pl.in src/cats/make_mysql_tables.in src/cats/make_postgresql_tables.in src/cats/make_sqlite3_tables.in src/cats/make_test_tables src/cats/update_bacula_tables.in src/cats/update_mysql_tables.in src/cats/update_postgresql_tables.in src/cats/update_sqlite3_tables.in + sed -i -e s/@hostname@/--hostname--/ src/console/bconsole.conf.in src/dird/bacula-dir.conf.in src/filed/bacula-fd.conf.in src/qt-console/bat.conf.in src/stored/bacula-sd.conf.in src/stored/stored.conf.in + sed -i -e s/@basename@/--hostname--/ src/console/bconsole.conf.in src/dird/bacula-dir.conf.in src/filed/bacula-fd.conf.in src/qt-console/bat.conf.in src/stored/bacula-sd.conf.in src/stored/stored.conf.in + RPM_EC=0 + jobs -p + exit 0 Executing(%build): /bin/sh -e /tmp/B.0ikkxwir/BUILD/tmp/rpm-tmp.iqhW8i TMP=/home/users/builder/tmp HOME=/home/users/builder PATH=/home/users/builder/GNUstep/Tools:/bin:/usr/bin:/usr/local/bin:/home/users/builder/bin TMPDIR=/tmp/B.0ikkxwir/BUILD/tmp + umask 022 + cd /tmp/B.0ikkxwir/BUILD + cd bacula-9.4.2 + cd autoconf + aclocal -I bacula-macros -I gettext-macros -I libtool aclocal: warning: autoconf input should be named 'configure.ac', not 'configure.in' + cd .. + pwd + >configure + autoconf '--prepend-include=/tmp/B.0ikkxwir/BUILD/bacula-9.4.2/autoconf' autoconf/configure.in autoconf/configure.in:192: warning: The macro `AC_HELP_STRING' is obsolete. autoconf/configure.in:192: You should run autoupdate. ./lib/autoconf/general.m4:204: AC_HELP_STRING is expanded from... autoconf/configure.in:192: the top level autoconf/configure.in:241: warning: The macro `AC_HELP_STRING' is obsolete. autoconf/configure.in:241: You should run autoupdate. ./lib/autoconf/general.m4:204: AC_HELP_STRING is expanded from... autoconf/configure.in:241: the top level autoconf/configure.in:265: warning: The macro `AC_CYGWIN' is obsolete. autoconf/configure.in:265: You should run autoupdate. ./lib/autoconf/specific.m4:319: AC_CYGWIN is expanded from... /tmp/B.0ikkxwir/BUILD/bacula-9.4.2/autoconf/bacula-macros/os.m4:57: BA_CHECK_OPSYS is expanded from... autoconf/configure.in:265: the top level autoconf/configure.in:276: warning: The macro `AC_OUTPUT_COMMANDS' is obsolete. autoconf/configure.in:276: You should run autoupdate. ./lib/autoconf/status.m4:1025: AC_OUTPUT_COMMANDS is expanded from... /tmp/B.0ikkxwir/BUILD/bacula-9.4.2/autoconf/gettext-macros/po.m4:23: AM_PO_SUBDIRS is expanded from... /tmp/B.0ikkxwir/BUILD/bacula-9.4.2/autoconf/gettext-macros/gettext.m4:57: AM_GNU_GETTEXT is expanded from... autoconf/configure.in:276: the top level autoconf/configure.in:276: warning: The macro `AC_TRY_LINK' is obsolete. autoconf/configure.in:276: You should run autoupdate. ./lib/autoconf/general.m4:2920: AC_TRY_LINK is expanded from... lib/m4sugar/m4sh.m4:692: _AS_IF_ELSE is expanded from... lib/m4sugar/m4sh.m4:699: AS_IF is expanded from... ./lib/autoconf/general.m4:2249: AC_CACHE_VAL is expanded from... ./lib/autoconf/general.m4:2270: AC_CACHE_CHECK is expanded from... /tmp/B.0ikkxwir/BUILD/bacula-9.4.2/autoconf/gettext-macros/gettext.m4:486: gt_INTL_MACOSX is expanded from... /tmp/B.0ikkxwir/BUILD/bacula-9.4.2/autoconf/gettext-macros/gettext.m4:57: AM_GNU_GETTEXT is expanded from... autoconf/configure.in:276: the top level autoconf/configure.in:276: warning: The macro `AC_TRY_LINK' is obsolete. autoconf/configure.in:276: You should run autoupdate. ./lib/autoconf/general.m4:2920: AC_TRY_LINK is expanded from... lib/m4sugar/m4sh.m4:692: _AS_IF_ELSE is expanded from... lib/m4sugar/m4sh.m4:699: AS_IF is expanded from... ./lib/autoconf/general.m4:2249: AC_CACHE_VAL is expanded from... ./lib/autoconf/general.m4:2270: AC_CACHE_CHECK is expanded from... /tmp/B.0ikkxwir/BUILD/bacula-9.4.2/autoconf/gettext-macros/gettext.m4:57: AM_GNU_GETTEXT is expanded from... autoconf/configure.in:276: the top level autoconf/configure.in:276: warning: The macro `AC_TRY_LINK' is obsolete. autoconf/configure.in:276: You should run autoupdate. ./lib/autoconf/general.m4:2920: AC_TRY_LINK is expanded from... lib/m4sugar/m4sh.m4:692: _AS_IF_ELSE is expanded from... lib/m4sugar/m4sh.m4:699: AS_IF is expanded from... ./lib/autoconf/general.m4:2249: AC_CACHE_VAL is expanded from... ./lib/autoconf/general.m4:2270: AC_CACHE_CHECK is expanded from... /tmp/B.0ikkxwir/BUILD/bacula-9.4.2/autoconf/gettext-macros/iconv.m4:20: AM_ICONV_LINK is expanded from... /tmp/B.0ikkxwir/BUILD/bacula-9.4.2/autoconf/gettext-macros/gettext.m4:57: AM_GNU_GETTEXT is expanded from... autoconf/configure.in:276: the top level autoconf/configure.in:379: warning: The macro `AC_HEADER_STDC' is obsolete. autoconf/configure.in:379: You should run autoupdate. ./lib/autoconf/headers.m4:704: AC_HEADER_STDC is expanded from... /tmp/B.0ikkxwir/BUILD/bacula-9.4.2/autoconf/gettext-macros/gettext.m4:359: AM_INTL_SUBDIR is expanded from... /tmp/B.0ikkxwir/BUILD/bacula-9.4.2/autoconf/gettext-macros/gettext.m4:57: AM_GNU_GETTEXT is expanded from... autoconf/configure.in:379: the top level autoconf/configure.in:379: warning: The macro `AC_TRY_COMPILE' is obsolete. autoconf/configure.in:379: You should run autoupdate. ./lib/autoconf/general.m4:2847: AC_TRY_COMPILE is expanded from... lib/m4sugar/m4sh.m4:692: _AS_IF_ELSE is expanded from... lib/m4sugar/m4sh.m4:699: AS_IF is expanded from... ./lib/autoconf/general.m4:2249: AC_CACHE_VAL is expanded from... ./lib/autoconf/general.m4:2270: AC_CACHE_CHECK is expanded from... /tmp/B.0ikkxwir/BUILD/bacula-9.4.2/autoconf/gettext-macros/signed.m4:9: bh_C_SIGNED is expanded from... /tmp/B.0ikkxwir/BUILD/bacula-9.4.2/autoconf/gettext-macros/gettext.m4:359: AM_INTL_SUBDIR is expanded from... /tmp/B.0ikkxwir/BUILD/bacula-9.4.2/autoconf/gettext-macros/gettext.m4:57: AM_GNU_GETTEXT is expanded from... autoconf/configure.in:379: the top level autoconf/configure.in:379: warning: The macro `AC_TRY_LINK' is obsolete. autoconf/configure.in:379: You should run autoupdate. ./lib/autoconf/general.m4:2920: AC_TRY_LINK is expanded from... lib/m4sugar/m4sh.m4:692: _AS_IF_ELSE is expanded from... lib/m4sugar/m4sh.m4:699: AS_IF is expanded from... ./lib/autoconf/general.m4:2249: AC_CACHE_VAL is expanded from... ./lib/autoconf/general.m4:2270: AC_CACHE_CHECK is expanded from... /tmp/B.0ikkxwir/BUILD/bacula-9.4.2/autoconf/gettext-macros/longlong.m4:11: gl_AC_TYPE_LONG_LONG is expanded from... /tmp/B.0ikkxwir/BUILD/bacula-9.4.2/autoconf/gettext-macros/gettext.m4:359: AM_INTL_SUBDIR is expanded from... /tmp/B.0ikkxwir/BUILD/bacula-9.4.2/autoconf/gettext-macros/gettext.m4:57: AM_GNU_GETTEXT is expanded from... autoconf/configure.in:379: the top level autoconf/configure.in:379: warning: The macro `AC_TRY_COMPILE' is obsolete. autoconf/configure.in:379: You should run autoupdate. ./lib/autoconf/general.m4:2847: AC_TRY_COMPILE is expanded from... lib/m4sugar/m4sh.m4:692: _AS_IF_ELSE is expanded from... lib/m4sugar/m4sh.m4:699: AS_IF is expanded from... ./lib/autoconf/general.m4:2249: AC_CACHE_VAL is expanded from... ./lib/autoconf/general.m4:2270: AC_CACHE_CHECK is expanded from... /tmp/B.0ikkxwir/BUILD/bacula-9.4.2/autoconf/gettext-macros/longdouble.m4:11: gt_TYPE_LONGDOUBLE is expanded from... /tmp/B.0ikkxwir/BUILD/bacula-9.4.2/autoconf/gettext-macros/gettext.m4:359: AM_INTL_SUBDIR is expanded from... /tmp/B.0ikkxwir/BUILD/bacula-9.4.2/autoconf/gettext-macros/gettext.m4:57: AM_GNU_GETTEXT is expanded from... autoconf/configure.in:379: the top level autoconf/configure.in:379: warning: The macro `AC_TRY_COMPILE' is obsolete. autoconf/configure.in:379: You should run autoupdate. ./lib/autoconf/general.m4:2847: AC_TRY_COMPILE is expanded from... lib/m4sugar/m4sh.m4:692: _AS_IF_ELSE is expanded from... lib/m4sugar/m4sh.m4:699: AS_IF is expanded from... ./lib/autoconf/general.m4:2249: AC_CACHE_VAL is expanded from... ./lib/autoconf/general.m4:2270: AC_CACHE_CHECK is expanded from... /tmp/B.0ikkxwir/BUILD/bacula-9.4.2/autoconf/gettext-macros/wchar_t.m4:11: gt_TYPE_WCHAR_T is expanded from... /tmp/B.0ikkxwir/BUILD/bacula-9.4.2/autoconf/gettext-macros/gettext.m4:359: AM_INTL_SUBDIR is expanded from... /tmp/B.0ikkxwir/BUILD/bacula-9.4.2/autoconf/gettext-macros/gettext.m4:57: AM_GNU_GETTEXT is expanded from... autoconf/configure.in:379: the top level autoconf/configure.in:379: warning: The macro `AC_TRY_COMPILE' is obsolete. autoconf/configure.in:379: You should run autoupdate. ./lib/autoconf/general.m4:2847: AC_TRY_COMPILE is expanded from... lib/m4sugar/m4sh.m4:692: _AS_IF_ELSE is expanded from... lib/m4sugar/m4sh.m4:699: AS_IF is expanded from... ./lib/autoconf/general.m4:2249: AC_CACHE_VAL is expanded from... ./lib/autoconf/general.m4:2270: AC_CACHE_CHECK is expanded from... /tmp/B.0ikkxwir/BUILD/bacula-9.4.2/autoconf/gettext-macros/wint_t.m4:11: gt_TYPE_WINT_T is expanded from... /tmp/B.0ikkxwir/BUILD/bacula-9.4.2/autoconf/gettext-macros/gettext.m4:359: AM_INTL_SUBDIR is expanded from... /tmp/B.0ikkxwir/BUILD/bacula-9.4.2/autoconf/gettext-macros/gettext.m4:57: AM_GNU_GETTEXT is expanded from... autoconf/configure.in:379: the top level autoconf/configure.in:379: warning: The macro `AC_TRY_COMPILE' is obsolete. autoconf/configure.in:379: You should run autoupdate. ./lib/autoconf/general.m4:2847: AC_TRY_COMPILE is expanded from... lib/m4sugar/m4sh.m4:692: _AS_IF_ELSE is expanded from... lib/m4sugar/m4sh.m4:699: AS_IF is expanded from... ./lib/autoconf/general.m4:2249: AC_CACHE_VAL is expanded from... ./lib/autoconf/general.m4:2270: AC_CACHE_CHECK is expanded from... /tmp/B.0ikkxwir/BUILD/bacula-9.4.2/autoconf/gettext-macros/inttypes_h.m4:12: gl_AC_HEADER_INTTYPES_H is expanded from... /tmp/B.0ikkxwir/BUILD/bacula-9.4.2/autoconf/gettext-macros/gettext.m4:359: AM_INTL_SUBDIR is expanded from... /tmp/B.0ikkxwir/BUILD/bacula-9.4.2/autoconf/gettext-macros/gettext.m4:57: AM_GNU_GETTEXT is expanded from... autoconf/configure.in:379: the top level autoconf/configure.in:379: warning: The macro `AC_TRY_COMPILE' is obsolete. autoconf/configure.in:379: You should run autoupdate. ./lib/autoconf/general.m4:2847: AC_TRY_COMPILE is expanded from... lib/m4sugar/m4sh.m4:692: _AS_IF_ELSE is expanded from... lib/m4sugar/m4sh.m4:699: AS_IF is expanded from... ./lib/autoconf/general.m4:2249: AC_CACHE_VAL is expanded from... ./lib/autoconf/general.m4:2270: AC_CACHE_CHECK is expanded from... /tmp/B.0ikkxwir/BUILD/bacula-9.4.2/autoconf/gettext-macros/stdint_h.m4:12: gl_AC_HEADER_STDINT_H is expanded from... /tmp/B.0ikkxwir/BUILD/bacula-9.4.2/autoconf/gettext-macros/gettext.m4:359: AM_INTL_SUBDIR is expanded from... /tmp/B.0ikkxwir/BUILD/bacula-9.4.2/autoconf/gettext-macros/gettext.m4:57: AM_GNU_GETTEXT is expanded from... autoconf/configure.in:379: the top level autoconf/configure.in:379: warning: The macro `AC_TRY_COMPILE' is obsolete. autoconf/configure.in:379: You should run autoupdate. ./lib/autoconf/general.m4:2847: AC_TRY_COMPILE is expanded from... lib/m4sugar/m4sh.m4:692: _AS_IF_ELSE is expanded from... lib/m4sugar/m4sh.m4:699: AS_IF is expanded from... ./lib/autoconf/general.m4:2249: AC_CACHE_VAL is expanded from... ./lib/autoconf/general.m4:2270: AC_CACHE_CHECK is expanded from... /tmp/B.0ikkxwir/BUILD/bacula-9.4.2/autoconf/gettext-macros/intmax.m4:11: gt_TYPE_INTMAX_T is expanded from... /tmp/B.0ikkxwir/BUILD/bacula-9.4.2/autoconf/gettext-macros/gettext.m4:359: AM_INTL_SUBDIR is expanded from... /tmp/B.0ikkxwir/BUILD/bacula-9.4.2/autoconf/gettext-macros/gettext.m4:57: AM_GNU_GETTEXT is expanded from... autoconf/configure.in:379: the top level autoconf/configure.in:379: warning: The macro `AC_TRY_RUN' is obsolete. autoconf/configure.in:379: You should run autoupdate. ./lib/autoconf/general.m4:2997: AC_TRY_RUN is expanded from... lib/m4sugar/m4sh.m4:692: _AS_IF_ELSE is expanded from... lib/m4sugar/m4sh.m4:699: AS_IF is expanded from... ./lib/autoconf/general.m4:2249: AC_CACHE_VAL is expanded from... ./lib/autoconf/general.m4:2270: AC_CACHE_CHECK is expanded from... /tmp/B.0ikkxwir/BUILD/bacula-9.4.2/autoconf/gettext-macros/printf-posix.m4:11: gt_PRINTF_POSIX is expanded from... /tmp/B.0ikkxwir/BUILD/bacula-9.4.2/autoconf/gettext-macros/gettext.m4:359: AM_INTL_SUBDIR is expanded from... /tmp/B.0ikkxwir/BUILD/bacula-9.4.2/autoconf/gettext-macros/gettext.m4:57: AM_GNU_GETTEXT is expanded from... autoconf/configure.in:379: the top level autoconf/configure.in:379: warning: The macro `AC_TRY_RUN' is obsolete. autoconf/configure.in:379: You should run autoupdate. ./lib/autoconf/general.m4:2997: AC_TRY_RUN is expanded from... lib/m4sugar/m4sh.m4:692: _AS_IF_ELSE is expanded from... lib/m4sugar/m4sh.m4:699: AS_IF is expanded from... ./lib/autoconf/general.m4:2249: AC_CACHE_VAL is expanded from... ./lib/autoconf/general.m4:2270: AC_CACHE_CHECK is expanded from... /tmp/B.0ikkxwir/BUILD/bacula-9.4.2/autoconf/gettext-macros/intdiv0.m4:9: gt_INTDIV0 is expanded from... /tmp/B.0ikkxwir/BUILD/bacula-9.4.2/autoconf/gettext-macros/gettext.m4:359: AM_INTL_SUBDIR is expanded from... /tmp/B.0ikkxwir/BUILD/bacula-9.4.2/autoconf/gettext-macros/gettext.m4:57: AM_GNU_GETTEXT is expanded from... autoconf/configure.in:379: the top level autoconf/configure.in:379: warning: The macro `AC_TRY_LINK' is obsolete. autoconf/configure.in:379: You should run autoupdate. ./lib/autoconf/general.m4:2920: AC_TRY_LINK is expanded from... lib/m4sugar/m4sh.m4:692: _AS_IF_ELSE is expanded from... lib/m4sugar/m4sh.m4:699: AS_IF is expanded from... ./lib/autoconf/general.m4:2249: AC_CACHE_VAL is expanded from... ./lib/autoconf/general.m4:2270: AC_CACHE_CHECK is expanded from... /tmp/B.0ikkxwir/BUILD/bacula-9.4.2/autoconf/gettext-macros/ulonglong.m4:11: gl_AC_TYPE_UNSIGNED_LONG_LONG is expanded from... /tmp/B.0ikkxwir/BUILD/bacula-9.4.2/autoconf/gettext-macros/uintmax_t.m4:14: gl_AC_TYPE_UINTMAX_T is expanded from... /tmp/B.0ikkxwir/BUILD/bacula-9.4.2/autoconf/gettext-macros/gettext.m4:359: AM_INTL_SUBDIR is expanded from... /tmp/B.0ikkxwir/BUILD/bacula-9.4.2/autoconf/gettext-macros/gettext.m4:57: AM_GNU_GETTEXT is expanded from... autoconf/configure.in:379: the top level autoconf/configure.in:379: warning: The macro `AC_TRY_COMPILE' is obsolete. autoconf/configure.in:379: You should run autoupdate. ./lib/autoconf/general.m4:2847: AC_TRY_COMPILE is expanded from... lib/m4sugar/m4sh.m4:692: _AS_IF_ELSE is expanded from... lib/m4sugar/m4sh.m4:699: AS_IF is expanded from... ./lib/autoconf/general.m4:2249: AC_CACHE_VAL is expanded from... ./lib/autoconf/general.m4:2270: AC_CACHE_CHECK is expanded from... /tmp/B.0ikkxwir/BUILD/bacula-9.4.2/autoconf/gettext-macros/inttypes.m4:12: gt_HEADER_INTTYPES_H is expanded from... /tmp/B.0ikkxwir/BUILD/bacula-9.4.2/autoconf/gettext-macros/gettext.m4:359: AM_INTL_SUBDIR is expanded from... /tmp/B.0ikkxwir/BUILD/bacula-9.4.2/autoconf/gettext-macros/gettext.m4:57: AM_GNU_GETTEXT is expanded from... autoconf/configure.in:379: the top level autoconf/configure.in:379: warning: The macro `AC_TRY_COMPILE' is obsolete. autoconf/configure.in:379: You should run autoupdate. ./lib/autoconf/general.m4:2847: AC_TRY_COMPILE is expanded from... lib/m4sugar/m4sh.m4:692: _AS_IF_ELSE is expanded from... lib/m4sugar/m4sh.m4:699: AS_IF is expanded from... ./lib/autoconf/general.m4:2249: AC_CACHE_VAL is expanded from... ./lib/autoconf/general.m4:2270: AC_CACHE_CHECK is expanded from... /tmp/B.0ikkxwir/BUILD/bacula-9.4.2/autoconf/gettext-macros/inttypes-pri.m4:12: gt_INTTYPES_PRI is expanded from... /tmp/B.0ikkxwir/BUILD/bacula-9.4.2/autoconf/gettext-macros/gettext.m4:359: AM_INTL_SUBDIR is expanded from... /tmp/B.0ikkxwir/BUILD/bacula-9.4.2/autoconf/gettext-macros/gettext.m4:57: AM_GNU_GETTEXT is expanded from... autoconf/configure.in:379: the top level autoconf/configure.in:379: warning: The macro `_AC_COMPUTE_INT' is obsolete. autoconf/configure.in:379: You should run autoupdate. ./lib/autoconf/general.m4:3376: _AC_COMPUTE_INT is expanded from... /tmp/B.0ikkxwir/BUILD/bacula-9.4.2/autoconf/gettext-macros/size_max.m4:9: gl_SIZE_MAX is expanded from... /tmp/B.0ikkxwir/BUILD/bacula-9.4.2/autoconf/gettext-macros/xsize.m4:7: gl_XSIZE is expanded from... /tmp/B.0ikkxwir/BUILD/bacula-9.4.2/autoconf/gettext-macros/gettext.m4:359: AM_INTL_SUBDIR is expanded from... /tmp/B.0ikkxwir/BUILD/bacula-9.4.2/autoconf/gettext-macros/gettext.m4:57: AM_GNU_GETTEXT is expanded from... autoconf/configure.in:379: the top level autoconf/configure.in:379: warning: The macro `AC_TRY_COMPILE' is obsolete. autoconf/configure.in:379: You should run autoupdate. ./lib/autoconf/general.m4:2847: AC_TRY_COMPILE is expanded from... /tmp/B.0ikkxwir/BUILD/bacula-9.4.2/autoconf/gettext-macros/size_max.m4:9: gl_SIZE_MAX is expanded from... /tmp/B.0ikkxwir/BUILD/bacula-9.4.2/autoconf/gettext-macros/xsize.m4:7: gl_XSIZE is expanded from... /tmp/B.0ikkxwir/BUILD/bacula-9.4.2/autoconf/gettext-macros/gettext.m4:359: AM_INTL_SUBDIR is expanded from... /tmp/B.0ikkxwir/BUILD/bacula-9.4.2/autoconf/gettext-macros/gettext.m4:57: AM_GNU_GETTEXT is expanded from... autoconf/configure.in:379: the top level autoconf/configure.in:379: warning: The macro `AC_TRY_COMPILE' is obsolete. autoconf/configure.in:379: You should run autoupdate. ./lib/autoconf/general.m4:2847: AC_TRY_COMPILE is expanded from... lib/m4sugar/m4sh.m4:692: _AS_IF_ELSE is expanded from... lib/m4sugar/m4sh.m4:699: AS_IF is expanded from... ./lib/autoconf/general.m4:2249: AC_CACHE_VAL is expanded from... ./lib/autoconf/general.m4:2270: AC_CACHE_CHECK is expanded from... /tmp/B.0ikkxwir/BUILD/bacula-9.4.2/autoconf/gettext-macros/gettext.m4:530: gt_CHECK_DECL is expanded from... /tmp/B.0ikkxwir/BUILD/bacula-9.4.2/autoconf/gettext-macros/gettext.m4:359: AM_INTL_SUBDIR is expanded from... /tmp/B.0ikkxwir/BUILD/bacula-9.4.2/autoconf/gettext-macros/gettext.m4:57: AM_GNU_GETTEXT is expanded from... autoconf/configure.in:379: the top level autoconf/configure.in:379: warning: The macro `AC_TRY_LINK' is obsolete. autoconf/configure.in:379: You should run autoupdate. ./lib/autoconf/general.m4:2920: AC_TRY_LINK is expanded from... lib/m4sugar/m4sh.m4:692: _AS_IF_ELSE is expanded from... lib/m4sugar/m4sh.m4:699: AS_IF is expanded from... ./lib/autoconf/general.m4:2249: AC_CACHE_VAL is expanded from... ./lib/autoconf/general.m4:2270: AC_CACHE_CHECK is expanded from... /tmp/B.0ikkxwir/BUILD/bacula-9.4.2/autoconf/gettext-macros/iconv.m4:20: AM_ICONV_LINK is expanded from... /tmp/B.0ikkxwir/BUILD/bacula-9.4.2/autoconf/gettext-macros/iconv.m4:75: AM_ICONV is expanded from... /tmp/B.0ikkxwir/BUILD/bacula-9.4.2/autoconf/gettext-macros/gettext.m4:359: AM_INTL_SUBDIR is expanded from... /tmp/B.0ikkxwir/BUILD/bacula-9.4.2/autoconf/gettext-macros/gettext.m4:57: AM_GNU_GETTEXT is expanded from... autoconf/configure.in:379: the top level autoconf/configure.in:379: warning: The macro `AC_TRY_COMPILE' is obsolete. autoconf/configure.in:379: You should run autoupdate. ./lib/autoconf/general.m4:2847: AC_TRY_COMPILE is expanded from... lib/m4sugar/m4sh.m4:692: _AS_IF_ELSE is expanded from... lib/m4sugar/m4sh.m4:699: AS_IF is expanded from... ./lib/autoconf/general.m4:2249: AC_CACHE_VAL is expanded from... /tmp/B.0ikkxwir/BUILD/bacula-9.4.2/autoconf/gettext-macros/iconv.m4:75: AM_ICONV is expanded from... /tmp/B.0ikkxwir/BUILD/bacula-9.4.2/autoconf/gettext-macros/gettext.m4:359: AM_INTL_SUBDIR is expanded from... /tmp/B.0ikkxwir/BUILD/bacula-9.4.2/autoconf/gettext-macros/gettext.m4:57: AM_GNU_GETTEXT is expanded from... autoconf/configure.in:379: the top level autoconf/configure.in:379: warning: The macro `AC_TRY_LINK' is obsolete. autoconf/configure.in:379: You should run autoupdate. ./lib/autoconf/general.m4:2920: AC_TRY_LINK is expanded from... lib/m4sugar/m4sh.m4:692: _AS_IF_ELSE is expanded from... lib/m4sugar/m4sh.m4:699: AS_IF is expanded from... ./lib/autoconf/general.m4:2249: AC_CACHE_VAL is expanded from... ./lib/autoconf/general.m4:2270: AC_CACHE_CHECK is expanded from... /tmp/B.0ikkxwir/BUILD/bacula-9.4.2/autoconf/gettext-macros/codeset.m4:9: AM_LANGINFO_CODESET is expanded from... /tmp/B.0ikkxwir/BUILD/bacula-9.4.2/autoconf/gettext-macros/gettext.m4:359: AM_INTL_SUBDIR is expanded from... /tmp/B.0ikkxwir/BUILD/bacula-9.4.2/autoconf/gettext-macros/gettext.m4:57: AM_GNU_GETTEXT is expanded from... autoconf/configure.in:379: the top level autoconf/configure.in:379: warning: The macro `AC_TRY_LINK' is obsolete. autoconf/configure.in:379: You should run autoupdate. ./lib/autoconf/general.m4:2920: AC_TRY_LINK is expanded from... lib/m4sugar/m4sh.m4:692: _AS_IF_ELSE is expanded from... lib/m4sugar/m4sh.m4:699: AS_IF is expanded from... ./lib/autoconf/general.m4:2249: AC_CACHE_VAL is expanded from... ./lib/autoconf/general.m4:2270: AC_CACHE_CHECK is expanded from... /tmp/B.0ikkxwir/BUILD/bacula-9.4.2/autoconf/gettext-macros/lcmessage.m4:21: gt_LC_MESSAGES is expanded from... /tmp/B.0ikkxwir/BUILD/bacula-9.4.2/autoconf/gettext-macros/gettext.m4:359: AM_INTL_SUBDIR is expanded from... /tmp/B.0ikkxwir/BUILD/bacula-9.4.2/autoconf/gettext-macros/gettext.m4:57: AM_GNU_GETTEXT is expanded from... autoconf/configure.in:379: the top level autoconf/configure.in:379: warning: The macro `AC_TRY_LINK' is obsolete. autoconf/configure.in:379: You should run autoupdate. ./lib/autoconf/general.m4:2920: AC_TRY_LINK is expanded from... lib/m4sugar/m4sh.m4:692: _AS_IF_ELSE is expanded from... lib/m4sugar/m4sh.m4:699: AS_IF is expanded from... ./lib/autoconf/general.m4:2249: AC_CACHE_VAL is expanded from... ./lib/autoconf/general.m4:2270: AC_CACHE_CHECK is expanded from... /tmp/B.0ikkxwir/BUILD/bacula-9.4.2/autoconf/gettext-macros/gettext.m4:486: gt_INTL_MACOSX is expanded from... /tmp/B.0ikkxwir/BUILD/bacula-9.4.2/autoconf/gettext-macros/gettext.m4:57: AM_GNU_GETTEXT is expanded from... autoconf/configure.in:379: the top level autoconf/configure.in:379: warning: The macro `AC_HELP_STRING' is obsolete. autoconf/configure.in:379: You should run autoupdate. ./lib/autoconf/general.m4:204: AC_HELP_STRING is expanded from... /tmp/B.0ikkxwir/BUILD/bacula-9.4.2/autoconf/gettext-macros/gettext.m4:57: AM_GNU_GETTEXT is expanded from... autoconf/configure.in:379: the top level autoconf/configure.in:379: warning: The macro `AC_TRY_LINK' is obsolete. autoconf/configure.in:379: You should run autoupdate. ./lib/autoconf/general.m4:2920: AC_TRY_LINK is expanded from... lib/m4sugar/m4sh.m4:692: _AS_IF_ELSE is expanded from... lib/m4sugar/m4sh.m4:699: AS_IF is expanded from... ./lib/autoconf/general.m4:2249: AC_CACHE_VAL is expanded from... ./lib/autoconf/general.m4:2270: AC_CACHE_CHECK is expanded from... /tmp/B.0ikkxwir/BUILD/bacula-9.4.2/autoconf/gettext-macros/gettext.m4:57: AM_GNU_GETTEXT is expanded from... autoconf/configure.in:379: the top level autoconf/configure.in:410: warning: The macro `AC_HELP_STRING' is obsolete. autoconf/configure.in:410: You should run autoupdate. ./lib/autoconf/general.m4:204: AC_HELP_STRING is expanded from... autoconf/configure.in:410: the top level autoconf/configure.in:448: warning: The macro `AC_HELP_STRING' is obsolete. autoconf/configure.in:448: You should run autoupdate. ./lib/autoconf/general.m4:204: AC_HELP_STRING is expanded from... autoconf/configure.in:448: the top level autoconf/configure.in:464: warning: The macro `AC_HELP_STRING' is obsolete. autoconf/configure.in:464: You should run autoupdate. ./lib/autoconf/general.m4:204: AC_HELP_STRING is expanded from... autoconf/configure.in:464: the top level autoconf/configure.in:481: warning: The macro `AC_HELP_STRING' is obsolete. autoconf/configure.in:481: You should run autoupdate. ./lib/autoconf/general.m4:204: AC_HELP_STRING is expanded from... autoconf/configure.in:481: the top level autoconf/configure.in:503: warning: The macro `AC_HELP_STRING' is obsolete. autoconf/configure.in:503: You should run autoupdate. ./lib/autoconf/general.m4:204: AC_HELP_STRING is expanded from... autoconf/configure.in:503: the top level autoconf/configure.in:525: warning: The macro `AC_HELP_STRING' is obsolete. autoconf/configure.in:525: You should run autoupdate. ./lib/autoconf/general.m4:204: AC_HELP_STRING is expanded from... autoconf/configure.in:525: the top level autoconf/configure.in:547: warning: The macro `AC_HELP_STRING' is obsolete. autoconf/configure.in:547: You should run autoupdate. ./lib/autoconf/general.m4:204: AC_HELP_STRING is expanded from... autoconf/configure.in:547: the top level autoconf/configure.in:569: warning: The macro `AC_HELP_STRING' is obsolete. autoconf/configure.in:569: You should run autoupdate. ./lib/autoconf/general.m4:204: AC_HELP_STRING is expanded from... autoconf/configure.in:569: the top level autoconf/configure.in:591: warning: The macro `AC_HELP_STRING' is obsolete. autoconf/configure.in:591: You should run autoupdate. ./lib/autoconf/general.m4:204: AC_HELP_STRING is expanded from... autoconf/configure.in:591: the top level autoconf/configure.in:612: warning: The macro `AC_HELP_STRING' is obsolete. autoconf/configure.in:612: You should run autoupdate. ./lib/autoconf/general.m4:204: AC_HELP_STRING is expanded from... autoconf/configure.in:612: the top level autoconf/configure.in:630: warning: The macro `AC_HELP_STRING' is obsolete. autoconf/configure.in:630: You should run autoupdate. ./lib/autoconf/general.m4:204: AC_HELP_STRING is expanded from... autoconf/configure.in:630: the top level autoconf/configure.in:649: warning: The macro `AC_HELP_STRING' is obsolete. autoconf/configure.in:649: You should run autoupdate. ./lib/autoconf/general.m4:204: AC_HELP_STRING is expanded from... autoconf/configure.in:649: the top level autoconf/configure.in:664: warning: The macro `AC_HELP_STRING' is obsolete. autoconf/configure.in:664: You should run autoupdate. ./lib/autoconf/general.m4:204: AC_HELP_STRING is expanded from... autoconf/configure.in:664: the top level autoconf/configure.in:673: warning: The macro `AC_TRY_LINK' is obsolete. autoconf/configure.in:673: You should run autoupdate. ./lib/autoconf/general.m4:2920: AC_TRY_LINK is expanded from... autoconf/configure.in:673: the top level autoconf/configure.in:684: warning: The macro `AC_TRY_LINK' is obsolete. autoconf/configure.in:684: You should run autoupdate. ./lib/autoconf/general.m4:2920: AC_TRY_LINK is expanded from... autoconf/configure.in:684: the top level autoconf/configure.in:734: warning: The macro `AC_HELP_STRING' is obsolete. autoconf/configure.in:734: You should run autoupdate. ./lib/autoconf/general.m4:204: AC_HELP_STRING is expanded from... autoconf/configure.in:734: the top level autoconf/configure.in:746: warning: The macro `AC_HELP_STRING' is obsolete. autoconf/configure.in:746: You should run autoupdate. ./lib/autoconf/general.m4:204: AC_HELP_STRING is expanded from... autoconf/configure.in:746: the top level autoconf/configure.in:845: warning: The macro `AC_HELP_STRING' is obsolete. autoconf/configure.in:845: You should run autoupdate. ./lib/autoconf/general.m4:204: AC_HELP_STRING is expanded from... autoconf/configure.in:845: the top level autoconf/configure.in:844: warning: The macro `AC_TRY_LINK' is obsolete. autoconf/configure.in:844: You should run autoupdate. ./lib/autoconf/general.m4:2920: AC_TRY_LINK is expanded from... lib/m4sugar/m4sh.m4:699: AS_IF is expanded from... ./lib/autoconf/general.m4:1553: AC_ARG_WITH is expanded from... autoconf/configure.in:844: the top level autoconf/configure.in:844: warning: The macro `AC_TRY_LINK' is obsolete. autoconf/configure.in:844: You should run autoupdate. ./lib/autoconf/general.m4:2920: AC_TRY_LINK is expanded from... lib/m4sugar/m4sh.m4:692: _AS_IF_ELSE is expanded from... lib/m4sugar/m4sh.m4:699: AS_IF is expanded from... ./lib/autoconf/general.m4:2894: _AC_LINK_IFELSE is expanded from... ./lib/autoconf/general.m4:2911: AC_LINK_IFELSE is expanded from... ./lib/autoconf/general.m4:2920: AC_TRY_LINK is expanded from... lib/m4sugar/m4sh.m4:699: AS_IF is expanded from... ./lib/autoconf/general.m4:1553: AC_ARG_WITH is expanded from... autoconf/configure.in:844: the top level autoconf/configure.in:903: warning: The macro `AC_HELP_STRING' is obsolete. autoconf/configure.in:903: You should run autoupdate. ./lib/autoconf/general.m4:204: AC_HELP_STRING is expanded from... autoconf/configure.in:903: the top level autoconf/configure.in:928: warning: The macro `AC_TRY_LINK' is obsolete. autoconf/configure.in:928: You should run autoupdate. ./lib/autoconf/general.m4:2920: AC_TRY_LINK is expanded from... autoconf/configure.in:928: the top level autoconf/configure.in:942: warning: The macro `AC_TRY_LINK' is obsolete. autoconf/configure.in:942: You should run autoupdate. ./lib/autoconf/general.m4:2920: AC_TRY_LINK is expanded from... autoconf/configure.in:942: the top level autoconf/configure.in:958: warning: The macro `AC_TRY_LINK' is obsolete. autoconf/configure.in:958: You should run autoupdate. ./lib/autoconf/general.m4:2920: AC_TRY_LINK is expanded from... autoconf/configure.in:958: the top level autoconf/configure.in:1015: warning: The macro `AC_HELP_STRING' is obsolete. autoconf/configure.in:1015: You should run autoupdate. ./lib/autoconf/general.m4:204: AC_HELP_STRING is expanded from... autoconf/configure.in:1015: the top level autoconf/configure.in:1030: warning: The macro `AC_HELP_STRING' is obsolete. autoconf/configure.in:1030: You should run autoupdate. ./lib/autoconf/general.m4:204: AC_HELP_STRING is expanded from... autoconf/configure.in:1030: the top level autoconf/configure.in:1045: warning: The macro `AC_HELP_STRING' is obsolete. autoconf/configure.in:1045: You should run autoupdate. ./lib/autoconf/general.m4:204: AC_HELP_STRING is expanded from... autoconf/configure.in:1045: the top level autoconf/configure.in:1068: warning: The macro `AC_HELP_STRING' is obsolete. autoconf/configure.in:1068: You should run autoupdate. ./lib/autoconf/general.m4:204: AC_HELP_STRING is expanded from... autoconf/configure.in:1068: the top level autoconf/configure.in:1084: warning: The macro `AC_HELP_STRING' is obsolete. autoconf/configure.in:1084: You should run autoupdate. ./lib/autoconf/general.m4:204: AC_HELP_STRING is expanded from... autoconf/configure.in:1084: the top level autoconf/configure.in:1100: warning: The macro `AC_HELP_STRING' is obsolete. autoconf/configure.in:1100: You should run autoupdate. ./lib/autoconf/general.m4:204: AC_HELP_STRING is expanded from... autoconf/configure.in:1100: the top level autoconf/configure.in:1115: warning: The macro `AC_HELP_STRING' is obsolete. autoconf/configure.in:1115: You should run autoupdate. ./lib/autoconf/general.m4:204: AC_HELP_STRING is expanded from... autoconf/configure.in:1115: the top level autoconf/configure.in:1131: warning: The macro `AC_HELP_STRING' is obsolete. autoconf/configure.in:1131: You should run autoupdate. ./lib/autoconf/general.m4:204: AC_HELP_STRING is expanded from... autoconf/configure.in:1131: the top level autoconf/configure.in:1150: warning: The macro `AC_HELP_STRING' is obsolete. autoconf/configure.in:1150: You should run autoupdate. ./lib/autoconf/general.m4:204: AC_HELP_STRING is expanded from... autoconf/configure.in:1150: the top level autoconf/configure.in:1165: warning: The macro `AC_HELP_STRING' is obsolete. autoconf/configure.in:1165: You should run autoupdate. ./lib/autoconf/general.m4:204: AC_HELP_STRING is expanded from... autoconf/configure.in:1165: the top level autoconf/configure.in:1180: warning: The macro `AC_HELP_STRING' is obsolete. autoconf/configure.in:1180: You should run autoupdate. ./lib/autoconf/general.m4:204: AC_HELP_STRING is expanded from... autoconf/configure.in:1180: the top level autoconf/configure.in:1195: warning: The macro `AC_HELP_STRING' is obsolete. autoconf/configure.in:1195: You should run autoupdate. ./lib/autoconf/general.m4:204: AC_HELP_STRING is expanded from... autoconf/configure.in:1195: the top level autoconf/configure.in:1218: warning: The macro `AC_HELP_STRING' is obsolete. autoconf/configure.in:1218: You should run autoupdate. ./lib/autoconf/general.m4:204: AC_HELP_STRING is expanded from... autoconf/configure.in:1218: the top level autoconf/configure.in:1233: warning: The macro `AC_HELP_STRING' is obsolete. autoconf/configure.in:1233: You should run autoupdate. ./lib/autoconf/general.m4:204: AC_HELP_STRING is expanded from... autoconf/configure.in:1233: the top level autoconf/configure.in:1255: warning: The macro `AC_HELP_STRING' is obsolete. autoconf/configure.in:1255: You should run autoupdate. ./lib/autoconf/general.m4:204: AC_HELP_STRING is expanded from... autoconf/configure.in:1255: the top level autoconf/configure.in:1274: warning: The macro `AC_HELP_STRING' is obsolete. autoconf/configure.in:1274: You should run autoupdate. ./lib/autoconf/general.m4:204: AC_HELP_STRING is expanded from... autoconf/configure.in:1274: the top level autoconf/configure.in:1293: warning: The macro `AC_HELP_STRING' is obsolete. autoconf/configure.in:1293: You should run autoupdate. ./lib/autoconf/general.m4:204: AC_HELP_STRING is expanded from... autoconf/configure.in:1293: the top level autoconf/configure.in:1312: warning: The macro `AC_HELP_STRING' is obsolete. autoconf/configure.in:1312: You should run autoupdate. ./lib/autoconf/general.m4:204: AC_HELP_STRING is expanded from... autoconf/configure.in:1312: the top level autoconf/configure.in:1331: warning: The macro `AC_HELP_STRING' is obsolete. autoconf/configure.in:1331: You should run autoupdate. ./lib/autoconf/general.m4:204: AC_HELP_STRING is expanded from... autoconf/configure.in:1331: the top level autoconf/configure.in:1350: warning: The macro `AC_HELP_STRING' is obsolete. autoconf/configure.in:1350: You should run autoupdate. ./lib/autoconf/general.m4:204: AC_HELP_STRING is expanded from... autoconf/configure.in:1350: the top level autoconf/configure.in:1379: warning: The macro `AC_HELP_STRING' is obsolete. autoconf/configure.in:1379: You should run autoupdate. ./lib/autoconf/general.m4:204: AC_HELP_STRING is expanded from... autoconf/configure.in:1379: the top level autoconf/configure.in:1390: warning: The macro `AC_HELP_STRING' is obsolete. autoconf/configure.in:1390: You should run autoupdate. ./lib/autoconf/general.m4:204: AC_HELP_STRING is expanded from... autoconf/configure.in:1390: the top level autoconf/configure.in:1401: warning: The macro `AC_HELP_STRING' is obsolete. autoconf/configure.in:1401: You should run autoupdate. ./lib/autoconf/general.m4:204: AC_HELP_STRING is expanded from... autoconf/configure.in:1401: the top level autoconf/configure.in:1415: warning: The macro `AC_HELP_STRING' is obsolete. autoconf/configure.in:1415: You should run autoupdate. ./lib/autoconf/general.m4:204: AC_HELP_STRING is expanded from... autoconf/configure.in:1415: the top level autoconf/configure.in:1429: warning: The macro `AC_HELP_STRING' is obsolete. autoconf/configure.in:1429: You should run autoupdate. ./lib/autoconf/general.m4:204: AC_HELP_STRING is expanded from... autoconf/configure.in:1429: the top level autoconf/configure.in:1443: warning: The macro `AC_HELP_STRING' is obsolete. autoconf/configure.in:1443: You should run autoupdate. ./lib/autoconf/general.m4:204: AC_HELP_STRING is expanded from... autoconf/configure.in:1443: the top level autoconf/configure.in:1453: warning: The macro `AC_HELP_STRING' is obsolete. autoconf/configure.in:1453: You should run autoupdate. ./lib/autoconf/general.m4:204: AC_HELP_STRING is expanded from... autoconf/configure.in:1453: the top level autoconf/configure.in:1463: warning: The macro `AC_HELP_STRING' is obsolete. autoconf/configure.in:1463: You should run autoupdate. ./lib/autoconf/general.m4:204: AC_HELP_STRING is expanded from... autoconf/configure.in:1463: the top level autoconf/configure.in:1473: warning: The macro `AC_HELP_STRING' is obsolete. autoconf/configure.in:1473: You should run autoupdate. ./lib/autoconf/general.m4:204: AC_HELP_STRING is expanded from... autoconf/configure.in:1473: the top level autoconf/configure.in:1483: warning: The macro `AC_HELP_STRING' is obsolete. autoconf/configure.in:1483: You should run autoupdate. ./lib/autoconf/general.m4:204: AC_HELP_STRING is expanded from... autoconf/configure.in:1483: the top level autoconf/configure.in:1493: warning: The macro `AC_HELP_STRING' is obsolete. autoconf/configure.in:1493: You should run autoupdate. ./lib/autoconf/general.m4:204: AC_HELP_STRING is expanded from... autoconf/configure.in:1493: the top level autoconf/configure.in:1513: warning: The macro `AC_HELP_STRING' is obsolete. autoconf/configure.in:1513: You should run autoupdate. ./lib/autoconf/general.m4:204: AC_HELP_STRING is expanded from... autoconf/configure.in:1513: the top level autoconf/configure.in:1528: warning: The macro `AC_HELP_STRING' is obsolete. autoconf/configure.in:1528: You should run autoupdate. ./lib/autoconf/general.m4:204: AC_HELP_STRING is expanded from... autoconf/configure.in:1528: the top level autoconf/configure.in:1549: warning: The macro `AC_HELP_STRING' is obsolete. autoconf/configure.in:1549: You should run autoupdate. ./lib/autoconf/general.m4:204: AC_HELP_STRING is expanded from... /tmp/B.0ikkxwir/BUILD/bacula-9.4.2/autoconf/bacula-macros/db.m4:860: BA_CHECK_POSTGRESQL_DB is expanded from... autoconf/configure.in:1549: the top level autoconf/configure.in:1551: warning: The macro `AC_HELP_STRING' is obsolete. autoconf/configure.in:1551: You should run autoupdate. ./lib/autoconf/general.m4:204: AC_HELP_STRING is expanded from... /tmp/B.0ikkxwir/BUILD/bacula-9.4.2/autoconf/bacula-macros/db.m4:336: BA_CHECK_MYSQL_DB is expanded from... autoconf/configure.in:1551: the top level autoconf/configure.in:1553: warning: The macro `AC_HELP_STRING' is obsolete. autoconf/configure.in:1553: You should run autoupdate. ./lib/autoconf/general.m4:204: AC_HELP_STRING is expanded from... /tmp/B.0ikkxwir/BUILD/bacula-9.4.2/autoconf/bacula-macros/db.m4:748: BA_CHECK_SQLITE3_DB is expanded from... autoconf/configure.in:1553: the top level autoconf/configure.in:1658: warning: The macro `AC_TRY_LINK' is obsolete. autoconf/configure.in:1658: You should run autoupdate. ./lib/autoconf/general.m4:2920: AC_TRY_LINK is expanded from... lib/m4sugar/m4sh.m4:692: _AS_IF_ELSE is expanded from... lib/m4sugar/m4sh.m4:699: AS_IF is expanded from... ./lib/autoconf/general.m4:2249: AC_CACHE_VAL is expanded from... ./lib/autoconf/general.m4:2270: AC_CACHE_CHECK is expanded from... /tmp/B.0ikkxwir/BUILD/bacula-9.4.2/autoconf/bacula-macros/largefiles.m4:17: AC_SYS_LARGEFILE_FLAGS is expanded from... /tmp/B.0ikkxwir/BUILD/bacula-9.4.2/autoconf/bacula-macros/largefiles.m4:71: AC_BAC_LARGEFILE is expanded from... autoconf/configure.in:1658: the top level autoconf/configure.in:1699: warning: The macro `AC_HEADER_STDC' is obsolete. autoconf/configure.in:1699: You should run autoupdate. ./lib/autoconf/headers.m4:704: AC_HEADER_STDC is expanded from... autoconf/configure.in:1699: the top level autoconf/configure.in:1704: warning: The macro `AC_HEADER_TIME' is obsolete. autoconf/configure.in:1704: You should run autoupdate. ./lib/autoconf/headers.m4:743: AC_HEADER_TIME is expanded from... autoconf/configure.in:1704: the top level autoconf/configure.in:1705: warning: The macro `AC_STRUCT_ST_BLKSIZE' is obsolete. autoconf/configure.in:1705: You should run autoupdate. ./lib/autoconf/types.m4:1000: AC_STRUCT_ST_BLKSIZE is expanded from... autoconf/configure.in:1705: the top level autoconf/configure.in:1712: warning: The macro `AC_TRY_COMPILE' is obsolete. autoconf/configure.in:1712: You should run autoupdate. ./lib/autoconf/general.m4:2847: AC_TRY_COMPILE is expanded from... lib/m4sugar/m4sh.m4:692: _AS_IF_ELSE is expanded from... lib/m4sugar/m4sh.m4:699: AS_IF is expanded from... ./lib/autoconf/general.m4:2249: AC_CACHE_VAL is expanded from... ./lib/autoconf/general.m4:2270: AC_CACHE_CHECK is expanded from... autoconf/configure.in:1712: the top level autoconf/configure.in:1733: warning: The macro `AC_TRY_COMPILE' is obsolete. autoconf/configure.in:1733: You should run autoupdate. ./lib/autoconf/general.m4:2847: AC_TRY_COMPILE is expanded from... lib/m4sugar/m4sh.m4:692: _AS_IF_ELSE is expanded from... lib/m4sugar/m4sh.m4:699: AS_IF is expanded from... ./lib/autoconf/general.m4:2249: AC_CACHE_VAL is expanded from... ./lib/autoconf/general.m4:2270: AC_CACHE_CHECK is expanded from... autoconf/configure.in:1733: the top level autoconf/configure.in:1755: warning: The macro `AC_TRY_COMPILE' is obsolete. autoconf/configure.in:1755: You should run autoupdate. ./lib/autoconf/general.m4:2847: AC_TRY_COMPILE is expanded from... lib/m4sugar/m4sh.m4:692: _AS_IF_ELSE is expanded from... lib/m4sugar/m4sh.m4:699: AS_IF is expanded from... ./lib/autoconf/general.m4:2249: AC_CACHE_VAL is expanded from... ./lib/autoconf/general.m4:2270: AC_CACHE_CHECK is expanded from... autoconf/configure.in:1755: the top level autoconf/configure.in:1784: warning: The macro `AC_TRY_RUN' is obsolete. autoconf/configure.in:1784: You should run autoupdate. ./lib/autoconf/general.m4:2997: AC_TRY_RUN is expanded from... lib/m4sugar/m4sh.m4:692: _AS_IF_ELSE is expanded from... lib/m4sugar/m4sh.m4:699: AS_IF is expanded from... ./lib/autoconf/general.m4:2249: AC_CACHE_VAL is expanded from... ./lib/autoconf/general.m4:2270: AC_CACHE_CHECK is expanded from... autoconf/configure.in:1784: the top level autoconf/configure.in:1812: warning: The macro `AC_TRY_CPP' is obsolete. autoconf/configure.in:1812: You should run autoupdate. ./lib/autoconf/general.m4:2762: AC_TRY_CPP is expanded from... autoconf/configure.in:1812: the top level autoconf/configure.in:1820: warning: The macro `AC_TRY_CPP' is obsolete. autoconf/configure.in:1820: You should run autoupdate. ./lib/autoconf/general.m4:2762: AC_TRY_CPP is expanded from... autoconf/configure.in:1820: the top level autoconf/configure.in:1829: warning: The macro `AC_TRY_CPP' is obsolete. autoconf/configure.in:1829: You should run autoupdate. ./lib/autoconf/general.m4:2762: AC_TRY_CPP is expanded from... autoconf/configure.in:1829: the top level autoconf/configure.in:1838: warning: The macro `AC_TRY_CPP' is obsolete. autoconf/configure.in:1838: You should run autoupdate. ./lib/autoconf/general.m4:2762: AC_TRY_CPP is expanded from... autoconf/configure.in:1838: the top level autoconf/configure.in:1849: warning: The macro `AC_TRY_CPP' is obsolete. autoconf/configure.in:1849: You should run autoupdate. ./lib/autoconf/general.m4:2762: AC_TRY_CPP is expanded from... autoconf/configure.in:1849: the top level autoconf/configure.in:1904: warning: The macro `AC_HELP_STRING' is obsolete. autoconf/configure.in:1904: You should run autoupdate. ./lib/autoconf/general.m4:204: AC_HELP_STRING is expanded from... autoconf/configure.in:1904: the top level autoconf/configure.in:1955: warning: The macro `AC_TYPE_SIGNAL' is obsolete. autoconf/configure.in:1955: You should run autoupdate. ./lib/autoconf/types.m4:776: AC_TYPE_SIGNAL is expanded from... autoconf/configure.in:1955: the top level autoconf/configure.in:1956: warning: The macro `AC_TRY_LINK' is obsolete. autoconf/configure.in:1956: You should run autoupdate. ./lib/autoconf/general.m4:2920: AC_TRY_LINK is expanded from... lib/m4sugar/m4sh.m4:692: _AS_IF_ELSE is expanded from... lib/m4sugar/m4sh.m4:699: AS_IF is expanded from... ./lib/autoconf/general.m4:2249: AC_CACHE_VAL is expanded from... /tmp/B.0ikkxwir/BUILD/bacula-9.4.2/autoconf/bacula-macros/os.m4:6: SIGNAL_CHECK is expanded from... autoconf/configure.in:1956: the top level autoconf/configure.in:1956: warning: The macro `AC_TRY_LINK' is obsolete. autoconf/configure.in:1956: You should run autoupdate. ./lib/autoconf/general.m4:2920: AC_TRY_LINK is expanded from... lib/m4sugar/m4sh.m4:692: _AS_IF_ELSE is expanded from... lib/m4sugar/m4sh.m4:699: AS_IF is expanded from... ./lib/autoconf/general.m4:2894: _AC_LINK_IFELSE is expanded from... ./lib/autoconf/general.m4:2911: AC_LINK_IFELSE is expanded from... ./lib/autoconf/general.m4:2920: AC_TRY_LINK is expanded from... lib/m4sugar/m4sh.m4:692: _AS_IF_ELSE is expanded from... lib/m4sugar/m4sh.m4:699: AS_IF is expanded from... ./lib/autoconf/general.m4:2249: AC_CACHE_VAL is expanded from... /tmp/B.0ikkxwir/BUILD/bacula-9.4.2/autoconf/bacula-macros/os.m4:6: SIGNAL_CHECK is expanded from... autoconf/configure.in:1956: the top level autoconf/configure.in:1956: warning: The macro `AC_TRY_LINK' is obsolete. autoconf/configure.in:1956: You should run autoupdate. ./lib/autoconf/general.m4:2920: AC_TRY_LINK is expanded from... lib/m4sugar/m4sh.m4:692: _AS_IF_ELSE is expanded from... lib/m4sugar/m4sh.m4:699: AS_IF is expanded from... ./lib/autoconf/general.m4:2894: _AC_LINK_IFELSE is expanded from... ./lib/autoconf/general.m4:2911: AC_LINK_IFELSE is expanded from... ./lib/autoconf/general.m4:2920: AC_TRY_LINK is expanded from... lib/m4sugar/m4sh.m4:692: _AS_IF_ELSE is expanded from... lib/m4sugar/m4sh.m4:699: AS_IF is expanded from... ./lib/autoconf/general.m4:2894: _AC_LINK_IFELSE is expanded from... ./lib/autoconf/general.m4:2911: AC_LINK_IFELSE is expanded from... ./lib/autoconf/general.m4:2920: AC_TRY_LINK is expanded from... lib/m4sugar/m4sh.m4:692: _AS_IF_ELSE is expanded from... lib/m4sugar/m4sh.m4:699: AS_IF is expanded from... ./lib/autoconf/general.m4:2249: AC_CACHE_VAL is expanded from... /tmp/B.0ikkxwir/BUILD/bacula-9.4.2/autoconf/bacula-macros/os.m4:6: SIGNAL_CHECK is expanded from... autoconf/configure.in:1956: the top level autoconf/configure.in:1971: warning: The macro `AC_STRUCT_ST_RDEV' is obsolete. autoconf/configure.in:1971: You should run autoupdate. ./lib/autoconf/types.m4:1038: AC_STRUCT_ST_RDEV is expanded from... autoconf/configure.in:1971: the top level autoconf/configure.in:1984: warning: The macro `AC_TRY_COMPILE' is obsolete. autoconf/configure.in:1984: You should run autoupdate. ./lib/autoconf/general.m4:2847: AC_TRY_COMPILE is expanded from... lib/m4sugar/m4sh.m4:692: _AS_IF_ELSE is expanded from... lib/m4sugar/m4sh.m4:699: AS_IF is expanded from... ./lib/autoconf/general.m4:2249: AC_CACHE_VAL is expanded from... ./lib/autoconf/general.m4:2270: AC_CACHE_CHECK is expanded from... autoconf/configure.in:1984: the top level autoconf/configure.in:2004: warning: The macro `AC_TRY_COMPILE' is obsolete. autoconf/configure.in:2004: You should run autoupdate. ./lib/autoconf/general.m4:2847: AC_TRY_COMPILE is expanded from... lib/m4sugar/m4sh.m4:692: _AS_IF_ELSE is expanded from... lib/m4sugar/m4sh.m4:699: AS_IF is expanded from... ./lib/autoconf/general.m4:2249: AC_CACHE_VAL is expanded from... ./lib/autoconf/general.m4:2270: AC_CACHE_CHECK is expanded from... autoconf/configure.in:2004: the top level autoconf/configure.in:2004: warning: The macro `AC_TRY_COMPILE' is obsolete. autoconf/configure.in:2004: You should run autoupdate. ./lib/autoconf/general.m4:2847: AC_TRY_COMPILE is expanded from... lib/m4sugar/m4sh.m4:692: _AS_IF_ELSE is expanded from... lib/m4sugar/m4sh.m4:699: AS_IF is expanded from... ./lib/autoconf/general.m4:2823: _AC_COMPILE_IFELSE is expanded from... ./lib/autoconf/general.m4:2839: AC_COMPILE_IFELSE is expanded from... ./lib/autoconf/general.m4:2847: AC_TRY_COMPILE is expanded from... lib/m4sugar/m4sh.m4:692: _AS_IF_ELSE is expanded from... lib/m4sugar/m4sh.m4:699: AS_IF is expanded from... ./lib/autoconf/general.m4:2249: AC_CACHE_VAL is expanded from... ./lib/autoconf/general.m4:2270: AC_CACHE_CHECK is expanded from... autoconf/configure.in:2004: the top level autoconf/configure.in:2034: warning: The macro `AC_TRY_COMPILE' is obsolete. autoconf/configure.in:2034: You should run autoupdate. ./lib/autoconf/general.m4:2847: AC_TRY_COMPILE is expanded from... lib/m4sugar/m4sh.m4:692: _AS_IF_ELSE is expanded from... lib/m4sugar/m4sh.m4:699: AS_IF is expanded from... ./lib/autoconf/general.m4:2249: AC_CACHE_VAL is expanded from... ./lib/autoconf/general.m4:2270: AC_CACHE_CHECK is expanded from... autoconf/configure.in:2034: the top level autoconf/configure.in:2034: warning: The macro `AC_TRY_COMPILE' is obsolete. autoconf/configure.in:2034: You should run autoupdate. ./lib/autoconf/general.m4:2847: AC_TRY_COMPILE is expanded from... lib/m4sugar/m4sh.m4:692: _AS_IF_ELSE is expanded from... lib/m4sugar/m4sh.m4:699: AS_IF is expanded from... ./lib/autoconf/general.m4:2823: _AC_COMPILE_IFELSE is expanded from... ./lib/autoconf/general.m4:2839: AC_COMPILE_IFELSE is expanded from... ./lib/autoconf/general.m4:2847: AC_TRY_COMPILE is expanded from... lib/m4sugar/m4sh.m4:692: _AS_IF_ELSE is expanded from... lib/m4sugar/m4sh.m4:699: AS_IF is expanded from... ./lib/autoconf/general.m4:2249: AC_CACHE_VAL is expanded from... ./lib/autoconf/general.m4:2270: AC_CACHE_CHECK is expanded from... autoconf/configure.in:2034: the top level autoconf/configure.in:2064: warning: The macro `AC_TRY_COMPILE' is obsolete. autoconf/configure.in:2064: You should run autoupdate. ./lib/autoconf/general.m4:2847: AC_TRY_COMPILE is expanded from... lib/m4sugar/m4sh.m4:692: _AS_IF_ELSE is expanded from... lib/m4sugar/m4sh.m4:699: AS_IF is expanded from... ./lib/autoconf/general.m4:2249: AC_CACHE_VAL is expanded from... ./lib/autoconf/general.m4:2270: AC_CACHE_CHECK is expanded from... autoconf/configure.in:2064: the top level autoconf/configure.in:2084: warning: The macro `AC_TRY_COMPILE' is obsolete. autoconf/configure.in:2084: You should run autoupdate. ./lib/autoconf/general.m4:2847: AC_TRY_COMPILE is expanded from... lib/m4sugar/m4sh.m4:692: _AS_IF_ELSE is expanded from... lib/m4sugar/m4sh.m4:699: AS_IF is expanded from... ./lib/autoconf/general.m4:2249: AC_CACHE_VAL is expanded from... ./lib/autoconf/general.m4:2270: AC_CACHE_CHECK is expanded from... autoconf/configure.in:2084: the top level autoconf/configure.in:2104: warning: The macro `AC_TRY_COMPILE' is obsolete. autoconf/configure.in:2104: You should run autoupdate. ./lib/autoconf/general.m4:2847: AC_TRY_COMPILE is expanded from... lib/m4sugar/m4sh.m4:692: _AS_IF_ELSE is expanded from... lib/m4sugar/m4sh.m4:699: AS_IF is expanded from... ./lib/autoconf/general.m4:2249: AC_CACHE_VAL is expanded from... ./lib/autoconf/general.m4:2270: AC_CACHE_CHECK is expanded from... autoconf/configure.in:2104: the top level autoconf/configure.in:2124: warning: The macro `AC_TRY_COMPILE' is obsolete. autoconf/configure.in:2124: You should run autoupdate. ./lib/autoconf/general.m4:2847: AC_TRY_COMPILE is expanded from... lib/m4sugar/m4sh.m4:692: _AS_IF_ELSE is expanded from... lib/m4sugar/m4sh.m4:699: AS_IF is expanded from... ./lib/autoconf/general.m4:2249: AC_CACHE_VAL is expanded from... ./lib/autoconf/general.m4:2270: AC_CACHE_CHECK is expanded from... autoconf/configure.in:2124: the top level autoconf/configure.in:2148: warning: The macro `AC_TRY_COMPILE' is obsolete. autoconf/configure.in:2148: You should run autoupdate. ./lib/autoconf/general.m4:2847: AC_TRY_COMPILE is expanded from... autoconf/configure.in:2148: the top level autoconf/configure.in:2167: warning: The macro `AC_TRY_COMPILE' is obsolete. autoconf/configure.in:2167: You should run autoupdate. ./lib/autoconf/general.m4:2847: AC_TRY_COMPILE is expanded from... lib/m4sugar/m4sh.m4:692: _AS_IF_ELSE is expanded from... lib/m4sugar/m4sh.m4:699: AS_IF is expanded from... ./lib/autoconf/general.m4:2249: AC_CACHE_VAL is expanded from... ./lib/autoconf/general.m4:2270: AC_CACHE_CHECK is expanded from... autoconf/configure.in:2167: the top level autoconf/configure.in:2192: warning: The macro `AC_TRY_COMPILE' is obsolete. autoconf/configure.in:2192: You should run autoupdate. ./lib/autoconf/general.m4:2847: AC_TRY_COMPILE is expanded from... autoconf/configure.in:2192: the top level autoconf/configure.in:2212: warning: The macro `AC_TRY_COMPILE' is obsolete. autoconf/configure.in:2212: You should run autoupdate. ./lib/autoconf/general.m4:2847: AC_TRY_COMPILE is expanded from... autoconf/configure.in:2212: the top level autoconf/configure.in:2276: warning: The macro `AC_TRY_LINK' is obsolete. autoconf/configure.in:2276: You should run autoupdate. ./lib/autoconf/general.m4:2920: AC_TRY_LINK is expanded from... autoconf/configure.in:2276: the top level autoconf/configure.in:2284: warning: The macro `AC_TRY_LINK' is obsolete. autoconf/configure.in:2284: You should run autoupdate. ./lib/autoconf/general.m4:2920: AC_TRY_LINK is expanded from... lib/m4sugar/m4sh.m4:692: _AS_IF_ELSE is expanded from... lib/m4sugar/m4sh.m4:699: AS_IF is expanded from... ./lib/autoconf/general.m4:2249: AC_CACHE_VAL is expanded from... ./lib/autoconf/general.m4:2270: AC_CACHE_CHECK is expanded from... autoconf/configure.in:2284: the top level autoconf/configure.in:2323: warning: The macro `AC_TRY_COMPILE' is obsolete. autoconf/configure.in:2323: You should run autoupdate. ./lib/autoconf/general.m4:2847: AC_TRY_COMPILE is expanded from... lib/m4sugar/m4sh.m4:692: _AS_IF_ELSE is expanded from... lib/m4sugar/m4sh.m4:699: AS_IF is expanded from... ./lib/autoconf/general.m4:2249: AC_CACHE_VAL is expanded from... ./lib/autoconf/general.m4:2270: AC_CACHE_CHECK is expanded from... autoconf/configure.in:2323: the top level autoconf/configure.in:2349: warning: The macro `AC_TRY_RUN' is obsolete. autoconf/configure.in:2349: You should run autoupdate. ./lib/autoconf/general.m4:2997: AC_TRY_RUN is expanded from... lib/m4sugar/m4sh.m4:692: _AS_IF_ELSE is expanded from... lib/m4sugar/m4sh.m4:699: AS_IF is expanded from... ./lib/autoconf/general.m4:2249: AC_CACHE_VAL is expanded from... ./lib/autoconf/general.m4:2270: AC_CACHE_CHECK is expanded from... autoconf/configure.in:2349: the top level autoconf/configure.in:2423: warning: The macro `AC_HELP_STRING' is obsolete. autoconf/configure.in:2423: You should run autoupdate. ./lib/autoconf/general.m4:204: AC_HELP_STRING is expanded from... autoconf/configure.in:2423: the top level autoconf/configure.in:2436: warning: The macro `AC_HELP_STRING' is obsolete. autoconf/configure.in:2436: You should run autoupdate. ./lib/autoconf/general.m4:204: AC_HELP_STRING is expanded from... autoconf/configure.in:2436: the top level autoconf/configure.in:2470: warning: The macro `AC_TRY_CPP' is obsolete. autoconf/configure.in:2470: You should run autoupdate. ./lib/autoconf/general.m4:2762: AC_TRY_CPP is expanded from... autoconf/configure.in:2470: the top level autoconf/configure.in:2529: warning: The macro `AC_HELP_STRING' is obsolete. autoconf/configure.in:2529: You should run autoupdate. ./lib/autoconf/general.m4:204: AC_HELP_STRING is expanded from... autoconf/configure.in:2529: the top level autoconf/configure.in:2544: warning: The macro `AC_HELP_STRING' is obsolete. autoconf/configure.in:2544: You should run autoupdate. ./lib/autoconf/general.m4:204: AC_HELP_STRING is expanded from... autoconf/configure.in:2544: the top level autoconf/configure.in:2597: warning: The macro `AC_HELP_STRING' is obsolete. autoconf/configure.in:2597: You should run autoupdate. ./lib/autoconf/general.m4:204: AC_HELP_STRING is expanded from... autoconf/configure.in:2597: the top level autoconf/configure.in:2764: warning: The macro `AC_HELP_STRING' is obsolete. autoconf/configure.in:2764: You should run autoupdate. ./lib/autoconf/general.m4:204: AC_HELP_STRING is expanded from... autoconf/configure.in:2764: the top level autoconf/configure.in:3325: warning: The macro `AC_HELP_STRING' is obsolete. autoconf/configure.in:3325: You should run autoupdate. ./lib/autoconf/general.m4:204: AC_HELP_STRING is expanded from... autoconf/configure.in:3325: the top level autoconf/configure.in:3388: warning: AC_OUTPUT should be used without arguments. autoconf/configure.in:3388: You should run autoupdate. + CPPFLAGS='-I/usr/include/ncurses -I/usr/include/readline' + pwd + BUILD_DIR=/tmp/B.0ikkxwir/BUILD/bacula-9.4.2 QMAKE=/usr/bin/qmake-qt5 ./configure 'LDFLAGS=-Wl,--as-needed -Wl,--no-copy-dt-needed-entries -Wl,-z,relro -Wl,-z,combreloc ' 'CFLAGS=-O2 -fwrapv -pipe -Wformat -Werror=format-security -gdwarf-4 -fno-debug-types-section -fvar-tracking-assignments -g2 -Wp,-D_FORTIFY_SOURCE=2 -fstack-protector-strong --param=ssp-buffer-size=4 -Werror=trampolines -fomit-frame-pointer -march=i686 -fasynchronous-unwind-tables -mtune=pentium4 -gdwarf-4 -fno-debug-types-section -fvar-tracking-assignments -g2 ' 'CXXFLAGS=-O2 -fwrapv -pipe -Wformat -Werror=format-security -gdwarf-4 -fno-debug-types-section -fvar-tracking-assignments -g2 -Wp,-D_FORTIFY_SOURCE=2 -fstack-protector-strong --param=ssp-buffer-size=4 -Werror=trampolines -fomit-frame-pointer -march=i686 -fasynchronous-unwind-tables -mtune=pentium4 -gdwarf-4 -fno-debug-types-section -fvar-tracking-assignments -g2 ' 'FFLAGS=-O2 -fwrapv -pipe -Wformat -Werror=format-security -gdwarf-4 -fno-debug-types-section -fvar-tracking-assignments -g2 -Wp,-D_FORTIFY_SOURCE=2 -fstack-protector-strong --param=ssp-buffer-size=4 -Werror=trampolines -fomit-frame-pointer -march=i686 -fasynchronous-unwind-tables -mtune=pentium4 -gdwarf-4 -fno-debug-types-section -fvar-tracking-assignments -g2 ' 'FCFLAGS=-O2 -fwrapv -pipe -Wformat -Werror=format-security -gdwarf-4 -fno-debug-types-section -fvar-tracking-assignments -g2 -Wp,-D_FORTIFY_SOURCE=2 -fstack-protector-strong --param=ssp-buffer-size=4 -Werror=trampolines -fomit-frame-pointer -march=i686 -fasynchronous-unwind-tables -mtune=pentium4 -gdwarf-4 -fno-debug-types-section -fvar-tracking-assignments -g2 ' 'CPPFLAGS=-I/usr/include/ncurses -I/usr/include/readline' 'CC=i686-pld-linux-gcc' 'CXX=i686-pld-linux-g++' '--host=i686-pld-linux' '--build=i686-pld-linux' '--prefix=/usr' '--exec-prefix=/usr' '--bindir=/usr/bin' '--sbindir=/usr/sbin' '--sysconfdir=/etc/bacula' '--datadir=/usr/share' '--includedir=/usr/include' '--libdir=/usr/lib' '--libexecdir=/usr/libexec' '--localstatedir=/var/lib/bacula' '--sharedstatedir=/var/lib' '--mandir=/usr/share/man' '--infodir=/usr/share/info' '--x-libraries=/usr/lib' 'DISTNAME=pld-linux' '--with-scriptdir=/usr/libexec/bacula' --enable-bat --disable-conio --enable-smartalloc --with-readline --with-tcp-wrappers '--with-working-dir=/var/lib/bacula' '--with-dump-email=root@localhost' '--with-job-email=root@localhost' '--with-smtp-host=localhost' '--with-pid-dir=/var/run' '--with-subsys-dir=/var/lock/subsys' '--with-systemd=/lib/systemd/system' --enable-batch-insert --with-postgresql --with-mysql --with-sqlite3 --without-s3 '--with-dir-password=#FAKE-dir-password#' '--with-fd-password=#FAKE-fd-password#' '--with-sd-password=#FAKE-sd-password#' '--with-mon-dir-password=#FAKE-mon-dir-password#' '--with-mon-fd-password=#FAKE-mon-fd-password#' '--with-mon-sd-password=#FAKE-mon-sd-password#' --with-openssl checking for true... /bin/true checking for false... /bin/false configuring for Bacula 9.4.2 (04 February 2019) checking for i686-pld-linux-gcc... i686-pld-linux-gcc checking whether the C compiler works... yes checking for C compiler default output file name... a.out checking for suffix of executables... checking whether we are cross compiling... no checking for suffix of object files... o checking whether the compiler supports GNU C... yes checking whether i686-pld-linux-gcc accepts -g... yes checking for i686-pld-linux-gcc option to enable C11 features... none needed checking whether the compiler supports GNU C++... yes checking whether i686-pld-linux-g++ accepts -g... yes checking for i686-pld-linux-g++ option to enable C++11 features... none needed checking whether i686-pld-linux-gcc and cc understand -c and -o together... yes checking how to run the C preprocessor... i686-pld-linux-gcc -E checking for grep that handles long lines and -e... /bin/grep checking for egrep... /bin/grep -E checking whether i686-pld-linux-gcc needs -traditional... no checking for i686-pld-linux-g++... /usr/bin/i686-pld-linux-g++ checking for multiarch system... checking for a BSD-compatible install... /usr/bin/install -c checking for mv... /bin/mv checking for rm... /bin/rm checking for cp... /bin/cp checking for sed... /bin/sed checking for echo... /bin/echo checking for cmp... /usr/bin/cmp checking for tbl... /usr/bin/tbl checking for ar... /usr/bin/ar checking for openssl... /usr/bin/openssl checking for mtx... mtx checking for dd... /bin/dd checking for mkisofs... /usr/bin/mkisofs checking for python... /usr/bin/python checking for growisofs... growisofs checking for dvd+rw-mediainfo... dvd+rw-mediainfo checking for dvd+rw-format... dvd+rw-format checking for pkg-config... /usr/bin/pkg-config checking for qmake... /usr/bin/qmake-qt5 checking for gmake... /usr/bin/gmake checking for pidof... /bin/pidof checking for mawk... mawk checking for mawk... /bin/mawk checking build system type... i686-pld-linux-gnu checking host system type... i686-pld-linux-gnu checking how to print strings... print -r checking for a sed that does not truncate output... (cached) /bin/sed checking for fgrep... /bin/grep -F checking for ld used by i686-pld-linux-gcc... /usr/bin/ld checking if the linker (/usr/bin/ld) is GNU ld... yes checking for BSD- or MS-compatible name lister (nm)... /usr/bin/nm -B checking the name lister (/usr/bin/nm -B) interface... BSD nm checking whether ln -s works... yes checking the maximum length of command line arguments... 1572864 checking whether the shell understands some XSI constructs... yes checking whether the shell understands "+="... yes checking how to convert i686-pld-linux-gnu file names to i686-pld-linux-gnu format... func_convert_file_noop checking how to convert i686-pld-linux-gnu file names to toolchain format... func_convert_file_noop checking for /usr/bin/ld option to reload object files... -r checking for i686-pld-linux-objdump... no checking for objdump... objdump checking how to recognize dependent libraries... pass_all checking for i686-pld-linux-dlltool... no checking for dlltool... no checking how to associate runtime and link libraries... print -r -- checking for i686-pld-linux-ar... /usr/bin/ar checking for archiver @FILE support... @ checking for i686-pld-linux-strip... no checking for strip... strip checking for i686-pld-linux-ranlib... no checking for ranlib... ranlib checking command to parse /usr/bin/nm -B output from i686-pld-linux-gcc object... ok checking for sysroot... no checking for i686-pld-linux-mt... no checking for mt... no checking if : is a manifest tool... no checking for stdio.h... yes checking for stdlib.h... yes checking for string.h... yes checking for inttypes.h... yes checking for stdint.h... yes checking for strings.h... yes checking for sys/stat.h... yes checking for sys/types.h... yes checking for unistd.h... yes checking for sys/param.h... yes checking for sys/time.h... yes checking for dlfcn.h... yes checking for objdir... .libs checking if i686-pld-linux-gcc supports -fno-rtti -fno-exceptions... no checking for i686-pld-linux-gcc option to produce PIC... -fPIC -DPIC checking if i686-pld-linux-gcc PIC flag -fPIC -DPIC works... yes checking if i686-pld-linux-gcc static flag -static works... yes checking if i686-pld-linux-gcc supports -c -o file.o... yes checking if i686-pld-linux-gcc supports -c -o file.o... (cached) yes checking whether the i686-pld-linux-gcc linker (/usr/bin/ld) supports shared libraries... yes checking whether -lc should be explicitly linked in... no checking dynamic linker characteristics... GNU/Linux ld.so checking how to hardcode library paths into programs... immediate checking whether stripping libraries is possible... yes checking if libtool supports shared libraries... yes checking whether to build shared libraries... yes checking whether to build static libraries... no checking how to run the C++ preprocessor... /usr/bin/i686-pld-linux-g++ -E checking for ld used by /usr/bin/i686-pld-linux-g++... /usr/bin/ld checking if the linker (/usr/bin/ld) is GNU ld... yes checking whether the /usr/bin/i686-pld-linux-g++ linker (/usr/bin/ld) supports shared libraries... yes checking for /usr/bin/i686-pld-linux-g++ option to produce PIC... -fPIC -DPIC checking if /usr/bin/i686-pld-linux-g++ PIC flag -fPIC -DPIC works... yes checking if /usr/bin/i686-pld-linux-g++ static flag -static works... yes checking if /usr/bin/i686-pld-linux-g++ supports -c -o file.o... yes checking if /usr/bin/i686-pld-linux-g++ supports -c -o file.o... (cached) yes checking whether the /usr/bin/i686-pld-linux-g++ linker (/usr/bin/ld) supports shared libraries... yes checking dynamic linker characteristics... (cached) GNU/Linux ld.so checking how to hardcode library paths into programs... immediate checking for i686-pld-linux-gcc options needed to detect all undeclared functions... none needed checking for library containing dlopen... none required checking for dlerror... yes checking for shl_load... no checking for shl_load in -ldld... no checking for dld_link in -ldld... no checking for Operating System Distribution... distname set to pld-linux done checking whether make sets $(MAKE)... yes checking whether NLS is requested... yes checking for msgfmt... /usr/bin/msgfmt checking for gmsgfmt... /usr/bin/msgfmt checking for xgettext... /usr/bin/xgettext checking for msgmerge... /usr/bin/msgmerge checking for ld used by GCC... /usr/bin/ld checking if the linker (/usr/bin/ld) is GNU ld... yes checking for shared library run path origin... done checking for CFPreferencesCopyAppValue... no checking for CFLocaleCopyCurrent... no checking whether NLS is requested... yes checking for GNU gettext in libc... yes checking whether to use NLS... yes checking where the gettext function comes from... libc checking for msgfmt... (cached) /usr/bin/msgfmt checking for curses.h... yes checking for tgetent in -ltinfo... yes checking for /usr/include/readline/readline.h... yes checking whether stat file-mode macros are broken... no checking for dirent.h that defines DIR... yes checking for library containing opendir... none required checking for strcasecmp... yes checking for select... yes checking for setenv... yes checking for putenv... yes checking for tcgetattr... yes checking for lstat... yes checking for lchown... yes checking for lchmod... yes checking for futimes... yes checking for fchmod... yes checking for fchown... yes checking for lutimes... yes checking for nanosleep... yes checking for nl_langinfo... yes checking for be64toh... no checking for htobe64... no checking for varargs.h... no checking for socket... yes using libc's socket checking for library containing nanosleep... none required checking for libwrap... yes checking for OpenSSL... yes checking for EVP_PKEY_encrypt_old in -lcrypto... yes checking for library containing dlopen... (cached) none required checking for PostgreSQL support... yes checking for crypt... no checking for crypt in -lcrypt... yes checking for PQisthreadsafe in -lpq... yes checking for PQputCopyData in -lpq... yes checking for MySQL support... yes checking for MySQL embedded support... no checking for SQLite3 support... ./configure[26357]: test: -d: unexpected operator/operand yes checking for sqlite3_threadsafe in -lsqlite3... yes checking for i686-pld-linux-getconf... no checking for getconf... getconf checking for CFLAGS value to request large file support... -D_LARGEFILE_SOURCE -D_FILE_OFFSET_BITS=64 checking for LDFLAGS value to request large file support... checking for LIBS value to request large file support... checking for _FILE_OFFSET_BITS... 64 checking for _LARGEFILE_SOURCE... 1 checking for _LARGE_FILES... 1 checking for X... libraries /usr/lib, headers checking whether -R must be followed by a space... no checking for gethostbyname... yes checking for connect... yes checking for remove... yes checking for shmat... yes checking for IceConnectionNumber in -lICE... yes checking for assert.h... yes checking for fcntl.h... yes checking for grp.h... yes checking for pwd.h... yes checking for libc.h... no checking for limits.h... yes checking for stdarg.h... yes checking for stdlib.h... (cached) yes checking for stdint.h... (cached) yes checking for inttypes.h... (cached) yes checking for string.h... (cached) yes checking for strings.h... (cached) yes checking for termios.h... yes checking for termcap.h... yes checking for term.h... yes checking for unistd.h... (cached) yes checking for sys/bitypes.h... yes checking for sys/byteorder.h... no checking for sys/ioctl.h... yes checking for sys/select.h... yes checking for sys/socket.h... yes checking for sys/sockio.h... no checking for sys/stat.h... (cached) yes checking for sys/time.h... (cached) yes checking for sys/types.h... (cached) yes checking for arpa/nameser.h... yes checking for mtio.h... no checking for sys/mtio.h... yes checking for sys/tape.h... no checking for regex.h... yes checking for attr/attributes.h... yes checking for attr/xattr.h... no checking for egrep... (cached) /bin/grep -E checking for sys/mkdev.h... no checking for sys/sysmacros.h... yes checking for dirent.h that defines DIR... (cached) yes checking for library containing opendir... (cached) none required checking whether stat file-mode macros are broken... (cached) no checking for sys/wait.h that is POSIX.1 compatible... yes checking for struct stat.st_blksize... yes checking for struct stat.st_blocks... yes checking whether struct tm is in sys/time.h or time.h... time.h checking for struct tm.tm_zone... yes checking for utime.h... yes checking for socklen_t... yes checking for ioctl_req_t... yes checking for typeof... yes checking for an ANSI C-conforming const... yes checking whether byte ordering is bigendian... no checking how to get filesystem type... 4.3BSD checking for sys/statvfs.h... yes checking whether O_CLOEXEC is declared... yes checking whether FD_CLOEXEC is declared... yes checking whether SOCK_CLOEXEC is declared... yes checking for close on exec modifier for fopen()... e checking for accept4... yes checking for backtrace... yes checking return type of signal handlers... void checking for type of signal functions... posix checking for mode_t... yes checking for uid_t in sys/types.h... yes checking for size_t... yes checking for pid_t... yes checking for off_t... yes checking for intptr_t... yes checking for uintptr_t... yes checking for ino_t... yes checking for dev_t... yes checking for daddr_t... yes checking for major_t... no checking for minor_t... no checking for ssize_t... yes checking for struct stat.st_blocks... (cached) yes checking for struct stat.st_rdev... yes checking whether struct tm is in sys/time.h or time.h... (cached) time.h checking for an ANSI C-conforming const... (cached) yes checking for C/C++ restrict keyword... __restrict__ checking size of char... 1 checking size of short int... 2 checking size of int... 4 checking size of long int... 4 checking size of long long int... 8 checking size of int *... 4 checking for u_int type... yes checking for intmax_t type... yes checking for u_intmax_t type... no checking for intXX_t types... yes checking for int64_t type... yes checking for u_intXX_t types... yes checking for u_int64_t types... yes checking for uintXX_t types in sys/bitypes.h... no checking for fork... yes checking for getcwd... yes checking for gethostname... yes checking for getpid... yes checking for gettimeofday... yes checking for setpgid... yes checking for setpgrp... yes checking for setsid... yes checking for signal... yes checking for strerror... yes checking for strncmp... yes checking for strncpy... yes checking for vfprintf... yes checking whether F_CLOSEM is declared... no checking whether F_SETLK is declared... yes checking for closefrom... yes checking for getpagesize... yes checking for malloc_trim... yes checking for fchdir... yes checking for strtoll... yes checking for posix_fadvise... yes checking for posix_fallocate... yes checking for fdatasync... yes checking for realpath... yes checking for getrlimit... yes checking for chflags... no checking for snprintf... yes checking for vsnprintf... yes checking for gethostid... yes checking for fseeko... yes checking for va_copy... yes checking for localtime_r... yes checking for readdir_r... yes checking for strerror_r... yes checking for gethostbyname_r... yes checking for gethostbyname_r... (cached) yes using libc's resolver checking for inet_pton... yes checking for inet_ntop... yes checking for gethostbyname2... yes checking for getnameinfo... yes checking for struct sockaddr has a sa_len field... no checking for working getaddrinfo... yes checking for gai_strerror... yes checking for strftime... yes checking for working alloca.h... yes checking for alloca... yes checking for library containing getmntent... none required checking for getmntinfo... no checking whether closedir returns void... no checking whether setpgrp requires zero arguments... yes checking for gettext in -lintl... no checking for getpwnam in -lsun... no checking for zlib.h... yes checking for deflate in -lz... yes checking for afs/afsint.h... no checking for pioctl in AFS libsys... no checking for lzo/lzoconf.h... yes checking for lzo/lzo1x.h... yes checking for lzo1x_1_compress in -llzo2... yes checking for sys/acl.h... yes checking for acl_get_file... no checking for acl_get_file in -lacl... yes checking for sys/xattr.h... yes checking for llistxattr... yes checking for lgetxattr... yes checking for lsetxattr... yes checking for pthread_create in -lpthread... yes checking for sys/prctl.h... yes checking for sys/capability.h... yes checking for prctl... yes checking for setreuid... yes checking for cap_set_proc in -lcap... yes checking for systemd support... yes configure: creating ./config.status config.status: creating autoconf/Make.common config.status: creating Makefile config.status: creating manpages/Makefile config.status: creating scripts/btraceback config.status: creating scripts/bconsole config.status: creating scripts/baculabackupreport config.status: creating scripts/bacula config.status: creating scripts/bacula-ctl-dir config.status: creating scripts/bacula-ctl-fd config.status: creating scripts/bacula-ctl-sd config.status: creating scripts/devel_bacula config.status: creating scripts/Makefile config.status: creating scripts/logrotate config.status: creating scripts/mtx-changer config.status: creating scripts/disk-changer config.status: creating scripts/logwatch/Makefile config.status: creating scripts/logwatch/logfile.bacula.conf config.status: creating scripts/bat.desktop config.status: creating scripts/bat.desktop.xsu config.status: creating scripts/bat.desktop.consolehelper config.status: creating scripts/bat.console_apps config.status: creating scripts/bacula-tray-monitor.desktop config.status: creating src/Makefile config.status: creating src/host.h config.status: creating src/console/Makefile config.status: creating src/console/bconsole.conf config.status: creating src/qt-console/bat.conf config.status: creating src/qt-console/bat.pro config.status: creating src/qt-console/bat.pro.mingw32 config.status: creating src/qt-console/bat.pro.mingw64 config.status: creating src/qt-console/install_conf_file config.status: creating src/qt-console/tray-monitor/tray-monitor.conf config.status: creating src/qt-console/tray-monitor/bacula-tray-monitor.conf config.status: creating src/qt-console/tray-monitor/tray-monitor.pro config.status: creating src/qt-console/tray-monitor/tray-monitor.pro.mingw32 config.status: creating src/qt-console/tray-monitor/tray-monitor.pro.mingw64 config.status: creating src/dird/Makefile config.status: creating src/dird/bacula-dir.conf config.status: creating src/lib/Makefile config.status: creating src/stored/Makefile config.status: creating src/stored/bacula-sd.conf config.status: creating src/filed/Makefile config.status: creating src/filed/bacula-fd.conf config.status: creating src/cats/Makefile config.status: creating src/cats/make_catalog_backup.pl config.status: creating src/cats/make_catalog_backup config.status: creating src/cats/delete_catalog_backup config.status: creating src/cats/create_postgresql_database config.status: creating src/cats/update_postgresql_tables config.status: creating src/cats/make_postgresql_tables config.status: creating src/cats/grant_postgresql_privileges config.status: creating src/cats/drop_postgresql_tables config.status: creating src/cats/drop_postgresql_database config.status: creating src/cats/create_mysql_database config.status: creating src/cats/update_mysql_tables config.status: creating src/cats/make_mysql_tables config.status: creating src/cats/grant_mysql_privileges config.status: creating src/cats/drop_mysql_tables config.status: creating src/cats/drop_mysql_database config.status: creating src/cats/create_sqlite3_database config.status: creating src/cats/update_sqlite3_tables config.status: creating src/cats/make_sqlite3_tables config.status: creating src/cats/grant_sqlite3_privileges config.status: creating src/cats/drop_sqlite3_tables config.status: creating src/cats/drop_sqlite3_database config.status: creating src/cats/sqlite config.status: creating src/cats/mysql config.status: creating src/cats/create_bacula_database config.status: creating src/cats/update_bacula_tables config.status: creating src/cats/grant_bacula_privileges config.status: creating src/cats/make_bacula_tables config.status: creating src/cats/drop_bacula_tables config.status: creating src/cats/drop_bacula_database config.status: creating src/cats/install-default-backend config.status: creating src/findlib/Makefile config.status: creating src/tools/Makefile config.status: creating src/plugins/fd/Makefile config.status: creating src/plugins/sd/Makefile config.status: creating src/plugins/dir/Makefile config.status: creating po/Makefile.in config.status: creating updatedb/update_mysql_tables config.status: creating updatedb/update_sqlite3_tables config.status: creating updatedb/update_postgresql_tables config.status: creating updatedb/update_mysql_tables_9_to_10 config.status: creating updatedb/update_sqlite3_tables_9_to_10 config.status: creating updatedb/update_postgresql_tables_9_to_10 config.status: creating updatedb/update_mysql_tables_10_to_11 config.status: creating updatedb/update_sqlite3_tables_10_to_11 config.status: creating updatedb/update_postgresql_tables_10_to_11 config.status: creating updatedb/update_mysql_tables_11_to_12 config.status: creating updatedb/update_sqlite3_tables_11_to_12 config.status: creating updatedb/update_postgresql_tables_11_to_12 config.status: creating examples/nagios/check_bacula/Makefile config.status: creating platforms/rpms/redhat/bacula.spec config.status: creating platforms/rpms/redhat/bacula-bat.spec config.status: creating platforms/rpms/redhat/bacula-docs.spec config.status: creating platforms/rpms/redhat/bacula-mtx.spec config.status: creating platforms/rpms/suse/bacula.spec config.status: creating platforms/rpms/suse/bacula-bat.spec config.status: creating platforms/rpms/suse/bacula-docs.spec config.status: creating platforms/rpms/suse/bacula-mtx.spec config.status: creating platforms/Makefile config.status: creating platforms/unknown/Makefile config.status: creating platforms/systemd/Makefile config.status: creating platforms/systemd/bacula.conf config.status: creating platforms/systemd/bacula-dir.service config.status: creating platforms/systemd/bacula-fd.service config.status: creating platforms/systemd/bacula-sd.service config.status: creating src/config.h config.status: executing libtool commands config.status: executing default-1 commands config.status: creating po/POTFILES config.status: creating po/Makefile config.status: executing default commands Creating bat Makefile Info: creating stash file /tmp/B.0ikkxwir/BUILD/bacula-9.4.2/src/qt-console/.qmake.stash rm -f qrc_main.cpp rm -f moc/moc_predefs.h rm -f moc/moc_mainwin.cpp moc/moc_pages.cpp moc/moc_dircomm.cpp moc/moc_console.cpp moc/moc_restore.cpp moc/moc_label.cpp moc/moc_relabel.cpp moc/moc_mount.cpp moc/moc_run.cpp moc/moc_select.cpp moc/moc_textinput.cpp moc/moc_medialist.cpp moc/moc_mediaview.cpp moc/moc_mediaedit.cpp moc/moc_joblist.cpp moc/moc_clients.cpp moc/moc_storage.cpp moc/moc_content.cpp moc/moc_fileset.cpp moc/moc_joblog.cpp moc/moc_job.cpp moc/moc_jobs.cpp moc/moc_restoretree.cpp moc/moc_help.cpp moc/moc_mediainfo.cpp moc/moc_dirstat.cpp moc/moc_clientstat.cpp moc/moc_storstat.cpp rm -f ui/ui_main.h ui/ui_prefs.h ui/ui_label.h ui/ui_relabel.h ui/ui_mount.h ui/ui_console.h ui/ui_restore.h ui/ui_prerestore.h ui/ui_brestore.h ui/ui_runrestore.h ui/ui_restoretree.h ui/ui_run.h ui/ui_runcmd.h ui/ui_estimate.h ui/ui_prune.h ui/ui_select.h ui/ui_textinput.h ui/ui_medialist.h ui/ui_mediaedit.h ui/ui_joblist.h ui/ui_mediaview.h ui/ui_clients.h ui/ui_storage.h ui/ui_fileset.h ui/ui_joblog.h ui/ui_jobs.h ui/ui_job.h ui/ui_help.h ui/ui_mediainfo.h ui/ui_dirstat.h ui/ui_content.h ui/ui_clientstat.h ui/ui_storstat.h rm -f obj/main.o obj/bat_conf.o obj/mainwin.o obj/qstd.o obj/pages.o obj/dircomm.o obj/dircomm_auth.o obj/console.o obj/prerestore.o obj/restore.o obj/brestore.o obj/label.o obj/relabel.o obj/mount.o obj/run.o obj/runcmd.o obj/estimate.o obj/prune.o obj/select.o obj/textinput.o obj/medialist.o obj/mediaview.o obj/mediaedit.o obj/joblist.o obj/clients.o obj/storage.o obj/content.o obj/fileset.o obj/joblog.o obj/job.o obj/jobs.o obj/restoretree.o obj/help.o obj/mediainfo.o obj/dirstat.o obj/clientstat.o obj/storstat.o obj/fmtwidgetitem.o obj/comboutil.o obj/qrc_main.o obj/moc_mainwin.o obj/moc_pages.o obj/moc_dircomm.o obj/moc_console.o obj/moc_restore.o obj/moc_label.o obj/moc_relabel.o obj/moc_mount.o obj/moc_run.o obj/moc_select.o obj/moc_textinput.o obj/moc_medialist.o obj/moc_mediaview.o obj/moc_mediaedit.o obj/moc_joblist.o obj/moc_clients.o obj/moc_storage.o obj/moc_content.o obj/moc_fileset.o obj/moc_joblog.o obj/moc_job.o obj/moc_jobs.o obj/moc_restoretree.o obj/moc_help.o obj/moc_mediainfo.o obj/moc_dirstat.o obj/moc_clientstat.o obj/moc_storstat.o rm -f .libs/* bat rm -f *~ core *.core Creating tray-monitor Makefile rm -f qrc_main.cpp rm -f moc/moc_predefs.h rm -f moc/moc_tray-ui.cpp moc/moc_fdstatus.cpp moc/moc_task.cpp moc/moc_dirstatus.cpp moc/moc_conf.cpp moc/moc_sdstatus.cpp moc/moc_runjob.cpp moc/moc_status.cpp moc/moc_restorewizard.cpp moc/moc_clientselectwizardpage.cpp moc/moc_jobselectwizardpage.cpp moc/moc_fileselectwizardpage.cpp moc/moc_restoreoptionswizardpage.cpp moc/moc_pluginwizardpage.cpp rm -f ui/ui_fd-monitor.h ui/ui_dir-monitor.h ui/ui_sd-monitor.h ui/ui_main-conf.h ui/ui_res-conf.h ui/ui_run.h ui/ui_restorewizard.h ui/ui_clientselectwizardpage.h ui/ui_jobselectwizardpage.h ui/ui_fileselectwizardpage.h ui/ui_restoreoptionswizardpage.h ui/ui_pluginwizardpage.h rm -f obj/tray-monitor.o obj/tray_conf.o obj/fdstatus.o obj/task.o obj/authenticate.o obj/fmtwidgetitem.o obj/dirstatus.o obj/sdstatus.o obj/conf.o obj/runjob.o obj/status.o obj/restorewizard.o obj/clientselectwizardpage.o obj/jobselectwizardpage.o obj/fileselectwizardpage.o obj/restoreoptionswizardpage.o obj/pluginwizardpage.o obj/qrc_main.o obj/moc_tray-ui.o obj/moc_fdstatus.o obj/moc_task.o obj/moc_dirstatus.o obj/moc_conf.o obj/moc_sdstatus.o obj/moc_runjob.o obj/moc_status.o obj/moc_restorewizard.o obj/moc_clientselectwizardpage.o obj/moc_jobselectwizardpage.o obj/moc_fileselectwizardpage.o obj/moc_restoreoptionswizardpage.o obj/moc_pluginwizardpage.o rm -f obj/* .libs/* bacula-tray-monitor release/bacula-tray-monitor rm -f *~ core *.core rm -f qrc_main.cpp rm -f moc/moc_predefs.h rm -f moc/moc_tray-ui.cpp moc/moc_fdstatus.cpp moc/moc_task.cpp moc/moc_dirstatus.cpp moc/moc_conf.cpp moc/moc_sdstatus.cpp moc/moc_runjob.cpp moc/moc_status.cpp moc/moc_restorewizard.cpp moc/moc_clientselectwizardpage.cpp moc/moc_jobselectwizardpage.cpp moc/moc_fileselectwizardpage.cpp moc/moc_restoreoptionswizardpage.cpp moc/moc_pluginwizardpage.cpp rm -f ui/ui_fd-monitor.h ui/ui_dir-monitor.h ui/ui_sd-monitor.h ui/ui_main-conf.h ui/ui_res-conf.h ui/ui_run.h ui/ui_restorewizard.h ui/ui_clientselectwizardpage.h ui/ui_jobselectwizardpage.h ui/ui_fileselectwizardpage.h ui/ui_restoreoptionswizardpage.h ui/ui_pluginwizardpage.h rm -f obj/tray-monitor.o obj/tray_conf.o obj/fdstatus.o obj/task.o obj/authenticate.o obj/fmtwidgetitem.o obj/dirstatus.o obj/sdstatus.o obj/conf.o obj/runjob.o obj/status.o obj/restorewizard.o obj/clientselectwizardpage.o obj/jobselectwizardpage.o obj/fileselectwizardpage.o obj/restoreoptionswizardpage.o obj/pluginwizardpage.o obj/qrc_main.o obj/moc_tray-ui.o obj/moc_fdstatus.o obj/moc_task.o obj/moc_dirstatus.o obj/moc_conf.o obj/moc_sdstatus.o obj/moc_runjob.o obj/moc_status.o obj/moc_restorewizard.o obj/moc_clientselectwizardpage.o obj/moc_jobselectwizardpage.o obj/moc_fileselectwizardpage.o obj/moc_restoreoptionswizardpage.o obj/moc_pluginwizardpage.o rm -f obj/* .libs/* bacula-tray-monitor release/bacula-tray-monitor rm -f *~ core *.core Doing make of dependencies ==>Entering directory /tmp/B.0ikkxwir/BUILD/bacula-9.4.2/src make[1]: Entering directory '/tmp/B.0ikkxwir/BUILD/bacula-9.4.2/src' make[1]: Nothing to be done for 'depend'. make[1]: Leaving directory '/tmp/B.0ikkxwir/BUILD/bacula-9.4.2/src' ==>Entering directory /tmp/B.0ikkxwir/BUILD/bacula-9.4.2/scripts make[1]: Entering directory '/tmp/B.0ikkxwir/BUILD/bacula-9.4.2/scripts' make[1]: 'depend' is up to date. make[1]: Leaving directory '/tmp/B.0ikkxwir/BUILD/bacula-9.4.2/scripts' ==>Entering directory /tmp/B.0ikkxwir/BUILD/bacula-9.4.2/src/lib make[1]: Entering directory '/tmp/B.0ikkxwir/BUILD/bacula-9.4.2/src/lib' make[1]: Leaving directory '/tmp/B.0ikkxwir/BUILD/bacula-9.4.2/src/lib' ==>Entering directory /tmp/B.0ikkxwir/BUILD/bacula-9.4.2/src/findlib make[1]: Entering directory '/tmp/B.0ikkxwir/BUILD/bacula-9.4.2/src/findlib' make[1]: Leaving directory '/tmp/B.0ikkxwir/BUILD/bacula-9.4.2/src/findlib' ==>Entering directory /tmp/B.0ikkxwir/BUILD/bacula-9.4.2/src/filed make[1]: Entering directory '/tmp/B.0ikkxwir/BUILD/bacula-9.4.2/src/filed' make[1]: Leaving directory '/tmp/B.0ikkxwir/BUILD/bacula-9.4.2/src/filed' ==>Entering directory /tmp/B.0ikkxwir/BUILD/bacula-9.4.2/src/qt-console make[1]: Entering directory '/tmp/B.0ikkxwir/BUILD/bacula-9.4.2/src/qt-console' make[1]: Nothing to be done for 'depend'. make[1]: Leaving directory '/tmp/B.0ikkxwir/BUILD/bacula-9.4.2/src/qt-console' ==>Entering directory /tmp/B.0ikkxwir/BUILD/bacula-9.4.2/src/console make[1]: Entering directory '/tmp/B.0ikkxwir/BUILD/bacula-9.4.2/src/console' make[1]: Leaving directory '/tmp/B.0ikkxwir/BUILD/bacula-9.4.2/src/console' ==>Entering directory /tmp/B.0ikkxwir/BUILD/bacula-9.4.2/src/plugins/fd make[1]: Entering directory '/tmp/B.0ikkxwir/BUILD/bacula-9.4.2/src/plugins/fd' make[1]: Nothing to be done for 'depend'. make[1]: Leaving directory '/tmp/B.0ikkxwir/BUILD/bacula-9.4.2/src/plugins/fd' ==>Entering directory /tmp/B.0ikkxwir/BUILD/bacula-9.4.2/src/cats make[1]: Entering directory '/tmp/B.0ikkxwir/BUILD/bacula-9.4.2/src/cats' make[1]: Leaving directory '/tmp/B.0ikkxwir/BUILD/bacula-9.4.2/src/cats' ==>Entering directory /tmp/B.0ikkxwir/BUILD/bacula-9.4.2/src/dird make[1]: Entering directory '/tmp/B.0ikkxwir/BUILD/bacula-9.4.2/src/dird' make[1]: Leaving directory '/tmp/B.0ikkxwir/BUILD/bacula-9.4.2/src/dird' ==>Entering directory /tmp/B.0ikkxwir/BUILD/bacula-9.4.2/src/stored make[1]: Entering directory '/tmp/B.0ikkxwir/BUILD/bacula-9.4.2/src/stored' make[1]: Leaving directory '/tmp/B.0ikkxwir/BUILD/bacula-9.4.2/src/stored' ==>Entering directory /tmp/B.0ikkxwir/BUILD/bacula-9.4.2/src/tools make[1]: Entering directory '/tmp/B.0ikkxwir/BUILD/bacula-9.4.2/src/tools' make[1]: Leaving directory '/tmp/B.0ikkxwir/BUILD/bacula-9.4.2/src/tools' ==>Entering directory /tmp/B.0ikkxwir/BUILD/bacula-9.4.2/manpages make[1]: Entering directory '/tmp/B.0ikkxwir/BUILD/bacula-9.4.2/manpages' make[1]: Nothing to be done for 'depend'. make[1]: Leaving directory '/tmp/B.0ikkxwir/BUILD/bacula-9.4.2/manpages' Cleaning up ==>Entering directory /tmp/B.0ikkxwir/BUILD/bacula-9.4.2/src make[1]: Entering directory '/tmp/B.0ikkxwir/BUILD/bacula-9.4.2/src' make[1]: Leaving directory '/tmp/B.0ikkxwir/BUILD/bacula-9.4.2/src' ==>Entering directory /tmp/B.0ikkxwir/BUILD/bacula-9.4.2/scripts make[1]: Entering directory '/tmp/B.0ikkxwir/BUILD/bacula-9.4.2/scripts' make[1]: Leaving directory '/tmp/B.0ikkxwir/BUILD/bacula-9.4.2/scripts' ==>Entering directory /tmp/B.0ikkxwir/BUILD/bacula-9.4.2/src/lib make[1]: Entering directory '/tmp/B.0ikkxwir/BUILD/bacula-9.4.2/src/lib' make[1]: Leaving directory '/tmp/B.0ikkxwir/BUILD/bacula-9.4.2/src/lib' ==>Entering directory /tmp/B.0ikkxwir/BUILD/bacula-9.4.2/src/findlib make[1]: Entering directory '/tmp/B.0ikkxwir/BUILD/bacula-9.4.2/src/findlib' make[1]: Leaving directory '/tmp/B.0ikkxwir/BUILD/bacula-9.4.2/src/findlib' ==>Entering directory /tmp/B.0ikkxwir/BUILD/bacula-9.4.2/src/filed make[1]: Entering directory '/tmp/B.0ikkxwir/BUILD/bacula-9.4.2/src/filed' make[1]: Leaving directory '/tmp/B.0ikkxwir/BUILD/bacula-9.4.2/src/filed' ==>Entering directory /tmp/B.0ikkxwir/BUILD/bacula-9.4.2/src/qt-console make[1]: Entering directory '/tmp/B.0ikkxwir/BUILD/bacula-9.4.2/src/qt-console' rm -f qrc_main.cpp rm -f moc/moc_predefs.h rm -f moc/moc_mainwin.cpp moc/moc_pages.cpp moc/moc_dircomm.cpp moc/moc_console.cpp moc/moc_restore.cpp moc/moc_label.cpp moc/moc_relabel.cpp moc/moc_mount.cpp moc/moc_run.cpp moc/moc_select.cpp moc/moc_textinput.cpp moc/moc_medialist.cpp moc/moc_mediaview.cpp moc/moc_mediaedit.cpp moc/moc_joblist.cpp moc/moc_clients.cpp moc/moc_storage.cpp moc/moc_content.cpp moc/moc_fileset.cpp moc/moc_joblog.cpp moc/moc_job.cpp moc/moc_jobs.cpp moc/moc_restoretree.cpp moc/moc_help.cpp moc/moc_mediainfo.cpp moc/moc_dirstat.cpp moc/moc_clientstat.cpp moc/moc_storstat.cpp rm -f ui/ui_main.h ui/ui_prefs.h ui/ui_label.h ui/ui_relabel.h ui/ui_mount.h ui/ui_console.h ui/ui_restore.h ui/ui_prerestore.h ui/ui_brestore.h ui/ui_runrestore.h ui/ui_restoretree.h ui/ui_run.h ui/ui_runcmd.h ui/ui_estimate.h ui/ui_prune.h ui/ui_select.h ui/ui_textinput.h ui/ui_medialist.h ui/ui_mediaedit.h ui/ui_joblist.h ui/ui_mediaview.h ui/ui_clients.h ui/ui_storage.h ui/ui_fileset.h ui/ui_joblog.h ui/ui_jobs.h ui/ui_job.h ui/ui_help.h ui/ui_mediainfo.h ui/ui_dirstat.h ui/ui_content.h ui/ui_clientstat.h ui/ui_storstat.h rm -f obj/main.o obj/bat_conf.o obj/mainwin.o obj/qstd.o obj/pages.o obj/dircomm.o obj/dircomm_auth.o obj/console.o obj/prerestore.o obj/restore.o obj/brestore.o obj/label.o obj/relabel.o obj/mount.o obj/run.o obj/runcmd.o obj/estimate.o obj/prune.o obj/select.o obj/textinput.o obj/medialist.o obj/mediaview.o obj/mediaedit.o obj/joblist.o obj/clients.o obj/storage.o obj/content.o obj/fileset.o obj/joblog.o obj/job.o obj/jobs.o obj/restoretree.o obj/help.o obj/mediainfo.o obj/dirstat.o obj/clientstat.o obj/storstat.o obj/fmtwidgetitem.o obj/comboutil.o obj/qrc_main.o obj/moc_mainwin.o obj/moc_pages.o obj/moc_dircomm.o obj/moc_console.o obj/moc_restore.o obj/moc_label.o obj/moc_relabel.o obj/moc_mount.o obj/moc_run.o obj/moc_select.o obj/moc_textinput.o obj/moc_medialist.o obj/moc_mediaview.o obj/moc_mediaedit.o obj/moc_joblist.o obj/moc_clients.o obj/moc_storage.o obj/moc_content.o obj/moc_fileset.o obj/moc_joblog.o obj/moc_job.o obj/moc_jobs.o obj/moc_restoretree.o obj/moc_help.o obj/moc_mediainfo.o obj/moc_dirstat.o obj/moc_clientstat.o obj/moc_storstat.o rm -f .libs/* bat rm -f *~ core *.core make[1]: Leaving directory '/tmp/B.0ikkxwir/BUILD/bacula-9.4.2/src/qt-console' ==>Entering directory /tmp/B.0ikkxwir/BUILD/bacula-9.4.2/src/console make[1]: Entering directory '/tmp/B.0ikkxwir/BUILD/bacula-9.4.2/src/console' make[1]: Leaving directory '/tmp/B.0ikkxwir/BUILD/bacula-9.4.2/src/console' ==>Entering directory /tmp/B.0ikkxwir/BUILD/bacula-9.4.2/src/plugins/fd make[1]: Entering directory '/tmp/B.0ikkxwir/BUILD/bacula-9.4.2/src/plugins/fd' make[1]: Leaving directory '/tmp/B.0ikkxwir/BUILD/bacula-9.4.2/src/plugins/fd' ==>Entering directory /tmp/B.0ikkxwir/BUILD/bacula-9.4.2/src/cats make[1]: Entering directory '/tmp/B.0ikkxwir/BUILD/bacula-9.4.2/src/cats' make[1]: Leaving directory '/tmp/B.0ikkxwir/BUILD/bacula-9.4.2/src/cats' ==>Entering directory /tmp/B.0ikkxwir/BUILD/bacula-9.4.2/src/dird make[1]: Entering directory '/tmp/B.0ikkxwir/BUILD/bacula-9.4.2/src/dird' make[1]: Leaving directory '/tmp/B.0ikkxwir/BUILD/bacula-9.4.2/src/dird' ==>Entering directory /tmp/B.0ikkxwir/BUILD/bacula-9.4.2/src/stored make[1]: Entering directory '/tmp/B.0ikkxwir/BUILD/bacula-9.4.2/src/stored' make[1]: Leaving directory '/tmp/B.0ikkxwir/BUILD/bacula-9.4.2/src/stored' ==>Entering directory /tmp/B.0ikkxwir/BUILD/bacula-9.4.2/src/tools make[1]: Entering directory '/tmp/B.0ikkxwir/BUILD/bacula-9.4.2/src/tools' make[1]: Leaving directory '/tmp/B.0ikkxwir/BUILD/bacula-9.4.2/src/tools' ==>Entering directory /tmp/B.0ikkxwir/BUILD/bacula-9.4.2/manpages make[1]: Entering directory '/tmp/B.0ikkxwir/BUILD/bacula-9.4.2/manpages' make[1]: Leaving directory '/tmp/B.0ikkxwir/BUILD/bacula-9.4.2/manpages' ==>Entering directory /tmp/B.0ikkxwir/BUILD/bacula-9.4.2/platforms make[1]: Entering directory '/tmp/B.0ikkxwir/BUILD/bacula-9.4.2/platforms' make[2]: Entering directory '/tmp/B.0ikkxwir/BUILD/bacula-9.4.2/platforms/unknown' make[2]: Nothing to be done for 'clean'. make[2]: Leaving directory '/tmp/B.0ikkxwir/BUILD/bacula-9.4.2/platforms/unknown' make[2]: Entering directory '/tmp/B.0ikkxwir/BUILD/bacula-9.4.2/platforms/systemd' make[2]: Leaving directory '/tmp/B.0ikkxwir/BUILD/bacula-9.4.2/platforms/systemd' make[1]: Leaving directory '/tmp/B.0ikkxwir/BUILD/bacula-9.4.2/platforms' Configuration on Sun Sep 26 10:01:15 CEST 2021: Host: i686-pld-linux-gnu -- PLD/Linux PLD release Bacula version: Bacula 9.4.2 (04 February 2019) Source code location: . Install binaries: /usr/sbin Install libraries: /usr/lib Install config files: /etc/bacula Scripts directory: /usr/libexec/bacula Archive directory: /tmp Working directory: /var/lib/bacula PID directory: /var/run Subsys directory: /var/lock/subsys Man directory: /usr/share/man Data directory: /usr/share Plugin directory: /usr/lib C Compiler: i686-pld-linux-gcc 11.2.0 C++ Compiler: /usr/bin/i686-pld-linux-g++ 11.2.0 Compiler flags: -O2 -fwrapv -pipe -Wformat -Werror=format-security -gdwarf-4 -fno-debug-types-section -fvar-tracking-assignments -g2 -Wp,-D_FORTIFY_SOURCE=2 -fstack-protector-strong --param=ssp-buffer-size=4 -Werror=trampolines -fomit-frame-pointer -march=i686 -fasynchronous-unwind-tables -mtune=pentium4 -gdwarf-4 -fno-debug-types-section -fvar-tracking-assignments -g2 -x c++ -fno-strict-aliasing -fno-exceptions -fno-rtti Linker flags: -Wl,--as-needed -Wl,--no-copy-dt-needed-entries -Wl,-z,relro -Wl,-z,combreloc Libraries: -lpthread Statically Linked Tools: no Statically Linked FD: no Statically Linked SD: no Statically Linked DIR: no Statically Linked CONS: no Database backends: PostgreSQL MySQL SQLite3 Database port: Database name: bacula Database user: bacula Database SSL options: Job Output Email: root@localhost Traceback Email: root@localhost SMTP Host Address: localhost Director Port: 9101 File daemon Port: 9102 Storage daemon Port: 9103 Director User: Director Group: Storage Daemon User: Storage DaemonGroup: File Daemon User: File Daemon Group: Large file support: yes Bacula conio support: no -lreadline -lhistory -ltinfo readline support: yes TCP Wrappers support: yes -lwrap TLS support: yes Encryption support: yes ZLIB support: yes LZO support: yes enable-smartalloc: yes enable-lockmgr: no bat support: yes client-only: no build-dird: yes build-stored: yes Plugin support: yes AFS support: no ACL support: yes XATTR support: yes systemd support: yes /lib/systemd/system Batch insert enabled: PostgreSQL MySQL SQLite3 + cd src/qt-console + qmake-qt5 bat.pro + cd ../.. + 2>&1 + /usr/bin/make -Otarget -j9 + tee log ==>Entering directory /tmp/B.0ikkxwir/BUILD/bacula-9.4.2/src make[1]: Nothing to be done for 'all'. ==>Entering directory /tmp/B.0ikkxwir/BUILD/bacula-9.4.2/scripts make[1]: Nothing to be done for 'all'. ==>Entering directory /tmp/B.0ikkxwir/BUILD/bacula-9.4.2/src/lib make[1]: Entering directory '/tmp/B.0ikkxwir/BUILD/bacula-9.4.2/src/lib' Compiling berrno.c make[1]: Leaving directory '/tmp/B.0ikkxwir/BUILD/bacula-9.4.2/src/lib' make[1]: Entering directory '/tmp/B.0ikkxwir/BUILD/bacula-9.4.2/src/lib' Compiling binflate.c make[1]: Leaving directory '/tmp/B.0ikkxwir/BUILD/bacula-9.4.2/src/lib' make[1]: Entering directory '/tmp/B.0ikkxwir/BUILD/bacula-9.4.2/src/lib' Compiling base64.c make[1]: Leaving directory '/tmp/B.0ikkxwir/BUILD/bacula-9.4.2/src/lib' make[1]: Entering directory '/tmp/B.0ikkxwir/BUILD/bacula-9.4.2/src/lib' Compiling bget_msg.c make[1]: Leaving directory '/tmp/B.0ikkxwir/BUILD/bacula-9.4.2/src/lib' make[1]: Entering directory '/tmp/B.0ikkxwir/BUILD/bacula-9.4.2/src/lib' Compiling bnet_server.c make[1]: Leaving directory '/tmp/B.0ikkxwir/BUILD/bacula-9.4.2/src/lib' make[1]: Entering directory '/tmp/B.0ikkxwir/BUILD/bacula-9.4.2/src/lib' Compiling attr.c make[1]: Leaving directory '/tmp/B.0ikkxwir/BUILD/bacula-9.4.2/src/lib' make[1]: Entering directory '/tmp/B.0ikkxwir/BUILD/bacula-9.4.2/src/lib' Compiling bnet.c make[1]: Leaving directory '/tmp/B.0ikkxwir/BUILD/bacula-9.4.2/src/lib' make[1]: Entering directory '/tmp/B.0ikkxwir/BUILD/bacula-9.4.2/src/lib' Compiling bsys.c make[1]: Leaving directory '/tmp/B.0ikkxwir/BUILD/bacula-9.4.2/src/lib' make[1]: Entering directory '/tmp/B.0ikkxwir/BUILD/bacula-9.4.2/src/lib' Compiling bsock.c make[1]: Leaving directory '/tmp/B.0ikkxwir/BUILD/bacula-9.4.2/src/lib' make[1]: Entering directory '/tmp/B.0ikkxwir/BUILD/bacula-9.4.2/src/lib' Compiling crc32.c make[1]: Leaving directory '/tmp/B.0ikkxwir/BUILD/bacula-9.4.2/src/lib' make[1]: Entering directory '/tmp/B.0ikkxwir/BUILD/bacula-9.4.2/src/lib' Compiling cram-md5.c make[1]: Leaving directory '/tmp/B.0ikkxwir/BUILD/bacula-9.4.2/src/lib' make[1]: Entering directory '/tmp/B.0ikkxwir/BUILD/bacula-9.4.2/src/lib' Compiling bpipe.c make[1]: Leaving directory '/tmp/B.0ikkxwir/BUILD/bacula-9.4.2/src/lib' make[1]: Entering directory '/tmp/B.0ikkxwir/BUILD/bacula-9.4.2/src/lib' Compiling daemon.c make[1]: Leaving directory '/tmp/B.0ikkxwir/BUILD/bacula-9.4.2/src/lib' make[1]: Entering directory '/tmp/B.0ikkxwir/BUILD/bacula-9.4.2/src/lib' Compiling bsnprintf.c make[1]: Leaving directory '/tmp/B.0ikkxwir/BUILD/bacula-9.4.2/src/lib' make[1]: Entering directory '/tmp/B.0ikkxwir/BUILD/bacula-9.4.2/src/lib' Compiling btime.c make[1]: Leaving directory '/tmp/B.0ikkxwir/BUILD/bacula-9.4.2/src/lib' make[1]: Entering directory '/tmp/B.0ikkxwir/BUILD/bacula-9.4.2/src/lib' Compiling fnmatch.c make[1]: Leaving directory '/tmp/B.0ikkxwir/BUILD/bacula-9.4.2/src/lib' make[1]: Entering directory '/tmp/B.0ikkxwir/BUILD/bacula-9.4.2/src/lib' Compiling guid_to_name.c make[1]: Leaving directory '/tmp/B.0ikkxwir/BUILD/bacula-9.4.2/src/lib' make[1]: Entering directory '/tmp/B.0ikkxwir/BUILD/bacula-9.4.2/src/lib' Compiling hmac.c make[1]: Leaving directory '/tmp/B.0ikkxwir/BUILD/bacula-9.4.2/src/lib' make[1]: Entering directory '/tmp/B.0ikkxwir/BUILD/bacula-9.4.2/src/lib' Compiling crypto.c crypto.c: In function 'int crypto_sign_add_signer(SIGNATURE*, DIGEST*, X509_KEYPAIR*)': crypto.c:872:71: warning: 'const EVP_MD* EVP_MD_CTX_md(const EVP_MD_CTX*)' is deprecated: Since OpenSSL 3.0 [-Wdeprecated-declarations] 872 | si->signatureAlgorithm = OBJ_nid2obj(EVP_MD_pkey_type(EVP_MD_CTX_md(digest->ctx))); | ~~~~~~~~~~~~~^~~~~~~~~~~~~ In file included from /usr/include/openssl/x509.h:29, from /usr/include/openssl/ssl.h:31, from ../bacula.h:147, from crypto.c:37: /usr/include/openssl/evp.h:555:15: note: declared here 555 | const EVP_MD *EVP_MD_CTX_md(const EVP_MD_CTX *ctx); | ^~~~~~~~~~~~~ crypto.c: In function 'CRYPTO_SESSION* crypto_session_new(crypto_cipher_t, alist*)': crypto.c:1095:39: warning: 'int EVP_PKEY_encrypt_old(unsigned char*, const unsigned char*, int, EVP_PKEY*)' is deprecated: Since OpenSSL 3.0 [-Wdeprecated-declarations] 1095 | if ((ekey_len = EVP_PKEY_encrypt(ekey, cs->session_key, cs->session_key_len, keypair->pubkey)) <= 0) { | ^ In file included from /usr/include/openssl/x509.h:29, from /usr/include/openssl/ssl.h:31, from ../bacula.h:147, from crypto.c:37: /usr/include/openssl/evp.h:1297:27: note: declared here 1297 | OSSL_DEPRECATEDIN_3_0 int EVP_PKEY_encrypt_old(unsigned char *enc_key, | ^~~~~~~~~~~~~~~~~~~~ crypto.c: In function 'crypto_error_t crypto_session_decode(const u_int8_t*, u_int32_t, alist*, CRYPTO_SESSION**)': crypto.c:1214:51: warning: 'int EVP_PKEY_decrypt_old(unsigned char*, const unsigned char*, int, EVP_PKEY*)' is deprecated: Since OpenSSL 3.0 [-Wdeprecated-declarations] 1214 | cs->session_key_len = EVP_PKEY_decrypt(cs->session_key, ASN1_STRING_get0_data(ri->encryptedKey), | ^ In file included from /usr/include/openssl/x509.h:29, from /usr/include/openssl/ssl.h:31, from ../bacula.h:147, from crypto.c:37: /usr/include/openssl/evp.h:1293:27: note: declared here 1293 | OSSL_DEPRECATEDIN_3_0 int EVP_PKEY_decrypt_old(unsigned char *dec_key, | ^~~~~~~~~~~~~~~~~~~~ make[1]: Leaving directory '/tmp/B.0ikkxwir/BUILD/bacula-9.4.2/src/lib' make[1]: Entering directory '/tmp/B.0ikkxwir/BUILD/bacula-9.4.2/src/lib' Compiling edit.c make[1]: Leaving directory '/tmp/B.0ikkxwir/BUILD/bacula-9.4.2/src/lib' make[1]: Entering directory '/tmp/B.0ikkxwir/BUILD/bacula-9.4.2/src/lib' Compiling alist.c make[1]: Leaving directory '/tmp/B.0ikkxwir/BUILD/bacula-9.4.2/src/lib' make[1]: Entering directory '/tmp/B.0ikkxwir/BUILD/bacula-9.4.2/src/lib' Compiling dlist.c make[1]: Leaving directory '/tmp/B.0ikkxwir/BUILD/bacula-9.4.2/src/lib' make[1]: Entering directory '/tmp/B.0ikkxwir/BUILD/bacula-9.4.2/src/lib' Compiling md5.c make[1]: Leaving directory '/tmp/B.0ikkxwir/BUILD/bacula-9.4.2/src/lib' make[1]: Entering directory '/tmp/B.0ikkxwir/BUILD/bacula-9.4.2/src/lib' Compiling jcr.c make[1]: Leaving directory '/tmp/B.0ikkxwir/BUILD/bacula-9.4.2/src/lib' make[1]: Entering directory '/tmp/B.0ikkxwir/BUILD/bacula-9.4.2/src/lib' Compiling lex.c make[1]: Leaving directory '/tmp/B.0ikkxwir/BUILD/bacula-9.4.2/src/lib' make[1]: Entering directory '/tmp/B.0ikkxwir/BUILD/bacula-9.4.2/src/lib' Compiling openssl.c make[1]: Leaving directory '/tmp/B.0ikkxwir/BUILD/bacula-9.4.2/src/lib' make[1]: Entering directory '/tmp/B.0ikkxwir/BUILD/bacula-9.4.2/src/lib' Compiling priv.c make[1]: Leaving directory '/tmp/B.0ikkxwir/BUILD/bacula-9.4.2/src/lib' make[1]: Entering directory '/tmp/B.0ikkxwir/BUILD/bacula-9.4.2/src/lib' Compiling mem_pool.c make[1]: Leaving directory '/tmp/B.0ikkxwir/BUILD/bacula-9.4.2/src/lib' make[1]: Entering directory '/tmp/B.0ikkxwir/BUILD/bacula-9.4.2/src/lib' Compiling queue.c make[1]: Leaving directory '/tmp/B.0ikkxwir/BUILD/bacula-9.4.2/src/lib' make[1]: Entering directory '/tmp/B.0ikkxwir/BUILD/bacula-9.4.2/src/lib' Compiling plugins.c make[1]: Leaving directory '/tmp/B.0ikkxwir/BUILD/bacula-9.4.2/src/lib' make[1]: Entering directory '/tmp/B.0ikkxwir/BUILD/bacula-9.4.2/src/lib' Compiling rwlock.c make[1]: Leaving directory '/tmp/B.0ikkxwir/BUILD/bacula-9.4.2/src/lib' make[1]: Entering directory '/tmp/B.0ikkxwir/BUILD/bacula-9.4.2/src/lib' Compiling message.c make[1]: Leaving directory '/tmp/B.0ikkxwir/BUILD/bacula-9.4.2/src/lib' make[1]: Entering directory '/tmp/B.0ikkxwir/BUILD/bacula-9.4.2/src/lib' Compiling runscript.c make[1]: Leaving directory '/tmp/B.0ikkxwir/BUILD/bacula-9.4.2/src/lib' make[1]: Entering directory '/tmp/B.0ikkxwir/BUILD/bacula-9.4.2/src/lib' Compiling serial.c make[1]: Leaving directory '/tmp/B.0ikkxwir/BUILD/bacula-9.4.2/src/lib' make[1]: Entering directory '/tmp/B.0ikkxwir/BUILD/bacula-9.4.2/src/lib' Compiling scan.c make[1]: Leaving directory '/tmp/B.0ikkxwir/BUILD/bacula-9.4.2/src/lib' make[1]: Entering directory '/tmp/B.0ikkxwir/BUILD/bacula-9.4.2/src/lib' Compiling sellist.c make[1]: Leaving directory '/tmp/B.0ikkxwir/BUILD/bacula-9.4.2/src/lib' make[1]: Entering directory '/tmp/B.0ikkxwir/BUILD/bacula-9.4.2/src/lib' Compiling bsockcore.c make[1]: Leaving directory '/tmp/B.0ikkxwir/BUILD/bacula-9.4.2/src/lib' make[1]: Entering directory '/tmp/B.0ikkxwir/BUILD/bacula-9.4.2/src/lib' Compiling sha2.c make[1]: Leaving directory '/tmp/B.0ikkxwir/BUILD/bacula-9.4.2/src/lib' make[1]: Entering directory '/tmp/B.0ikkxwir/BUILD/bacula-9.4.2/src/lib' Compiling bregex.c make[1]: Leaving directory '/tmp/B.0ikkxwir/BUILD/bacula-9.4.2/src/lib' make[1]: Entering directory '/tmp/B.0ikkxwir/BUILD/bacula-9.4.2/src/lib' Compiling sha1.c make[1]: Leaving directory '/tmp/B.0ikkxwir/BUILD/bacula-9.4.2/src/lib' make[1]: Entering directory '/tmp/B.0ikkxwir/BUILD/bacula-9.4.2/src/lib' Compiling signal.c make[1]: Leaving directory '/tmp/B.0ikkxwir/BUILD/bacula-9.4.2/src/lib' make[1]: Entering directory '/tmp/B.0ikkxwir/BUILD/bacula-9.4.2/src/lib' Compiling smartall.c make[1]: Leaving directory '/tmp/B.0ikkxwir/BUILD/bacula-9.4.2/src/lib' make[1]: Entering directory '/tmp/B.0ikkxwir/BUILD/bacula-9.4.2/src/lib' Compiling rblist.c make[1]: Leaving directory '/tmp/B.0ikkxwir/BUILD/bacula-9.4.2/src/lib' make[1]: Entering directory '/tmp/B.0ikkxwir/BUILD/bacula-9.4.2/src/lib' Compiling tls.c tls.c: In function 'TLS_CONTEXT* new_tls_context(const char*, const char*, const char*, const char*, int (*)(char*, int, const void*), const void*, const char*, bool)': tls.c:203:33: warning: 'DH* PEM_read_bio_DHparams(BIO*, DH**, int (*)(char*, int, int, void*), void*)' is deprecated: Since OpenSSL 3.0 [-Wdeprecated-declarations] 203 | dh = PEM_read_bio_DHparams(bio, NULL, NULL, NULL); | ~~~~~~~~~~~~~~~~~~~~~^~~~~~~~~~~~~~~~~~~~~~~ In file included from /usr/include/openssl/ssl.h:36, from ../bacula.h:147, from tls.c:40: /usr/include/openssl/pem.h:469:1: note: declared here 469 | DECLARE_PEM_rw_attr(OSSL_DEPRECATEDIN_3_0, DHparams, DH) | ^~~~~~~~~~~~~~~~~~~ tls.c:211:17: warning: 'void DH_free(DH*)' is deprecated: Since OpenSSL 3.0 [-Wdeprecated-declarations] 211 | DH_free(dh); | ~~~~~~~^~~~ In file included from /usr/include/openssl/dsa.h:51, from /usr/include/openssl/x509.h:37, from /usr/include/openssl/ssl.h:31, from ../bacula.h:147, from tls.c:40: /usr/include/openssl/dh.h:200:28: note: declared here 200 | OSSL_DEPRECATEDIN_3_0 void DH_free(DH *dh); | ^~~~~~~ make[1]: Leaving directory '/tmp/B.0ikkxwir/BUILD/bacula-9.4.2/src/lib' make[1]: Entering directory '/tmp/B.0ikkxwir/BUILD/bacula-9.4.2/src/lib' Compiling tree.c make[1]: Leaving directory '/tmp/B.0ikkxwir/BUILD/bacula-9.4.2/src/lib' make[1]: Entering directory '/tmp/B.0ikkxwir/BUILD/bacula-9.4.2/src/lib' Compiling watchdog.c make[1]: Leaving directory '/tmp/B.0ikkxwir/BUILD/bacula-9.4.2/src/lib' make[1]: Entering directory '/tmp/B.0ikkxwir/BUILD/bacula-9.4.2/src/lib' Compiling workq.c make[1]: Leaving directory '/tmp/B.0ikkxwir/BUILD/bacula-9.4.2/src/lib' make[1]: Entering directory '/tmp/B.0ikkxwir/BUILD/bacula-9.4.2/src/lib' Compiling btimers.c make[1]: Leaving directory '/tmp/B.0ikkxwir/BUILD/bacula-9.4.2/src/lib' make[1]: Entering directory '/tmp/B.0ikkxwir/BUILD/bacula-9.4.2/src/lib' Compiling util.c make[1]: Leaving directory '/tmp/B.0ikkxwir/BUILD/bacula-9.4.2/src/lib' make[1]: Entering directory '/tmp/B.0ikkxwir/BUILD/bacula-9.4.2/src/lib' Compiling lz4.c make[1]: Leaving directory '/tmp/B.0ikkxwir/BUILD/bacula-9.4.2/src/lib' make[1]: Entering directory '/tmp/B.0ikkxwir/BUILD/bacula-9.4.2/src/lib' Compiling flist.c make[1]: Leaving directory '/tmp/B.0ikkxwir/BUILD/bacula-9.4.2/src/lib' make[1]: Entering directory '/tmp/B.0ikkxwir/BUILD/bacula-9.4.2/src/lib' Compiling worker.c make[1]: Leaving directory '/tmp/B.0ikkxwir/BUILD/bacula-9.4.2/src/lib' make[1]: Entering directory '/tmp/B.0ikkxwir/BUILD/bacula-9.4.2/src/lib' Compiling lockmgr.c make[1]: Leaving directory '/tmp/B.0ikkxwir/BUILD/bacula-9.4.2/src/lib' make[1]: Entering directory '/tmp/B.0ikkxwir/BUILD/bacula-9.4.2/src/lib' Compiling address_conf.c make[1]: Leaving directory '/tmp/B.0ikkxwir/BUILD/bacula-9.4.2/src/lib' make[1]: Entering directory '/tmp/B.0ikkxwir/BUILD/bacula-9.4.2/src/lib' Compiling breg.c make[1]: Leaving directory '/tmp/B.0ikkxwir/BUILD/bacula-9.4.2/src/lib' make[1]: Entering directory '/tmp/B.0ikkxwir/BUILD/bacula-9.4.2/src/lib' Compiling devlock.c make[1]: Leaving directory '/tmp/B.0ikkxwir/BUILD/bacula-9.4.2/src/lib' make[1]: Entering directory '/tmp/B.0ikkxwir/BUILD/bacula-9.4.2/src/lib' Compiling htable.c make[1]: Leaving directory '/tmp/B.0ikkxwir/BUILD/bacula-9.4.2/src/lib' make[1]: Entering directory '/tmp/B.0ikkxwir/BUILD/bacula-9.4.2/src/lib' Compiling bwlimit.c make[1]: Leaving directory '/tmp/B.0ikkxwir/BUILD/bacula-9.4.2/src/lib' make[1]: Entering directory '/tmp/B.0ikkxwir/BUILD/bacula-9.4.2/src/lib' Compiling output.c make[1]: Leaving directory '/tmp/B.0ikkxwir/BUILD/bacula-9.4.2/src/lib' make[1]: Entering directory '/tmp/B.0ikkxwir/BUILD/bacula-9.4.2/src/lib' Compiling var.c make[1]: Leaving directory '/tmp/B.0ikkxwir/BUILD/bacula-9.4.2/src/lib' make[1]: Entering directory '/tmp/B.0ikkxwir/BUILD/bacula-9.4.2/src/lib' Compiling res.c make[1]: Leaving directory '/tmp/B.0ikkxwir/BUILD/bacula-9.4.2/src/lib' make[1]: Entering directory '/tmp/B.0ikkxwir/BUILD/bacula-9.4.2/src/lib' Compiling ini.c make[1]: Leaving directory '/tmp/B.0ikkxwir/BUILD/bacula-9.4.2/src/lib' make[1]: Entering directory '/tmp/B.0ikkxwir/BUILD/bacula-9.4.2/src/lib' Compiling bjson.c make[1]: Leaving directory '/tmp/B.0ikkxwir/BUILD/bacula-9.4.2/src/lib' make[1]: Entering directory '/tmp/B.0ikkxwir/BUILD/bacula-9.4.2/src/lib' Making libbac.la ... /tmp/B.0ikkxwir/BUILD/bacula-9.4.2/libtool --silent --tag=CXX --mode=link /usr/bin/i686-pld-linux-g++ -Wl,--as-needed -Wl,--no-copy-dt-needed-entries -Wl,-z,relro -Wl,-z,combreloc -o libbac.la attr.lo base64.lo berrno.lo bsys.lo binflate.lo bget_msg.lo bnet.lo bnet_server.lo bsock.lo bpipe.lo bsnprintf.lo btime.lo cram-md5.lo crc32.lo crypto.lo daemon.lo edit.lo fnmatch.lo guid_to_name.lo hmac.lo jcr.lo lex.lo lz4.lo alist.lo dlist.lo md5.lo message.lo mem_pool.lo openssl.lo plugins.lo priv.lo queue.lo bregex.lo bsockcore.lo runscript.lo rwlock.lo scan.lo sellist.lo serial.lo sha1.lo sha2.lo signal.lo smartall.lo rblist.lo tls.lo tree.lo util.lo var.lo watchdog.lo workq.lo btimers.lo worker.lo flist.lo address_conf.lo breg.lo htable.lo lockmgr.lo devlock.lo output.lo bwlimit.lo -export-dynamic -rpath /usr/lib -release 9.4.2 -lwrap -lcap -lz -lssl -lcrypto -lpthread make[1]: Leaving directory '/tmp/B.0ikkxwir/BUILD/bacula-9.4.2/src/lib' make[1]: Entering directory '/tmp/B.0ikkxwir/BUILD/bacula-9.4.2/src/lib' Compiling parse_conf.c make[1]: Leaving directory '/tmp/B.0ikkxwir/BUILD/bacula-9.4.2/src/lib' make[1]: Entering directory '/tmp/B.0ikkxwir/BUILD/bacula-9.4.2/src/lib' Making libbaccfg.la ... /tmp/B.0ikkxwir/BUILD/bacula-9.4.2/libtool --silent --tag=CXX --mode=link /usr/bin/i686-pld-linux-g++ -Wl,--as-needed -Wl,--no-copy-dt-needed-entries -Wl,-z,relro -Wl,-z,combreloc -o libbaccfg.la ini.lo parse_conf.lo res.lo bjson.lo -export-dynamic -rpath /usr/lib -release 9.4.2 -lssl -lcrypto -lpthread make[1]: Leaving directory '/tmp/B.0ikkxwir/BUILD/bacula-9.4.2/src/lib' make[1]: Entering directory '/tmp/B.0ikkxwir/BUILD/bacula-9.4.2/src/lib' ==== Make of lib is good ==== make[1]: Leaving directory '/tmp/B.0ikkxwir/BUILD/bacula-9.4.2/src/lib' ==>Entering directory /tmp/B.0ikkxwir/BUILD/bacula-9.4.2/src/findlib make[1]: Entering directory '/tmp/B.0ikkxwir/BUILD/bacula-9.4.2/src/findlib' Compiling drivetype.c make[1]: Leaving directory '/tmp/B.0ikkxwir/BUILD/bacula-9.4.2/src/findlib' make[1]: Entering directory '/tmp/B.0ikkxwir/BUILD/bacula-9.4.2/src/findlib' Compiling fstype.c fstype.c: In function 'bool fstype(FF_PKT*, char*, int)': fstype.c:207:12: error: narrowing conversion of '4283649346' from 'unsigned int' to 'int' [-Wnarrowing] 207 | case 0xFF534D42: fstype = "cifs"; break; /* CIFS_MAGIC_NUMBER */ | ^~~~~~~~~~ fstype.c:216:12: error: narrowing conversion of '4187351113' from 'unsigned int' to 'int' [-Wnarrowing] 216 | case 0xf995e849: fstype = "hpfs"; break; /* HPFS_SUPER_MAGIC */ | ^~~~~~~~~~ fstype.c:217:12: error: narrowing conversion of '2508478710' from 'unsigned int' to 'int' [-Wnarrowing] 217 | case 0x958458f6: fstype = "hugetlbfs"; break; /* HUGETLBFS_MAGIC */ | ^~~~~~~~~~ fstype.c:234:12: error: narrowing conversion of '2768370933' from 'unsigned int' to 'int' [-Wnarrowing] 234 | case 0xa501FCF5: fstype = "vxfs"; break; | ^~~~~~~~~~ fstype.c:237:12: error: narrowing conversion of '2435016766' from 'unsigned int' to 'int' [-Wnarrowing] 237 | case 0x9123683e: fstype = "btrfs"; break; | ^~~~~~~~~~ make[1]: *** [Makefile:150: fstype.lo] Error 1 make[1]: Leaving directory '/tmp/B.0ikkxwir/BUILD/bacula-9.4.2/src/findlib' make[1]: *** Waiting for unfinished jobs.... make[1]: Entering directory '/tmp/B.0ikkxwir/BUILD/bacula-9.4.2/src/findlib' Compiling bfile.c make[1]: Leaving directory '/tmp/B.0ikkxwir/BUILD/bacula-9.4.2/src/findlib' make[1]: Entering directory '/tmp/B.0ikkxwir/BUILD/bacula-9.4.2/src/findlib' Compiling enable_priv.c make[1]: Leaving directory '/tmp/B.0ikkxwir/BUILD/bacula-9.4.2/src/findlib' make[1]: Entering directory '/tmp/B.0ikkxwir/BUILD/bacula-9.4.2/src/findlib' Compiling create_file.c make[1]: Leaving directory '/tmp/B.0ikkxwir/BUILD/bacula-9.4.2/src/findlib' make[1]: Entering directory '/tmp/B.0ikkxwir/BUILD/bacula-9.4.2/src/findlib' Compiling attribs.c make[1]: Leaving directory '/tmp/B.0ikkxwir/BUILD/bacula-9.4.2/src/findlib' make[1]: Entering directory '/tmp/B.0ikkxwir/BUILD/bacula-9.4.2/src/findlib' Compiling match.c make[1]: Leaving directory '/tmp/B.0ikkxwir/BUILD/bacula-9.4.2/src/findlib' make[1]: Entering directory '/tmp/B.0ikkxwir/BUILD/bacula-9.4.2/src/findlib' Compiling find_one.c make[1]: Leaving directory '/tmp/B.0ikkxwir/BUILD/bacula-9.4.2/src/findlib' make[1]: Entering directory '/tmp/B.0ikkxwir/BUILD/bacula-9.4.2/src/findlib' Compiling find.c make[1]: Leaving directory '/tmp/B.0ikkxwir/BUILD/bacula-9.4.2/src/findlib' make[1]: Entering directory '/tmp/B.0ikkxwir/BUILD/bacula-9.4.2/src/findlib' Compiling mkpath.c make[1]: Leaving directory '/tmp/B.0ikkxwir/BUILD/bacula-9.4.2/src/findlib' ====== Error in /tmp/B.0ikkxwir/BUILD/bacula-9.4.2/src/findlib ====== make: *** [Makefile:148: all] Error 1 + grep 'Error in' log ====== Error in /tmp/B.0ikkxwir/BUILD/bacula-9.4.2/src/findlib ====== + exit 1 error: Bad exit status from /tmp/B.0ikkxwir/BUILD/tmp/rpm-tmp.iqhW8i (%build) RPM build errors: line 170: It's not recommended to have unversioned Obsoletes: Obsoletes: bacula-updatedb line 333: It's not recommended to have unversioned Obsoletes: Obsoletes: bacula-db line 348: It's not recommended to have unversioned Obsoletes: Obsoletes: bacula-db line 363: It's not recommended to have unversioned Obsoletes: Obsoletes: bacula-db Macro expanded in comment on line 738: %{name}-docs-%{version}/manual/{*.pdf,bacula} Could not canonicalize hostname: nereid Bad exit status from /tmp/B.0ikkxwir/BUILD/tmp/rpm-tmp.iqhW8i (%build) ended at: Sun Sep 26 10:01:22 2021, done in 0:00:53.035182 error: No files produced. + chmod -R u+rwX /tmp/B.0ikkxwir/BUILD + rm -rf /tmp/B.0ikkxwir/tmp /tmp/B.0ikkxwir/BUILD + rm -rf /tmp/B.0ikkxwir Begin-PLD-Builder-Info Build-Time: user:73.53s sys:17.54s real:55.50s (faults io:13 non-io:3342682) End-PLD-Builder-Info
[Back to list of logs] [View rpm -qa of builder]