FailedOk

th/SRPMS[OK]
th/x32[OK]
th/i686[OK]
th/x86_64[OK]

ac/SRPMS[OK]
ac/i386[OK]
ac/i586[OK]
ac/i686[OK]
ac/alpha[OK]
ac/amd64[OK]
ac/athlon[OK]
ac/ppc[OK]
ac/sparc[OK]
ac/sparc64[OK]

Advanced Search
main()
Powered by PLD Linux
(c) 2002-2019 PLD Team
$Revision: 1.37 $
Powered by sqlite3.
Your IP: 35.171.45.91

bacula ac905f15-26ca-4d49-b343-af500d10b273

Status:Failed
Source URL:ftp://buildlogs.pld-linux.org/th/i686/FAIL/bacula,ac905f15-26ca-4d49-b343-af500d10b273.bz2
text/plain URL:View!
rpm -qa of builder:View!
Date:2019/10/19 00:29:52
Runtime:0:00:07.174338

Toc:

  • prep
  • Executing(%prep): /bin/sh -e /tmp/B.g5aGuk/BUILD/tmp/rpm-tmp.84224
  • build
  • Executing(%build): /bin/sh -e /tmp/B.g5aGuk/BUILD/tmp/rpm-tmp.84224
  • error 1
  • /usr/include/bits/string_fortified.h:136:10: error: '__builtin_strncat' output truncated before terminating nul copying as many bytes from a string as its length [-Werror=stringop-truncation]
  • error 2
  • error: Bad exit status from /tmp/B.g5aGuk/BUILD/tmp/rpm-tmp.84224 (%build)
  • error 3
  • RPM build errors:
  • error 4
  • error: No files produced.

Content:

request from: baggins
checking if we should skip the build
started at: Sat Oct 19 00:29:36 2019
killing old processes on a builder
sending signal 9 to pid -1
Killed
cleaning up /tmp
fetching https://srcbuilder.pld-linux.org/th//srpms/ac905f15-26ca-4d49-b343-af500d10b273/bacula-9.4.2-2.src.rpm
fetched 4314612 bytes, 5361.1 K/s
installing srpm: bacula-9.4.2-2.src.rpm
+ install -d /tmp/B.g5aGuk/BUILD /tmp/B.g5aGuk/RPMS
+ LC_ALL=en_US.UTF-8
+ rpm -qp --changelog bacula-9.4.2-2.src.rpm
* Sat Oct 19 2019 PLD Linux Team <feedback@pld-linux.org>
- For complete changelog see: http://git.pld-linux.org/?p=packages/bacula.git;a=log;h=master
* Thu Oct 17 2019 Arkadiusz Miƛkiewicz <arekm@maven.pl> db68e7f
- release 2 (by relup.sh) * Tue Mar 05 2019 Jacek Konieczny <j.konieczny@eggsoft.pl> 7ce8b38
- attempt to fix libs3 linking * Tue Mar 05 2019 Jacek Konieczny <j.konieczny@eggsoft.pl> 8b0a640
- x32.patch updated * Tue Mar 05 2019 Jacek Konieczny <j.konieczny@eggsoft.pl> 59779a0
- drop broken obsolete * Tue Mar 05 2019 Jacek Konieczny <j.konieczny@eggsoft.pl> 3e309ba
- missing Source1-md5 added * Mon Mar 04 2019 Jacek Konieczny <j.konieczny@eggsoft.pl> 55b5244
- Version: 9.4.2, Amazon S3 driver, Qt5 * Mon Mar 04 2019 Jacek Konieczny <j.konieczny@eggsoft.pl> 7e41e9e
- Version: 9.2.2 + rpm -Uhv --nodeps --define '_topdir /tmp/B.g5aGuk' --define '_specdir %{_topdir}' --define '_sourcedir %{_specdir}' --define '_rpmdir %{_topdir}/RPMS' --define '_builddir %{_topdir}/BUILD' bacula-9.4.2-2.src.rpm Preparing... ################################################## bacula ################################################## + rm -f bacula-9.4.2-2.src.rpm + install -m 700 -d /tmp/B.g5aGuk/BUILD/tmp + TMPDIR=/tmp/B.g5aGuk/BUILD/tmp + exec nice -n 0 rpmbuild -bp --short-circuit --nodeps --define '_topdir /tmp/B.g5aGuk' --define '_specdir %{_topdir}' --define '_sourcedir %{_specdir}' --define '_rpmdir %{_topdir}/RPMS' --define '_builddir %{_topdir}/BUILD' --target i686-pld-linux --define 'prep exit 0' /tmp/B.g5aGuk/bacula.spec Building target platforms: i686-pld-linux checking BuildConflict-ing packages no BuildConflicts found checking BR rpm: Building target platforms: i686-pld-linux no BR needed building RPM using: set -ex; : build-id: ac905f15-26ca-4d49-b343-af500d10b273; TMPDIR=/tmp/B.g5aGuk/BUILD/tmp exec nice -n 0 rpmbuild -bb --define '_smp_mflags -j9' --define '_make_opts -Otarget' --define '_pld_builder 1' --define '_topdir /tmp/B.g5aGuk' --define '_specdir %{_topdir}' --define '_sourcedir %{_specdir}' --define '_rpmdir %{_topdir}/RPMS' --define '_builddir %{_topdir}/BUILD' --target i686-pld-linux /tmp/B.g5aGuk/bacula.spec + : build-id: ac905f15-26ca-4d49-b343-af500d10b273 + TMPDIR=/tmp/B.g5aGuk/BUILD/tmp + exec nice -n 0 rpmbuild -bb --define '_smp_mflags -j9' --define '_make_opts -Otarget' --define '_pld_builder 1' --define '_topdir /tmp/B.g5aGuk' --define '_specdir %{_topdir}' --define '_sourcedir %{_specdir}' --define '_rpmdir %{_topdir}/RPMS' --define '_builddir %{_topdir}/BUILD' --target i686-pld-linux /tmp/B.g5aGuk/bacula.spec Building target platforms: i686-pld-linux Executing(%prep): /bin/sh -e /tmp/B.g5aGuk/BUILD/tmp/rpm-tmp.84224 + umask 022 + cd /tmp/B.g5aGuk/BUILD + cd /tmp/B.g5aGuk/BUILD + rm -rf bacula-9.4.2 + /usr/bin/gzip -dc /tmp/B.g5aGuk/bacula-9.4.2.tar.gz + /bin/tar -xf - + STATUS=0 + '[' 0 -ne 0 ']' + cd bacula-9.4.2 + /usr/bin/gzip -dc /tmp/B.g5aGuk/libs3-20181010.tar.gz + /bin/tar -xf - + STATUS=0 + '[' 0 -ne 0 ']' + /bin/id -u + '[' 1001 '=' 0 ']' + /bin/id -u + '[' 1001 '=' 0 ']' + /bin/chmod -Rf a+rX,u+w,g-w,o-w . + echo 'Patch #0 (bacula-mtx-changer.patch):' Patch #0 (bacula-mtx-changer.patch): + '[' -f /tmp/B.g5aGuk/bacula-mtx-changer.patch ']' + /bin/cat /tmp/B.g5aGuk/bacula-mtx-changer.patch + /usr/bin/patch -s -p1 + echo 'Patch #1 (bacula-branding.patch):' Patch #1 (bacula-branding.patch): + '[' -f /tmp/B.g5aGuk/bacula-branding.patch ']' + /bin/cat /tmp/B.g5aGuk/bacula-branding.patch + /usr/bin/patch -s -p1 + echo 'Patch #2 (bacula-desktop.patch):' Patch #2 (bacula-desktop.patch): + '[' -f /tmp/B.g5aGuk/bacula-desktop.patch ']' + /bin/cat /tmp/B.g5aGuk/bacula-desktop.patch + /usr/bin/patch -s -p1 + echo 'Patch #3 (make_catalog_backup-setup-home.patch):' Patch #3 (make_catalog_backup-setup-home.patch): + '[' -f /tmp/B.g5aGuk/make_catalog_backup-setup-home.patch ']' + /bin/cat /tmp/B.g5aGuk/make_catalog_backup-setup-home.patch + /usr/bin/patch -s -p1 + echo 'Patch #4 (bacula-no_lockmgr.patch):' Patch #4 (bacula-no_lockmgr.patch): + '[' -f /tmp/B.g5aGuk/bacula-no_lockmgr.patch ']' + /bin/cat /tmp/B.g5aGuk/bacula-no_lockmgr.patch + /usr/bin/patch -s -p1 + cd libs3-20181010 + echo 'Patch #6 (libs3-curl.patch):' Patch #6 (libs3-curl.patch): + '[' -f /tmp/B.g5aGuk/libs3-curl.patch ']' + /bin/cat /tmp/B.g5aGuk/libs3-curl.patch + /usr/bin/patch -s -p1 + cd .. + sed -i -e 's#bindir=.*#bindir=/usr/bin#g' src/cats/create_bacula_database.in src/cats/create_mysql_database.in src/cats/create_postgresql_database.in src/cats/create_sqlite3_database.in src/cats/create_test_database src/cats/delete_catalog_backup.in src/cats/drop_bacula_database.in src/cats/drop_bacula_tables.in src/cats/drop_mysql_database.in src/cats/drop_mysql_tables.in src/cats/drop_postgresql_database.in src/cats/drop_postgresql_tables.in src/cats/drop_sqlite3_database.in src/cats/drop_sqlite3_tables.in src/cats/drop_test_tables src/cats/grant_bacula_privileges.in src/cats/grant_mysql_privileges.in src/cats/grant_postgresql_privileges.in src/cats/grant_privileges src/cats/grant_sqlite3_privileges.in src/cats/make_bacula_tables.in src/cats/make_catalog_backup.in src/cats/make_catalog_backup.in.orig src/cats/make_catalog_backup.pl.in src/cats/make_mysql_tables.in src/cats/make_postgresql_tables.in src/cats/make_sqlite3_tables.in src/cats/make_test_tables src/cats/update_bacula_tables.in src/cats/update_mysql_tables.in src/cats/update_postgresql_tables.in src/cats/update_sqlite3_tables.in + sed -i -e s/@hostname@/--hostname--/ src/console/bconsole.conf.in src/dird/bacula-dir.conf.in src/filed/bacula-fd.conf.in src/qt-console/bat.conf.in src/stored/bacula-sd.conf.in src/stored/stored.conf.in + sed -i -e s/@basename@/--hostname--/ src/console/bconsole.conf.in src/dird/bacula-dir.conf.in src/filed/bacula-fd.conf.in src/qt-console/bat.conf.in src/stored/bacula-sd.conf.in src/stored/stored.conf.in + exit 0 Executing(%build): /bin/sh -e /tmp/B.g5aGuk/BUILD/tmp/rpm-tmp.84224 TMP=/home/users/builder/tmp HOME=/home/users/builder PATH=/home/users/builder/GNUstep/Tools:/usr/local/bin:/usr/bin:/bin:/home/users/builder/bin TMPDIR=/tmp/B.g5aGuk/BUILD/tmp + umask 022 + cd /tmp/B.g5aGuk/BUILD + cd bacula-9.4.2 + cd autoconf + aclocal -I bacula-macros -I gettext-macros -I libtool aclocal: warning: autoconf input should be named 'configure.ac', not 'configure.in' + cd .. + pwd + >configure + autoconf '--prepend-include=/tmp/B.g5aGuk/BUILD/bacula-9.4.2/autoconf' autoconf/configure.in + cd libs3-20181010 + CFLAGS='-O2 -fwrapv -pipe -Wformat -Werror=format-security -gdwarf-4 -fno-debug-types-section -fvar-tracking-assignments -g2 -Wp,-D_FORTIFY_SOURCE=2 -fstack-protector-strong --param=ssp-buffer-size=4 -Werror=trampolines -fomit-frame-pointer -march=i686 -fasynchronous-unwind-tables -mtune=pentium4 -gdwarf-4 -fno-debug-types-section -fvar-tracking-assignments -g2 -Wno-stringop-overflow' make 'VERBOSE=1' build/lib/libs3.a cc -O2 -fwrapv -pipe -Wformat -Werror=format-security -gdwarf-4 -fno-debug-types-section -fvar-tracking-assignments -g2 -Wp,-D_FORTIFY_SOURCE=2 -fstack-protector-strong --param=ssp-buffer-size=4 -Werror=trampolines -fomit-frame-pointer -march=i686 -fasynchronous-unwind-tables -mtune=pentium4 -gdwarf-4 -fno-debug-types-section -fvar-tracking-assignments -g2 -Wno-stringop-overflow -Wall -Werror -Wshadow -Wextra -Wno-format-truncation -Iinc -I/usr/include/libxml2 -DLIBS3_VER_MAJOR=\"3\" -DLIBS3_VER_MINOR=\"0\" -DLIBS3_VER=\"3.0\" -D__STRICT_ANSI__ -D_ISOC99_SOURCE -D_POSIX_C_SOURCE=200112L -o build/obj/acl.o -c src/acl.c cc -O2 -fwrapv -pipe -Wformat -Werror=format-security -gdwarf-4 -fno-debug-types-section -fvar-tracking-assignments -g2 -Wp,-D_FORTIFY_SOURCE=2 -fstack-protector-strong --param=ssp-buffer-size=4 -Werror=trampolines -fomit-frame-pointer -march=i686 -fasynchronous-unwind-tables -mtune=pentium4 -gdwarf-4 -fno-debug-types-section -fvar-tracking-assignments -g2 -Wno-stringop-overflow -Wall -Werror -Wshadow -Wextra -Wno-format-truncation -Iinc -I/usr/include/libxml2 -DLIBS3_VER_MAJOR=\"3\" -DLIBS3_VER_MINOR=\"0\" -DLIBS3_VER=\"3.0\" -D__STRICT_ANSI__ -D_ISOC99_SOURCE -D_POSIX_C_SOURCE=200112L -o build/obj/bucket.o -c src/bucket.c cc -O2 -fwrapv -pipe -Wformat -Werror=format-security -gdwarf-4 -fno-debug-types-section -fvar-tracking-assignments -g2 -Wp,-D_FORTIFY_SOURCE=2 -fstack-protector-strong --param=ssp-buffer-size=4 -Werror=trampolines -fomit-frame-pointer -march=i686 -fasynchronous-unwind-tables -mtune=pentium4 -gdwarf-4 -fno-debug-types-section -fvar-tracking-assignments -g2 -Wno-stringop-overflow -Wall -Werror -Wshadow -Wextra -Wno-format-truncation -Iinc -I/usr/include/libxml2 -DLIBS3_VER_MAJOR=\"3\" -DLIBS3_VER_MINOR=\"0\" -DLIBS3_VER=\"3.0\" -D__STRICT_ANSI__ -D_ISOC99_SOURCE -D_POSIX_C_SOURCE=200112L -o build/obj/error_parser.o -c src/error_parser.c cc -O2 -fwrapv -pipe -Wformat -Werror=format-security -gdwarf-4 -fno-debug-types-section -fvar-tracking-assignments -g2 -Wp,-D_FORTIFY_SOURCE=2 -fstack-protector-strong --param=ssp-buffer-size=4 -Werror=trampolines -fomit-frame-pointer -march=i686 -fasynchronous-unwind-tables -mtune=pentium4 -gdwarf-4 -fno-debug-types-section -fvar-tracking-assignments -g2 -Wno-stringop-overflow -Wall -Werror -Wshadow -Wextra -Wno-format-truncation -Iinc -I/usr/include/libxml2 -DLIBS3_VER_MAJOR=\"3\" -DLIBS3_VER_MINOR=\"0\" -DLIBS3_VER=\"3.0\" -D__STRICT_ANSI__ -D_ISOC99_SOURCE -D_POSIX_C_SOURCE=200112L -o build/obj/general.o -c src/general.c cc -O2 -fwrapv -pipe -Wformat -Werror=format-security -gdwarf-4 -fno-debug-types-section -fvar-tracking-assignments -g2 -Wp,-D_FORTIFY_SOURCE=2 -fstack-protector-strong --param=ssp-buffer-size=4 -Werror=trampolines -fomit-frame-pointer -march=i686 -fasynchronous-unwind-tables -mtune=pentium4 -gdwarf-4 -fno-debug-types-section -fvar-tracking-assignments -g2 -Wno-stringop-overflow -Wall -Werror -Wshadow -Wextra -Wno-format-truncation -Iinc -I/usr/include/libxml2 -DLIBS3_VER_MAJOR=\"3\" -DLIBS3_VER_MINOR=\"0\" -DLIBS3_VER=\"3.0\" -D__STRICT_ANSI__ -D_ISOC99_SOURCE -D_POSIX_C_SOURCE=200112L -o build/obj/object.o -c src/object.c cc -O2 -fwrapv -pipe -Wformat -Werror=format-security -gdwarf-4 -fno-debug-types-section -fvar-tracking-assignments -g2 -Wp,-D_FORTIFY_SOURCE=2 -fstack-protector-strong --param=ssp-buffer-size=4 -Werror=trampolines -fomit-frame-pointer -march=i686 -fasynchronous-unwind-tables -mtune=pentium4 -gdwarf-4 -fno-debug-types-section -fvar-tracking-assignments -g2 -Wno-stringop-overflow -Wall -Werror -Wshadow -Wextra -Wno-format-truncation -Iinc -I/usr/include/libxml2 -DLIBS3_VER_MAJOR=\"3\" -DLIBS3_VER_MINOR=\"0\" -DLIBS3_VER=\"3.0\" -D__STRICT_ANSI__ -D_ISOC99_SOURCE -D_POSIX_C_SOURCE=200112L -o build/obj/request.o -c src/request.c In file included from /usr/include/string.h:494, from src/request.c:30: In function 'strncat', inlined from 'sort_and_urlencode_query_string' at src/request.c:863:13, inlined from 'canonicalize_query_string' at src/request.c:884:9, inlined from 'setup_request' at src/request.c:1519:5, inlined from 'setup_request' at src/request.c:1477:17: /usr/include/bits/string_fortified.h:136:10: error: '__builtin_strncat' output truncated before terminating nul copying as many bytes from a string as its length [-Werror=stringop-truncation] 136 | return __builtin___strncat_chk (__dest, __src, __len, __bos (__dest)); | ^~~~~~~~~~~~~~~~~~~~~~~~~~~~~~~~~~~~~~~~~~~~~~~~~~~~~~~~~~~~~~ src/request.c: In function 'setup_request': src/request.c:863:13: note: length computed here 863 | strncat(result, appendage, strlen(appendage)); | ^~~~~~~~~~~~~~~~~~~~~~~~~~~~~~~~~~~~~~~~~~~~~ cc1: all warnings being treated as errors make: *** [GNUmakefile:215: build/obj/request.o] Error 1 error: Bad exit status from /tmp/B.g5aGuk/BUILD/tmp/rpm-tmp.84224 (%build) RPM build errors: Bad exit status from /tmp/B.g5aGuk/BUILD/tmp/rpm-tmp.84224 (%build) ended at: Sat Oct 19 00:29:52 2019, done in 0:00:07.174338 error: No files produced. + chmod -R u+rwX /tmp/B.g5aGuk/BUILD + rm -rf /tmp/B.g5aGuk/tmp /tmp/B.g5aGuk/BUILD + rm -rf /tmp/B.g5aGuk Begin-PLD-Builder-Info Build-Time: user:13.48s sys:0.57s real:16.19s (faults io:0 non-io:166967) End-PLD-Builder-Info
[Back to list of logs] [View rpm -qa of builder]