FailedOk

th/SRPMS[OK]
th/x32[OK]
th/i686[OK]
th/x86_64[OK]

ac/SRPMS[OK]
ac/i386[OK]
ac/i586[OK]
ac/i686[OK]
ac/alpha[OK]
ac/amd64[OK]
ac/athlon[OK]
ac/ppc[OK]
ac/sparc[OK]
ac/sparc64[OK]

Advanced Search
main()
Powered by PLD Linux
(c) 2002-2018 PLD Team
$Revision: 1.37 $
Powered by Linus.
Your IP: 54.224.166.141

claws-mail 7d4edbe1-b821-47b8-810b-fe92061b11ac

Status:Failed
Source URL:ftp://buildlogs.pld-linux.org/th/i686/FAIL/claws-mail,7d4edbe1-b821-47b8-810b-fe92061b11ac.bz2
text/plain URL:View!
full text:View!
rpm -qa of builder:View!
Date:2018/09/02 18:50:14
Runtime:0:03:52.776431

Toc:

  • error 1
  • make[4]: [Makefile:660: claws-mail-manual.pdf] Error 9 (ignored)
  • error 2
  • make[4]: [Makefile:660: claws-mail-manual.ps] Error 9 (ignored)
  • error 3
  • make[5]: [Makefile:660: claws-mail-manual.pdf] Error 9 (ignored)
  • error 4
  • make[5]: [Makefile:660: claws-mail-manual.ps] Error 9 (ignored)
  • error 5
  • make[5]: [Makefile:660: claws-mail-manual.pdf] Error 9 (ignored)
  • error 6
  • make[5]: [Makefile:660: claws-mail-manual.ps] Error 9 (ignored)
  • install
  • Executing(%install): /bin/sh -e /tmp/B.LM_jhl/BUILD/tmp/rpm-tmp.94
  • error 7
  • make[3]: [Makefile:660: claws-mail-manual.pdf] Error 9 (ignored)
  • error 8
  • make[4]: [Makefile:660: claws-mail-manual.pdf] Error 9 (ignored)
  • error 9
  • make[4]: *** [Makefile:467: install-manualdeDATA] Error 1
  • error 10
  • make[3]: *** [Makefile:539: install-am] Error 2
  • error 11
  • make[2]: *** [Makefile:501: install-recursive] Error 1
  • error 12
  • make[1]: *** [Makefile:516: install-recursive] Error 1
  • error 13
  • error: Bad exit status from /tmp/B.LM_jhl/BUILD/tmp/rpm-tmp.94 (%install)
  • error 14
  • RPM build errors:
  • error 15
  • error: No files produced.

Content:

(/usr/share/texmf-dist/tex/latex/psnfss/upsy.fd))
(/usr/share/texmf-dist/tex/latex/wasysym/wasysym.sty)
(/usr/share/texmf-dist/tex/latex/stmaryrd/stmaryrd.sty)
WARNING: Elsevier font setup not found
(/usr/share/texmf-dist/tex/xmltex/passivetex/dummyels.sty)
WARNING: mmasym package not loaded. some symbols will fail
(/usr/share/texmf-dist/tex/latex/amsfonts/eucal.sty))
(/usr/share/texmf-dist/tex/xmltex/passivetex/ucharacters.sty)
(/usr/share/texmf-dist/tex/jadetex/base/uentities.sty)) )
Beginning to dump on file pdfjadetex.fmt
 (format=pdfjadetex 2018.9.2)
18234 strings of total length 227740
183976 memory locations dumped; current usage is 175&183185
15278 multiletter control sequences
\font\nullfont=nullfont
\font\OMX/cmex/m/n/10=cmex10
\font\tenln=line10
\font\tenlnw=linew10
\font\tencirc=lcircle10
\font\tencircw=lcirclew10
\font\OT1/cmr/m/n/5=cmr5
\font\OT1/cmr/m/n/7=cmr7
\font\OT1/cmr/m/n/10=cmr10
\font\OML/cmm/m/it/5=cmmi5
\font\OML/cmm/m/it/7=cmmi7
\font\OML/cmm/m/it/10=cmmi10
\font\OMS/cmsy/m/n/5=cmsy5
\font\OMS/cmsy/m/n/7=cmsy7
\font\OMS/cmsy/m/n/10=cmsy10
\font\sixly=lasy6
\font\OT1/cmr/m/sl/10=cmsl10
\font\OT1/cmr/m/it/10=cmti10
\font\OT1/cmr/bx/n/10=cmbx10
\font\OT1/cmss/m/n/10=cmss10
\font\T1/cmr/m/n/10=ecrm1000
\font\U/pzd/m/n/10=pzdr
\font\U/psy/m/n/10=psyr
6504 words of font info for 22 preloaded fonts
714 hyphenation exceptions
Hyphenation trie of length 218991 has 7024 ops out of 35111
  143 for language 53
  110 for language 52
  138 for language 51
  224 for language 50
  12 for language 49
  127 for language 48
  158 for language 47
  71 for language 46
  248 for language 45
  66 for language 44
  119 for language 42
  58 for language 41
  7 for language 40
  194 for language 39
  815 for language 38
  815 for language 37
  38 for language 36
  21 for language 35
  25 for language 34
  36 for language 33
  229 for language 32
  38 for language 31
  21 for language 30
  147 for language 29
  117 for language 28
  50 for language 27
  18 for language 26
  235 for language 25
  207 for language 24
  75 for language 23
  88 for language 22
  31 for language 21
  113 for language 19
  145 for language 18
  265 for language 17
  60 for language 16
  63 for language 15
  19 for language 14
  14 for language 13
  2 for language 12
  21 for language 11
  12 for language 10
  5 for language 9
  148 for language 7
  97 for language 6
  411 for language 5
  408 for language 4
  2 for language 2
  377 for language 1
  181 for language 0
16 words of pdfTeX memory
4 indirect objects
No pages of output.
Transcript written on pdfjadetex.log.
mv: cannot move 'pdfjadetex.log' to '/var/lib/texmf/web2c/pdftex/pdfjadetex.log': Permission denied
mv: cannot move 'pdfjadetex.fmt' to '/var/lib/texmf/web2c/pdftex/pdfjadetex.fmt': Permission denied
This is pdfTeXk, Version 3.1415926-1.40.9 (Web2C 7.5.7)
 %&-line parsing enabled.
I can't find the format file `pdfjadetex.fmt'!
make[4]: [Makefile:660: claws-mail-manual.pdf] Error 9 (ignored)
make[4]: Leaving directory '/tmp/B.LM_jhl/BUILD/claws-mail-3.17.1/manual/dist/pdf'
Making all in ps
make[4]: Entering directory '/tmp/B.LM_jhl/BUILD/claws-mail-3.17.1/manual/dist/ps'
docbook2ps -o . ../../claws-mail-manual.xml
Using catalogs: /etc/sgml/catalog
Using stylesheet: /usr/share/sgml/docbook/utils-0.6.14/docbook-utils.dsl#print
Working on: /tmp/B.LM_jhl/BUILD/claws-mail-3.17.1/manual/dist/ps/../../claws-mail-manual.xml

kpathsea: Running mktexfmt jadetex.fmt
fmtutil: running `pdftex -ini   -jobname=jadetex -progname=jadetex &latex jadetex.ini' ...
This is pdfTeXk, Version 3.1415926-1.40.9 (Web2C 7.5.7) (INITEX)
 %&-line parsing enabled.
entering extended mode
(/usr/share/texmf-dist/tex/jadetex/config/jadetex.ini
LaTeX2e <2005/12/01>
Babel <v3.8l> and hyphenation patterns for english, usenglishmax, dumylang, noh
yphenation, german-x-2008-06-18, ngerman-x-2008-06-18, ancientgreek, ibycus, ar
abic, basque, bulgarian, catalan, pinyin, coptic, croatian, czech, danish, dutc
h, esperanto, estonian, farsi, finnish, french, galician, german, ngerman, mono
greek, greek, hungarian, icelandic, indonesian, interlingua, irish, italian, la
tin, mongolian, mongolian2a, bokmal, nynorsk, polish, portuguese, romanian, rus
sian, sanskrit, serbian, slovak, slovenian, spanish, swedish, turkish, ukenglis
h, ukrainian, uppersorbian, welsh, loaded.
(/usr/share/texmf-dist/tex/jadetex/base/jadetex.ltx
(/usr/share/texmf-dist/tex/latex/base/minimal.cls
Document Class: minimal 2001/05/25 Standard LaTeX minimal class
) (/usr/share/texmf-dist/tex/latex/tools/array.sty)
(/usr/share/texmf-dist/tex/latex/tools/longtable.sty)
(/usr/share/texmf-dist/tex/latex/graphics/color.sty
(/usr/share/texmf/tex/latex/config/color.cfg)
(/usr/share/texmf-dist/tex/latex/graphics/dvips.def)
(/usr/share/texmf-dist/tex/latex/graphics/dvipsnam.def))
(/usr/share/texmf-dist/tex/latex/colortbl/colortbl.sty)
(/usr/share/texmf-dist/tex/latex/marvosym/marvosym.sty)
(/usr/share/texmf-dist/tex/latex/graphics/graphicx.sty
(/usr/share/texmf-dist/tex/latex/graphics/keyval.sty)
(/usr/share/texmf-dist/tex/latex/graphics/graphics.sty
(/usr/share/texmf-dist/tex/fontinst/base/trig.sty)
(/usr/share/texmf/tex/latex/config/graphics.cfg)))
(/usr/share/texmf-dist/tex/latex/tools/multicol.sty)
(/usr/share/texmf-dist/tex/latex/ltxmisc/ulem.sty)
(/usr/share/texmf-dist/tex/latex/fancyhdr/fancyhdr.sty)
(/usr/share/texmf-dist/tex/latex/hyperref/hyperref.sty
(/usr/share/texmf-dist/tex/generic/oberdiek/ifpdf.sty)
(/usr/share/texmf-dist/tex/generic/oberdiek/ifvtex.sty)
(/usr/share/texmf-dist/tex/generic/ifxetex/ifxetex.sty)
(/usr/share/texmf-dist/tex/latex/oberdiek/hycolor.sty
(/usr/share/texmf-dist/tex/latex/oberdiek/xcolor-patch.sty))
(/usr/share/texmf-dist/tex/latex/hyperref/pd1enc.def)
(/usr/share/texmf-dist/tex/generic/oberdiek/etexcmds.sty
(/usr/share/texmf-dist/tex/generic/oberdiek/infwarerr.sty))

Package hyperref Warning: Height of page (\paperheight) is invalid (0.0pt),
(hyperref)                using 11in.

(/usr/share/texmf/tex/latex/config/hyperref.cfg)
(/usr/share/texmf-dist/tex/latex/oberdiek/kvoptions.sty)
Implicit mode ON; LaTeX internals redefined
(/usr/share/texmf/tex/latex/latex2html/url.sty)
(/usr/share/texmf-dist/tex/generic/oberdiek/bitset.sty
(/usr/share/texmf-dist/tex/generic/oberdiek/intcalc.sty)
(/usr/share/texmf-dist/tex/generic/oberdiek/bigintcalc.sty
(/usr/share/texmf-dist/tex/generic/oberdiek/pdftexcmds.sty)))
(/usr/share/texmf-dist/tex/generic/oberdiek/kvsetkeys.sty)
(/usr/share/texmf-dist/tex/generic/oberdiek/atbegshi.sty))
*hyperref using default driver hdvips*
(/usr/share/texmf-dist/tex/latex/hyperref/hdvips.def
(/usr/share/texmf-dist/tex/latex/hyperref/pdfmark.def))
(/usr/share/texmf-dist/tex/latex/base/inputenc.sty
(/usr/share/texmf-dist/tex/jadetex/base/dsssl.def))
(/usr/share/texmf-dist/tex/xmltex/passivetex/mlnames.sty)
(/usr/share/texmf-dist/tex/xmltex/passivetex/unicode.sty
(/usr/share/texmf-dist/tex/latex/base/fontenc.sty
(/usr/share/texmf-dist/tex/latex/tipa/t3enc.def)
(/usr/share/texmf-dist/tex/latex/base/t1enc.def))
(/usr/share/texmf-dist/tex/latex/tipa/tipa.sty)
(/usr/share/texmf-dist/tex/latex/tipa/tone.sty)
(/usr/share/texmf-dist/tex/latex/amsfonts/amssymb.sty
(/usr/share/texmf-dist/tex/latex/amsfonts/amsfonts.sty))
(/usr/share/texmf-dist/tex/latex/tools/bm.sty)
(/usr/share/texmf-dist/tex/latex/base/textcomp.sty
(/usr/share/texmf-dist/tex/latex/base/ts1enc.def))
(/usr/share/texmf-dist/tex/latex/psnfss/pifont.sty
(/usr/share/texmf-dist/tex/latex/psnfss/upzd.fd)
(/usr/share/texmf-dist/tex/latex/psnfss/upsy.fd))
(/usr/share/texmf-dist/tex/latex/wasysym/wasysym.sty)
(/usr/share/texmf-dist/tex/latex/stmaryrd/stmaryrd.sty)
WARNING: Elsevier font setup not found
(/usr/share/texmf-dist/tex/xmltex/passivetex/dummyels.sty)
WARNING: mmasym package not loaded. some symbols will fail
(/usr/share/texmf-dist/tex/latex/amsfonts/eucal.sty))
(/usr/share/texmf-dist/tex/xmltex/passivetex/ucharacters.sty)
(/usr/share/texmf-dist/tex/jadetex/base/uentities.sty)) )
Beginning to dump on file jadetex.fmt
 (format=jadetex 2018.9.2)
18367 strings of total length 229864
185589 memory locations dumped; current usage is 175&184798
15410 multiletter control sequences
\font\nullfont=nullfont
\font\OMX/cmex/m/n/10=cmex10
\font\tenln=line10
\font\tenlnw=linew10
\font\tencirc=lcircle10
\font\tencircw=lcirclew10
\font\OT1/cmr/m/n/5=cmr5
\font\OT1/cmr/m/n/7=cmr7
\font\OT1/cmr/m/n/10=cmr10
\font\OML/cmm/m/it/5=cmmi5
\font\OML/cmm/m/it/7=cmmi7
\font\OML/cmm/m/it/10=cmmi10
\font\OMS/cmsy/m/n/5=cmsy5
\font\OMS/cmsy/m/n/7=cmsy7
\font\OMS/cmsy/m/n/10=cmsy10
\font\sixly=lasy6
\font\OT1/cmr/m/sl/10=cmsl10
\font\OT1/cmr/m/it/10=cmti10
\font\OT1/cmr/bx/n/10=cmbx10
\font\OT1/cmss/m/n/10=cmss10
\font\T1/cmr/m/n/10=ecrm1000
\font\U/pzd/m/n/10=pzdr
\font\U/psy/m/n/10=psyr
6504 words of font info for 22 preloaded fonts
714 hyphenation exceptions
Hyphenation trie of length 218991 has 7024 ops out of 35111
  143 for language 53
  110 for language 52
  138 for language 51
  224 for language 50
  12 for language 49
  127 for language 48
  158 for language 47
  71 for language 46
  248 for language 45
  66 for language 44
  119 for language 42
  58 for language 41
  7 for language 40
  194 for language 39
  815 for language 38
  815 for language 37
  38 for language 36
  21 for language 35
  25 for language 34
  36 for language 33
  229 for language 32
  38 for language 31
  21 for language 30
  147 for language 29
  117 for language 28
  50 for language 27
  18 for language 26
  235 for language 25
  207 for language 24
  75 for language 23
  88 for language 22
  31 for language 21
  113 for language 19
  145 for language 18
  265 for language 17
  60 for language 16
  63 for language 15
  19 for language 14
  14 for language 13
  2 for language 12
  21 for language 11
  12 for language 10
  5 for language 9
  148 for language 7
  97 for language 6
  411 for language 5
  408 for language 4
  2 for language 2
  377 for language 1
  181 for language 0
0 words of pdfTeX memory
0 indirect objects
No pages of output.
Transcript written on jadetex.log.
mv: cannot move 'jadetex.log' to '/var/lib/texmf/web2c/pdftex/jadetex.log': Permission denied
mv: cannot move 'jadetex.fmt' to '/var/lib/texmf/web2c/pdftex/jadetex.fmt': Permission denied
This is pdfTeXk, Version 3.1415926-1.40.9 (Web2C 7.5.7)
 %&-line parsing enabled.
I can't find the format file `jadetex.fmt'!
make[4]: [Makefile:660: claws-mail-manual.ps] Error 9 (ignored)
make[4]: Leaving directory '/tmp/B.LM_jhl/BUILD/claws-mail-3.17.1/manual/dist/ps'
Making all in txt
make[4]: Nothing to be done for 'all'.
make[4]: Nothing to be done for 'all-am'.
Making all in es
Making all in dist
Making all in html
make[5]: Nothing to be done for 'all'.
Making all in pdf
make[5]: Entering directory '/tmp/B.LM_jhl/BUILD/claws-mail-3.17.1/manual/es/dist/pdf'
docbook2pdf -o . ../../claws-mail-manual.xml
Using catalogs: /etc/sgml/catalog
Using stylesheet: /usr/share/sgml/docbook/utils-0.6.14/docbook-utils.dsl#print
Working on: /tmp/B.LM_jhl/BUILD/claws-mail-3.17.1/manual/es/dist/pdf/../../claws-mail-manual.xml

kpathsea: Running mktexfmt pdfjadetex.fmt
fmtutil: running `pdftex -ini   -jobname=pdfjadetex -progname=pdfjadetex &pdflatex pdfjadetex.ini' ...
This is pdfTeXk, Version 3.1415926-1.40.9 (Web2C 7.5.7) (INITEX)
 %&-line parsing enabled.
entering extended mode
(/usr/share/texmf-dist/tex/jadetex/config/pdfjadetex.ini
LaTeX2e <2005/12/01>
Babel <v3.8l> and hyphenation patterns for english, usenglishmax, dumylang, noh
yphenation, german-x-2008-06-18, ngerman-x-2008-06-18, ancientgreek, ibycus, ar
abic, basque, bulgarian, catalan, pinyin, coptic, croatian, czech, danish, dutc
h, esperanto, estonian, farsi, finnish, french, galician, german, ngerman, mono
greek, greek, hungarian, icelandic, indonesian, interlingua, irish, italian, la
tin, mongolian, mongolian2a, bokmal, nynorsk, polish, portuguese, romanian, rus
sian, sanskrit, serbian, slovak, slovenian, spanish, swedish, turkish, ukenglis
h, ukrainian, uppersorbian, welsh, loaded.
(/usr/share/texmf/tex/generic/config/pdftexconfig.tex)
(/usr/share/texmf-dist/tex/jadetex/base/jadetex.ltx
(/usr/share/texmf-dist/tex/latex/base/minimal.cls
Document Class: minimal 2001/05/25 Standard LaTeX minimal class
) (/usr/share/texmf-dist/tex/latex/tools/array.sty)
(/usr/share/texmf-dist/tex/latex/tools/longtable.sty)
(/usr/share/texmf-dist/tex/latex/graphics/color.sty
(/usr/share/texmf/tex/latex/config/color.cfg)
(/usr/share/texmf-dist/tex/latex/pdftex-def/pdftex.def))
(/usr/share/texmf-dist/tex/latex/colortbl/colortbl.sty)
(/usr/share/texmf-dist/tex/latex/marvosym/marvosym.sty)
(/usr/share/texmf-dist/tex/latex/graphics/graphicx.sty
(/usr/share/texmf-dist/tex/latex/graphics/keyval.sty)
(/usr/share/texmf-dist/tex/latex/graphics/graphics.sty
(/usr/share/texmf-dist/tex/fontinst/base/trig.sty)
(/usr/share/texmf/tex/latex/config/graphics.cfg)))
(/usr/share/texmf-dist/tex/latex/tools/multicol.sty)
(/usr/share/texmf-dist/tex/latex/ltxmisc/ulem.sty)
(/usr/share/texmf-dist/tex/latex/fancyhdr/fancyhdr.sty)
(/usr/share/texmf-dist/tex/latex/hyperref/hyperref.sty
(/usr/share/texmf-dist/tex/generic/oberdiek/ifpdf.sty)
(/usr/share/texmf-dist/tex/generic/oberdiek/ifvtex.sty)
(/usr/share/texmf-dist/tex/generic/ifxetex/ifxetex.sty)
(/usr/share/texmf-dist/tex/latex/oberdiek/hycolor.sty
(/usr/share/texmf-dist/tex/latex/oberdiek/xcolor-patch.sty))
(/usr/share/texmf-dist/tex/latex/hyperref/pd1enc.def)
(/usr/share/texmf-dist/tex/generic/oberdiek/etexcmds.sty
(/usr/share/texmf-dist/tex/generic/oberdiek/infwarerr.sty))

Package hyperref Warning: Height of page (\paperheight) is invalid (0.0pt),
(hyperref)                using 11in.

(/usr/share/texmf/tex/latex/config/hyperref.cfg)
(/usr/share/texmf-dist/tex/latex/oberdiek/kvoptions.sty)
Implicit mode ON; LaTeX internals redefined
(/usr/share/texmf/tex/latex/latex2html/url.sty)
(/usr/share/texmf-dist/tex/generic/oberdiek/bitset.sty
(/usr/share/texmf-dist/tex/generic/oberdiek/intcalc.sty)
(/usr/share/texmf-dist/tex/generic/oberdiek/bigintcalc.sty
(/usr/share/texmf-dist/tex/generic/oberdiek/pdftexcmds.sty)))
(/usr/share/texmf-dist/tex/generic/oberdiek/kvsetkeys.sty)
(/usr/share/texmf-dist/tex/generic/oberdiek/atbegshi.sty))
*hyperref using default driver hpdftex*
(/usr/share/texmf-dist/tex/latex/hyperref/hpdftex.def)
(/usr/share/texmf-dist/tex/latex/base/inputenc.sty
(/usr/share/texmf-dist/tex/jadetex/base/dsssl.def))
(/usr/share/texmf-dist/tex/xmltex/passivetex/mlnames.sty)
(/usr/share/texmf-dist/tex/xmltex/passivetex/unicode.sty
(/usr/share/texmf-dist/tex/latex/base/fontenc.sty
(/usr/share/texmf-dist/tex/latex/tipa/t3enc.def)
(/usr/share/texmf-dist/tex/latex/base/t1enc.def))
(/usr/share/texmf-dist/tex/latex/tipa/tipa.sty)
(/usr/share/texmf-dist/tex/latex/tipa/tone.sty)
(/usr/share/texmf-dist/tex/latex/amsfonts/amssymb.sty
(/usr/share/texmf-dist/tex/latex/amsfonts/amsfonts.sty))
(/usr/share/texmf-dist/tex/latex/tools/bm.sty)
(/usr/share/texmf-dist/tex/latex/base/textcomp.sty
(/usr/share/texmf-dist/tex/latex/base/ts1enc.def))
(/usr/share/texmf-dist/tex/latex/psnfss/pifont.sty
(/usr/share/texmf-dist/tex/latex/psnfss/upzd.fd)
(/usr/share/texmf-dist/tex/latex/psnfss/upsy.fd))
(/usr/share/texmf-dist/tex/latex/wasysym/wasysym.sty)
(/usr/share/texmf-dist/tex/latex/stmaryrd/stmaryrd.sty)
WARNING: Elsevier font setup not found
(/usr/share/texmf-dist/tex/xmltex/passivetex/dummyels.sty)
WARNING: mmasym package not loaded. some symbols will fail
(/usr/share/texmf-dist/tex/latex/amsfonts/eucal.sty))
(/usr/share/texmf-dist/tex/xmltex/passivetex/ucharacters.sty)
(/usr/share/texmf-dist/tex/jadetex/base/uentities.sty)) )
Beginning to dump on file pdfjadetex.fmt
 (format=pdfjadetex 2018.9.2)
18234 strings of total length 227740
183976 memory locations dumped; current usage is 175&183185
15278 multiletter control sequences
\font\nullfont=nullfont
\font\OMX/cmex/m/n/10=cmex10
\font\tenln=line10
\font\tenlnw=linew10
\font\tencirc=lcircle10
\font\tencircw=lcirclew10
\font\OT1/cmr/m/n/5=cmr5
\font\OT1/cmr/m/n/7=cmr7
\font\OT1/cmr/m/n/10=cmr10
\font\OML/cmm/m/it/5=cmmi5
\font\OML/cmm/m/it/7=cmmi7
\font\OML/cmm/m/it/10=cmmi10
\font\OMS/cmsy/m/n/5=cmsy5
\font\OMS/cmsy/m/n/7=cmsy7
\font\OMS/cmsy/m/n/10=cmsy10
\font\sixly=lasy6
\font\OT1/cmr/m/sl/10=cmsl10
\font\OT1/cmr/m/it/10=cmti10
\font\OT1/cmr/bx/n/10=cmbx10
\font\OT1/cmss/m/n/10=cmss10
\font\T1/cmr/m/n/10=ecrm1000
\font\U/pzd/m/n/10=pzdr
\font\U/psy/m/n/10=psyr
6504 words of font info for 22 preloaded fonts
714 hyphenation exceptions
Hyphenation trie of length 218991 has 7024 ops out of 35111
  143 for language 53
  110 for language 52
  138 for language 51
  224 for language 50
  12 for language 49
  127 for language 48
  158 for language 47
  71 for language 46
  248 for language 45
  66 for language 44
  119 for language 42
  58 for language 41
  7 for language 40
  194 for language 39
  815 for language 38
  815 for language 37
  38 for language 36
  21 for language 35
  25 for language 34
  36 for language 33
  229 for language 32
  38 for language 31
  21 for language 30
  147 for language 29
  117 for language 28
  50 for language 27
  18 for language 26
  235 for language 25
  207 for language 24
  75 for language 23
  88 for language 22
  31 for language 21
  113 for language 19
  145 for language 18
  265 for language 17
  60 for language 16
  63 for language 15
  19 for language 14
  14 for language 13
  2 for language 12
  21 for language 11
  12 for language 10
  5 for language 9
  148 for language 7
  97 for language 6
  411 for language 5
  408 for language 4
  2 for language 2
  377 for language 1
  181 for language 0
16 words of pdfTeX memory
4 indirect objects
No pages of output.
Transcript written on pdfjadetex.log.
mv: cannot move 'pdfjadetex.log' to '/var/lib/texmf/web2c/pdftex/pdfjadetex.log': Permission denied
mv: cannot move 'pdfjadetex.fmt' to '/var/lib/texmf/web2c/pdftex/pdfjadetex.fmt': Permission denied
This is pdfTeXk, Version 3.1415926-1.40.9 (Web2C 7.5.7)
 %&-line parsing enabled.
I can't find the format file `pdfjadetex.fmt'!
make[5]: [Makefile:660: claws-mail-manual.pdf] Error 9 (ignored)
make[5]: Leaving directory '/tmp/B.LM_jhl/BUILD/claws-mail-3.17.1/manual/es/dist/pdf'
Making all in ps
make[5]: Entering directory '/tmp/B.LM_jhl/BUILD/claws-mail-3.17.1/manual/es/dist/ps'
docbook2ps -o . ../../claws-mail-manual.xml
Using catalogs: /etc/sgml/catalog
Using stylesheet: /usr/share/sgml/docbook/utils-0.6.14/docbook-utils.dsl#print
Working on: /tmp/B.LM_jhl/BUILD/claws-mail-3.17.1/manual/es/dist/ps/../../claws-mail-manual.xml

kpathsea: Running mktexfmt jadetex.fmt
fmtutil: running `pdftex -ini   -jobname=jadetex -progname=jadetex &latex jadetex.ini' ...
This is pdfTeXk, Version 3.1415926-1.40.9 (Web2C 7.5.7) (INITEX)
 %&-line parsing enabled.
entering extended mode
(/usr/share/texmf-dist/tex/jadetex/config/jadetex.ini
LaTeX2e <2005/12/01>
Babel <v3.8l> and hyphenation patterns for english, usenglishmax, dumylang, noh
yphenation, german-x-2008-06-18, ngerman-x-2008-06-18, ancientgreek, ibycus, ar
abic, basque, bulgarian, catalan, pinyin, coptic, croatian, czech, danish, dutc
h, esperanto, estonian, farsi, finnish, french, galician, german, ngerman, mono
greek, greek, hungarian, icelandic, indonesian, interlingua, irish, italian, la
tin, mongolian, mongolian2a, bokmal, nynorsk, polish, portuguese, romanian, rus
sian, sanskrit, serbian, slovak, slovenian, spanish, swedish, turkish, ukenglis
h, ukrainian, uppersorbian, welsh, loaded.
(/usr/share/texmf-dist/tex/jadetex/base/jadetex.ltx
(/usr/share/texmf-dist/tex/latex/base/minimal.cls
Document Class: minimal 2001/05/25 Standard LaTeX minimal class
) (/usr/share/texmf-dist/tex/latex/tools/array.sty)
(/usr/share/texmf-dist/tex/latex/tools/longtable.sty)
(/usr/share/texmf-dist/tex/latex/graphics/color.sty
(/usr/share/texmf/tex/latex/config/color.cfg)
(/usr/share/texmf-dist/tex/latex/graphics/dvips.def)
(/usr/share/texmf-dist/tex/latex/graphics/dvipsnam.def))
(/usr/share/texmf-dist/tex/latex/colortbl/colortbl.sty)
(/usr/share/texmf-dist/tex/latex/marvosym/marvosym.sty)
(/usr/share/texmf-dist/tex/latex/graphics/graphicx.sty
(/usr/share/texmf-dist/tex/latex/graphics/keyval.sty)
(/usr/share/texmf-dist/tex/latex/graphics/graphics.sty
(/usr/share/texmf-dist/tex/fontinst/base/trig.sty)
(/usr/share/texmf/tex/latex/config/graphics.cfg)))
(/usr/share/texmf-dist/tex/latex/tools/multicol.sty)
(/usr/share/texmf-dist/tex/latex/ltxmisc/ulem.sty)
(/usr/share/texmf-dist/tex/latex/fancyhdr/fancyhdr.sty)
(/usr/share/texmf-dist/tex/latex/hyperref/hyperref.sty
(/usr/share/texmf-dist/tex/generic/oberdiek/ifpdf.sty)
(/usr/share/texmf-dist/tex/generic/oberdiek/ifvtex.sty)
(/usr/share/texmf-dist/tex/generic/ifxetex/ifxetex.sty)
(/usr/share/texmf-dist/tex/latex/oberdiek/hycolor.sty
(/usr/share/texmf-dist/tex/latex/oberdiek/xcolor-patch.sty))
(/usr/share/texmf-dist/tex/latex/hyperref/pd1enc.def)
(/usr/share/texmf-dist/tex/generic/oberdiek/etexcmds.sty
(/usr/share/texmf-dist/tex/generic/oberdiek/infwarerr.sty))

Package hyperref Warning: Height of page (\paperheight) is invalid (0.0pt),
(hyperref)                using 11in.

(/usr/share/texmf/tex/latex/config/hyperref.cfg)
(/usr/share/texmf-dist/tex/latex/oberdiek/kvoptions.sty)
Implicit mode ON; LaTeX internals redefined
(/usr/share/texmf/tex/latex/latex2html/url.sty)
(/usr/share/texmf-dist/tex/generic/oberdiek/bitset.sty
(/usr/share/texmf-dist/tex/generic/oberdiek/intcalc.sty)
(/usr/share/texmf-dist/tex/generic/oberdiek/bigintcalc.sty
(/usr/share/texmf-dist/tex/generic/oberdiek/pdftexcmds.sty)))
(/usr/share/texmf-dist/tex/generic/oberdiek/kvsetkeys.sty)
(/usr/share/texmf-dist/tex/generic/oberdiek/atbegshi.sty))
*hyperref using default driver hdvips*
(/usr/share/texmf-dist/tex/latex/hyperref/hdvips.def
(/usr/share/texmf-dist/tex/latex/hyperref/pdfmark.def))
(/usr/share/texmf-dist/tex/latex/base/inputenc.sty
(/usr/share/texmf-dist/tex/jadetex/base/dsssl.def))
(/usr/share/texmf-dist/tex/xmltex/passivetex/mlnames.sty)
(/usr/share/texmf-dist/tex/xmltex/passivetex/unicode.sty
(/usr/share/texmf-dist/tex/latex/base/fontenc.sty
(/usr/share/texmf-dist/tex/latex/tipa/t3enc.def)
(/usr/share/texmf-dist/tex/latex/base/t1enc.def))
(/usr/share/texmf-dist/tex/latex/tipa/tipa.sty)
(/usr/share/texmf-dist/tex/latex/tipa/tone.sty)
(/usr/share/texmf-dist/tex/latex/amsfonts/amssymb.sty
(/usr/share/texmf-dist/tex/latex/amsfonts/amsfonts.sty))
(/usr/share/texmf-dist/tex/latex/tools/bm.sty)
(/usr/share/texmf-dist/tex/latex/base/textcomp.sty
(/usr/share/texmf-dist/tex/latex/base/ts1enc.def))
(/usr/share/texmf-dist/tex/latex/psnfss/pifont.sty
(/usr/share/texmf-dist/tex/latex/psnfss/upzd.fd)
(/usr/share/texmf-dist/tex/latex/psnfss/upsy.fd))
(/usr/share/texmf-dist/tex/latex/wasysym/wasysym.sty)
(/usr/share/texmf-dist/tex/latex/stmaryrd/stmaryrd.sty)
WARNING: Elsevier font setup not found
(/usr/share/texmf-dist/tex/xmltex/passivetex/dummyels.sty)
WARNING: mmasym package not loaded. some symbols will fail
(/usr/share/texmf-dist/tex/latex/amsfonts/eucal.sty))
(/usr/share/texmf-dist/tex/xmltex/passivetex/ucharacters.sty)
(/usr/share/texmf-dist/tex/jadetex/base/uentities.sty)) )
Beginning to dump on file jadetex.fmt
 (format=jadetex 2018.9.2)
18367 strings of total length 229864
185589 memory locations dumped; current usage is 175&184798
15410 multiletter control sequences
\font\nullfont=nullfont
\font\OMX/cmex/m/n/10=cmex10
\font\tenln=line10
\font\tenlnw=linew10
\font\tencirc=lcircle10
\font\tencircw=lcirclew10
\font\OT1/cmr/m/n/5=cmr5
\font\OT1/cmr/m/n/7=cmr7
\font\OT1/cmr/m/n/10=cmr10
\font\OML/cmm/m/it/5=cmmi5
\font\OML/cmm/m/it/7=cmmi7
\font\OML/cmm/m/it/10=cmmi10
\font\OMS/cmsy/m/n/5=cmsy5
\font\OMS/cmsy/m/n/7=cmsy7
\font\OMS/cmsy/m/n/10=cmsy10
\font\sixly=lasy6
\font\OT1/cmr/m/sl/10=cmsl10
\font\OT1/cmr/m/it/10=cmti10
\font\OT1/cmr/bx/n/10=cmbx10
\font\OT1/cmss/m/n/10=cmss10
\font\T1/cmr/m/n/10=ecrm1000
\font\U/pzd/m/n/10=pzdr
\font\U/psy/m/n/10=psyr
6504 words of font info for 22 preloaded fonts
714 hyphenation exceptions
Hyphenation trie of length 218991 has 7024 ops out of 35111
  143 for language 53
  110 for language 52
  138 for language 51
  224 for language 50
  12 for language 49
  127 for language 48
  158 for language 47
  71 for language 46
  248 for language 45
  66 for language 44
  119 for language 42
  58 for language 41
  7 for language 40
  194 for language 39
  815 for language 38
  815 for language 37
  38 for language 36
  21 for language 35
  25 for language 34
  36 for language 33
  229 for language 32
  38 for language 31
  21 for language 30
  147 for language 29
  117 for language 28
  50 for language 27
  18 for language 26
  235 for language 25
  207 for language 24
  75 for language 23
  88 for language 22
  31 for language 21
  113 for language 19
  145 for language 18
  265 for language 17
  60 for language 16
  63 for language 15
  19 for language 14
  14 for language 13
  2 for language 12
  21 for language 11
  12 for language 10
  5 for language 9
  148 for language 7
  97 for language 6
  411 for language 5
  408 for language 4
  2 for language 2
  377 for language 1
  181 for language 0
0 words of pdfTeX memory
0 indirect objects
No pages of output.
Transcript written on jadetex.log.
mv: cannot move 'jadetex.log' to '/var/lib/texmf/web2c/pdftex/jadetex.log': Permission denied
mv: cannot move 'jadetex.fmt' to '/var/lib/texmf/web2c/pdftex/jadetex.fmt': Permission denied
This is pdfTeXk, Version 3.1415926-1.40.9 (Web2C 7.5.7)
 %&-line parsing enabled.
I can't find the format file `jadetex.fmt'!
make[5]: [Makefile:660: claws-mail-manual.ps] Error 9 (ignored)
make[5]: Leaving directory '/tmp/B.LM_jhl/BUILD/claws-mail-3.17.1/manual/es/dist/ps'
Making all in txt
make[5]: Nothing to be done for 'all'.
make[5]: Nothing to be done for 'all-am'.
make[4]: Nothing to be done for 'all-am'.
Making all in fr
Making all in dist
Making all in html
make[5]: Nothing to be done for 'all'.
Making all in pdf
make[5]: Entering directory '/tmp/B.LM_jhl/BUILD/claws-mail-3.17.1/manual/fr/dist/pdf'
docbook2pdf -o . ../../claws-mail-manual.xml
Using catalogs: /etc/sgml/catalog
Using stylesheet: /usr/share/sgml/docbook/utils-0.6.14/docbook-utils.dsl#print
Working on: /tmp/B.LM_jhl/BUILD/claws-mail-3.17.1/manual/fr/dist/pdf/../../claws-mail-manual.xml

kpathsea: Running mktexfmt pdfjadetex.fmt
fmtutil: running `pdftex -ini   -jobname=pdfjadetex -progname=pdfjadetex &pdflatex pdfjadetex.ini' ...
This is pdfTeXk, Version 3.1415926-1.40.9 (Web2C 7.5.7) (INITEX)
 %&-line parsing enabled.
entering extended mode
(/usr/share/texmf-dist/tex/jadetex/config/pdfjadetex.ini
LaTeX2e <2005/12/01>
Babel <v3.8l> and hyphenation patterns for english, usenglishmax, dumylang, noh
yphenation, german-x-2008-06-18, ngerman-x-2008-06-18, ancientgreek, ibycus, ar
abic, basque, bulgarian, catalan, pinyin, coptic, croatian, czech, danish, dutc
h, esperanto, estonian, farsi, finnish, french, galician, german, ngerman, mono
greek, greek, hungarian, icelandic, indonesian, interlingua, irish, italian, la
tin, mongolian, mongolian2a, bokmal, nynorsk, polish, portuguese, romanian, rus
sian, sanskrit, serbian, slovak, slovenian, spanish, swedish, turkish, ukenglis
h, ukrainian, uppersorbian, welsh, loaded.
(/usr/share/texmf/tex/generic/config/pdftexconfig.tex)
(/usr/share/texmf-dist/tex/jadetex/base/jadetex.ltx
(/usr/share/texmf-dist/tex/latex/base/minimal.cls
Document Class: minimal 2001/05/25 Standard LaTeX minimal class
) (/usr/share/texmf-dist/tex/latex/tools/array.sty)
(/usr/share/texmf-dist/tex/latex/tools/longtable.sty)
(/usr/share/texmf-dist/tex/latex/graphics/color.sty
(/usr/share/texmf/tex/latex/config/color.cfg)
(/usr/share/texmf-dist/tex/latex/pdftex-def/pdftex.def))
(/usr/share/texmf-dist/tex/latex/colortbl/colortbl.sty)
(/usr/share/texmf-dist/tex/latex/marvosym/marvosym.sty)
(/usr/share/texmf-dist/tex/latex/graphics/graphicx.sty
(/usr/share/texmf-dist/tex/latex/graphics/keyval.sty)
(/usr/share/texmf-dist/tex/latex/graphics/graphics.sty
(/usr/share/texmf-dist/tex/fontinst/base/trig.sty)
(/usr/share/texmf/tex/latex/config/graphics.cfg)))
(/usr/share/texmf-dist/tex/latex/tools/multicol.sty)
(/usr/share/texmf-dist/tex/latex/ltxmisc/ulem.sty)
(/usr/share/texmf-dist/tex/latex/fancyhdr/fancyhdr.sty)
(/usr/share/texmf-dist/tex/latex/hyperref/hyperref.sty
(/usr/share/texmf-dist/tex/generic/oberdiek/ifpdf.sty)
(/usr/share/texmf-dist/tex/generic/oberdiek/ifvtex.sty)
(/usr/share/texmf-dist/tex/generic/ifxetex/ifxetex.sty)
(/usr/share/texmf-dist/tex/latex/oberdiek/hycolor.sty
(/usr/share/texmf-dist/tex/latex/oberdiek/xcolor-patch.sty))
(/usr/share/texmf-dist/tex/latex/hyperref/pd1enc.def)
(/usr/share/texmf-dist/tex/generic/oberdiek/etexcmds.sty
(/usr/share/texmf-dist/tex/generic/oberdiek/infwarerr.sty))

Package hyperref Warning: Height of page (\paperheight) is invalid (0.0pt),
(hyperref)                using 11in.

(/usr/share/texmf/tex/latex/config/hyperref.cfg)
(/usr/share/texmf-dist/tex/latex/oberdiek/kvoptions.sty)
Implicit mode ON; LaTeX internals redefined
(/usr/share/texmf/tex/latex/latex2html/url.sty)
(/usr/share/texmf-dist/tex/generic/oberdiek/bitset.sty
(/usr/share/texmf-dist/tex/generic/oberdiek/intcalc.sty)
(/usr/share/texmf-dist/tex/generic/oberdiek/bigintcalc.sty
(/usr/share/texmf-dist/tex/generic/oberdiek/pdftexcmds.sty)))
(/usr/share/texmf-dist/tex/generic/oberdiek/kvsetkeys.sty)
(/usr/share/texmf-dist/tex/generic/oberdiek/atbegshi.sty))
*hyperref using default driver hpdftex*
(/usr/share/texmf-dist/tex/latex/hyperref/hpdftex.def)
(/usr/share/texmf-dist/tex/latex/base/inputenc.sty
(/usr/share/texmf-dist/tex/jadetex/base/dsssl.def))
(/usr/share/texmf-dist/tex/xmltex/passivetex/mlnames.sty)
(/usr/share/texmf-dist/tex/xmltex/passivetex/unicode.sty
(/usr/share/texmf-dist/tex/latex/base/fontenc.sty
(/usr/share/texmf-dist/tex/latex/tipa/t3enc.def)
(/usr/share/texmf-dist/tex/latex/base/t1enc.def))
(/usr/share/texmf-dist/tex/latex/tipa/tipa.sty)
(/usr/share/texmf-dist/tex/latex/tipa/tone.sty)
(/usr/share/texmf-dist/tex/latex/amsfonts/amssymb.sty
(/usr/share/texmf-dist/tex/latex/amsfonts/amsfonts.sty))
(/usr/share/texmf-dist/tex/latex/tools/bm.sty)
(/usr/share/texmf-dist/tex/latex/base/textcomp.sty
(/usr/share/texmf-dist/tex/latex/base/ts1enc.def))
(/usr/share/texmf-dist/tex/latex/psnfss/pifont.sty
(/usr/share/texmf-dist/tex/latex/psnfss/upzd.fd)
(/usr/share/texmf-dist/tex/latex/psnfss/upsy.fd))
(/usr/share/texmf-dist/tex/latex/wasysym/wasysym.sty)
(/usr/share/texmf-dist/tex/latex/stmaryrd/stmaryrd.sty)
WARNING: Elsevier font setup not found
(/usr/share/texmf-dist/tex/xmltex/passivetex/dummyels.sty)
WARNING: mmasym package not loaded. some symbols will fail
(/usr/share/texmf-dist/tex/latex/amsfonts/eucal.sty))
(/usr/share/texmf-dist/tex/xmltex/passivetex/ucharacters.sty)
(/usr/share/texmf-dist/tex/jadetex/base/uentities.sty)) )
Beginning to dump on file pdfjadetex.fmt
 (format=pdfjadetex 2018.9.2)
18234 strings of total length 227740
183976 memory locations dumped; current usage is 175&183185
15278 multiletter control sequences
\font\nullfont=nullfont
\font\OMX/cmex/m/n/10=cmex10
\font\tenln=line10
\font\tenlnw=linew10
\font\tencirc=lcircle10
\font\tencircw=lcirclew10
\font\OT1/cmr/m/n/5=cmr5
\font\OT1/cmr/m/n/7=cmr7
\font\OT1/cmr/m/n/10=cmr10
\font\OML/cmm/m/it/5=cmmi5
\font\OML/cmm/m/it/7=cmmi7
\font\OML/cmm/m/it/10=cmmi10
\font\OMS/cmsy/m/n/5=cmsy5
\font\OMS/cmsy/m/n/7=cmsy7
\font\OMS/cmsy/m/n/10=cmsy10
\font\sixly=lasy6
\font\OT1/cmr/m/sl/10=cmsl10
\font\OT1/cmr/m/it/10=cmti10
\font\OT1/cmr/bx/n/10=cmbx10
\font\OT1/cmss/m/n/10=cmss10
\font\T1/cmr/m/n/10=ecrm1000
\font\U/pzd/m/n/10=pzdr
\font\U/psy/m/n/10=psyr
6504 words of font info for 22 preloaded fonts
714 hyphenation exceptions
Hyphenation trie of length 218991 has 7024 ops out of 35111
  143 for language 53
  110 for language 52
  138 for language 51
  224 for language 50
  12 for language 49
  127 for language 48
  158 for language 47
  71 for language 46
  248 for language 45
  66 for language 44
  119 for language 42
  58 for language 41
  7 for language 40
  194 for language 39
  815 for language 38
  815 for language 37
  38 for language 36
  21 for language 35
  25 for language 34
  36 for language 33
  229 for language 32
  38 for language 31
  21 for language 30
  147 for language 29
  117 for language 28
  50 for language 27
  18 for language 26
  235 for language 25
  207 for language 24
  75 for language 23
  88 for language 22
  31 for language 21
  113 for language 19
  145 for language 18
  265 for language 17
  60 for language 16
  63 for language 15
  19 for language 14
  14 for language 13
  2 for language 12
  21 for language 11
  12 for language 10
  5 for language 9
  148 for language 7
  97 for language 6
  411 for language 5
  408 for language 4
  2 for language 2
  377 for language 1
  181 for language 0
16 words of pdfTeX memory
4 indirect objects
No pages of output.
Transcript written on pdfjadetex.log.
mv: cannot move 'pdfjadetex.log' to '/var/lib/texmf/web2c/pdftex/pdfjadetex.log': Permission denied
mv: cannot move 'pdfjadetex.fmt' to '/var/lib/texmf/web2c/pdftex/pdfjadetex.fmt': Permission denied
This is pdfTeXk, Version 3.1415926-1.40.9 (Web2C 7.5.7)
 %&-line parsing enabled.
I can't find the format file `pdfjadetex.fmt'!
make[5]: [Makefile:660: claws-mail-manual.pdf] Error 9 (ignored)
make[5]: Leaving directory '/tmp/B.LM_jhl/BUILD/claws-mail-3.17.1/manual/fr/dist/pdf'
Making all in ps
make[5]: Entering directory '/tmp/B.LM_jhl/BUILD/claws-mail-3.17.1/manual/fr/dist/ps'
docbook2ps -o . ../../claws-mail-manual.xml
Using catalogs: /etc/sgml/catalog
Using stylesheet: /usr/share/sgml/docbook/utils-0.6.14/docbook-utils.dsl#print
Working on: /tmp/B.LM_jhl/BUILD/claws-mail-3.17.1/manual/fr/dist/ps/../../claws-mail-manual.xml

kpathsea: Running mktexfmt jadetex.fmt
fmtutil: running `pdftex -ini   -jobname=jadetex -progname=jadetex &latex jadetex.ini' ...
This is pdfTeXk, Version 3.1415926-1.40.9 (Web2C 7.5.7) (INITEX)
 %&-line parsing enabled.
entering extended mode
(/usr/share/texmf-dist/tex/jadetex/config/jadetex.ini
LaTeX2e <2005/12/01>
Babel <v3.8l> and hyphenation patterns for english, usenglishmax, dumylang, noh
yphenation, german-x-2008-06-18, ngerman-x-2008-06-18, ancientgreek, ibycus, ar
abic, basque, bulgarian, catalan, pinyin, coptic, croatian, czech, danish, dutc
h, esperanto, estonian, farsi, finnish, french, galician, german, ngerman, mono
greek, greek, hungarian, icelandic, indonesian, interlingua, irish, italian, la
tin, mongolian, mongolian2a, bokmal, nynorsk, polish, portuguese, romanian, rus
sian, sanskrit, serbian, slovak, slovenian, spanish, swedish, turkish, ukenglis
h, ukrainian, uppersorbian, welsh, loaded.
(/usr/share/texmf-dist/tex/jadetex/base/jadetex.ltx
(/usr/share/texmf-dist/tex/latex/base/minimal.cls
Document Class: minimal 2001/05/25 Standard LaTeX minimal class
) (/usr/share/texmf-dist/tex/latex/tools/array.sty)
(/usr/share/texmf-dist/tex/latex/tools/longtable.sty)
(/usr/share/texmf-dist/tex/latex/graphics/color.sty
(/usr/share/texmf/tex/latex/config/color.cfg)
(/usr/share/texmf-dist/tex/latex/graphics/dvips.def)
(/usr/share/texmf-dist/tex/latex/graphics/dvipsnam.def))
(/usr/share/texmf-dist/tex/latex/colortbl/colortbl.sty)
(/usr/share/texmf-dist/tex/latex/marvosym/marvosym.sty)
(/usr/share/texmf-dist/tex/latex/graphics/graphicx.sty
(/usr/share/texmf-dist/tex/latex/graphics/keyval.sty)
(/usr/share/texmf-dist/tex/latex/graphics/graphics.sty
(/usr/share/texmf-dist/tex/fontinst/base/trig.sty)
(/usr/share/texmf/tex/latex/config/graphics.cfg)))
(/usr/share/texmf-dist/tex/latex/tools/multicol.sty)
(/usr/share/texmf-dist/tex/latex/ltxmisc/ulem.sty)
(/usr/share/texmf-dist/tex/latex/fancyhdr/fancyhdr.sty)
(/usr/share/texmf-dist/tex/latex/hyperref/hyperref.sty
(/usr/share/texmf-dist/tex/generic/oberdiek/ifpdf.sty)
(/usr/share/texmf-dist/tex/generic/oberdiek/ifvtex.sty)
(/usr/share/texmf-dist/tex/generic/ifxetex/ifxetex.sty)
(/usr/share/texmf-dist/tex/latex/oberdiek/hycolor.sty
(/usr/share/texmf-dist/tex/latex/oberdiek/xcolor-patch.sty))
(/usr/share/texmf-dist/tex/latex/hyperref/pd1enc.def)
(/usr/share/texmf-dist/tex/generic/oberdiek/etexcmds.sty
(/usr/share/texmf-dist/tex/generic/oberdiek/infwarerr.sty))

Package hyperref Warning: Height of page (\paperheight) is invalid (0.0pt),
(hyperref)                using 11in.

(/usr/share/texmf/tex/latex/config/hyperref.cfg)
(/usr/share/texmf-dist/tex/latex/oberdiek/kvoptions.sty)
Implicit mode ON; LaTeX internals redefined
(/usr/share/texmf/tex/latex/latex2html/url.sty)
(/usr/share/texmf-dist/tex/generic/oberdiek/bitset.sty
(/usr/share/texmf-dist/tex/generic/oberdiek/intcalc.sty)
(/usr/share/texmf-dist/tex/generic/oberdiek/bigintcalc.sty
(/usr/share/texmf-dist/tex/generic/oberdiek/pdftexcmds.sty)))
(/usr/share/texmf-dist/tex/generic/oberdiek/kvsetkeys.sty)
(/usr/share/texmf-dist/tex/generic/oberdiek/atbegshi.sty))
*hyperref using default driver hdvips*
(/usr/share/texmf-dist/tex/latex/hyperref/hdvips.def
(/usr/share/texmf-dist/tex/latex/hyperref/pdfmark.def))
(/usr/share/texmf-dist/tex/latex/base/inputenc.sty
(/usr/share/texmf-dist/tex/jadetex/base/dsssl.def))
(/usr/share/texmf-dist/tex/xmltex/passivetex/mlnames.sty)
(/usr/share/texmf-dist/tex/xmltex/passivetex/unicode.sty
(/usr/share/texmf-dist/tex/latex/base/fontenc.sty
(/usr/share/texmf-dist/tex/latex/tipa/t3enc.def)
(/usr/share/texmf-dist/tex/latex/base/t1enc.def))
(/usr/share/texmf-dist/tex/latex/tipa/tipa.sty)
(/usr/share/texmf-dist/tex/latex/tipa/tone.sty)
(/usr/share/texmf-dist/tex/latex/amsfonts/amssymb.sty
(/usr/share/texmf-dist/tex/latex/amsfonts/amsfonts.sty))
(/usr/share/texmf-dist/tex/latex/tools/bm.sty)
(/usr/share/texmf-dist/tex/latex/base/textcomp.sty
(/usr/share/texmf-dist/tex/latex/base/ts1enc.def))
(/usr/share/texmf-dist/tex/latex/psnfss/pifont.sty
(/usr/share/texmf-dist/tex/latex/psnfss/upzd.fd)
(/usr/share/texmf-dist/tex/latex/psnfss/upsy.fd))
(/usr/share/texmf-dist/tex/latex/wasysym/wasysym.sty)
(/usr/share/texmf-dist/tex/latex/stmaryrd/stmaryrd.sty)
WARNING: Elsevier font setup not found
(/usr/share/texmf-dist/tex/xmltex/passivetex/dummyels.sty)
WARNING: mmasym package not loaded. some symbols will fail
(/usr/share/texmf-dist/tex/latex/amsfonts/eucal.sty))
(/usr/share/texmf-dist/tex/xmltex/passivetex/ucharacters.sty)
(/usr/share/texmf-dist/tex/jadetex/base/uentities.sty)) )
Beginning to dump on file jadetex.fmt
 (format=jadetex 2018.9.2)
18367 strings of total length 229864
185589 memory locations dumped; current usage is 175&184798
15410 multiletter control sequences
\font\nullfont=nullfont
\font\OMX/cmex/m/n/10=cmex10
\font\tenln=line10
\font\tenlnw=linew10
\font\tencirc=lcircle10
\font\tencircw=lcirclew10
\font\OT1/cmr/m/n/5=cmr5
\font\OT1/cmr/m/n/7=cmr7
\font\OT1/cmr/m/n/10=cmr10
\font\OML/cmm/m/it/5=cmmi5
\font\OML/cmm/m/it/7=cmmi7
\font\OML/cmm/m/it/10=cmmi10
\font\OMS/cmsy/m/n/5=cmsy5
\font\OMS/cmsy/m/n/7=cmsy7
\font\OMS/cmsy/m/n/10=cmsy10
\font\sixly=lasy6
\font\OT1/cmr/m/sl/10=cmsl10
\font\OT1/cmr/m/it/10=cmti10
\font\OT1/cmr/bx/n/10=cmbx10
\font\OT1/cmss/m/n/10=cmss10
\font\T1/cmr/m/n/10=ecrm1000
\font\U/pzd/m/n/10=pzdr
\font\U/psy/m/n/10=psyr
6504 words of font info for 22 preloaded fonts
714 hyphenation exceptions
Hyphenation trie of length 218991 has 7024 ops out of 35111
  143 for language 53
  110 for language 52
  138 for language 51
  224 for language 50
  12 for language 49
  127 for language 48
  158 for language 47
  71 for language 46
  248 for language 45
  66 for language 44
  119 for language 42
  58 for language 41
  7 for language 40
  194 for language 39
  815 for language 38
  815 for language 37
  38 for language 36
  21 for language 35
  25 for language 34
  36 for language 33
  229 for language 32
  38 for language 31
  21 for language 30
  147 for language 29
  117 for language 28
  50 for language 27
  18 for language 26
  235 for language 25
  207 for language 24
  75 for language 23
  88 for language 22
  31 for language 21
  113 for language 19
  145 for language 18
  265 for language 17
  60 for language 16
  63 for language 15
  19 for language 14
  14 for language 13
  2 for language 12
  21 for language 11
  12 for language 10
  5 for language 9
  148 for language 7
  97 for language 6
  411 for language 5
  408 for language 4
  2 for language 2
  377 for language 1
  181 for language 0
0 words of pdfTeX memory
0 indirect objects
No pages of output.
Transcript written on jadetex.log.
mv: cannot move 'jadetex.log' to '/var/lib/texmf/web2c/pdftex/jadetex.log': Permission denied
mv: cannot move 'jadetex.fmt' to '/var/lib/texmf/web2c/pdftex/jadetex.fmt': Permission denied
This is pdfTeXk, Version 3.1415926-1.40.9 (Web2C 7.5.7)
 %&-line parsing enabled.
I can't find the format file `jadetex.fmt'!
make[5]: [Makefile:660: claws-mail-manual.ps] Error 9 (ignored)
make[5]: Leaving directory '/tmp/B.LM_jhl/BUILD/claws-mail-3.17.1/manual/fr/dist/ps'
Making all in txt
make[5]: Nothing to be done for 'all'.
make[5]: Nothing to be done for 'all-am'.
make[4]: Nothing to be done for 'all-am'.
make[3]: Nothing to be done for 'all-am'.
+ exit 0
Executing(%install): /bin/sh -e /tmp/B.LM_jhl/BUILD/tmp/rpm-tmp.94
TMP=/home/users/builder/tmp
HOME=/home/users/builder
PATH=/usr/local/bin:/usr/bin:/bin:/home/users/builder/bin
TMPDIR=/tmp/B.LM_jhl/BUILD/tmp
+ umask 022
+ cd /tmp/B.LM_jhl/BUILD
+ /bin/rm '--interactive=never' -rf /tmp/B.LM_jhl/BUILD/tmp/claws-mail-3.17.1-root-builder
+ /bin/mkdir -p /tmp/B.LM_jhl/BUILD/tmp/claws-mail-3.17.1-root-builder
+ cd claws-mail-3.17.1
+ rm -rf /tmp/B.LM_jhl/BUILD/tmp/claws-mail-3.17.1-root-builder
+ install -d /tmp/B.LM_jhl/BUILD/tmp/claws-mail-3.17.1-root-builder/usr/share/claws-mail/themes /tmp/B.LM_jhl/BUILD/tmp/claws-mail-3.17.1-root-builder/usr/share/applications /tmp/B.LM_jhl/BUILD/tmp/claws-mail-3.17.1-root-builder/usr/share/pixmaps
+ /usr/bin/make -Otarget -j9 install 'DESTDIR=/tmp/B.LM_jhl/BUILD/tmp/claws-mail-3.17.1-root-builder'
Making install in m4
make[2]: Nothing to be done for 'install-exec-am'.
make[2]: Nothing to be done for 'install-data-am'.
Making install in po
make[1]: Entering directory '/tmp/B.LM_jhl/BUILD/claws-mail-3.17.1/po'
installing ca.gmo as /tmp/B.LM_jhl/BUILD/tmp/claws-mail-3.17.1-root-builder/usr/share/locale/ca/LC_MESSAGES/claws-mail.mo
installing cs.gmo as /tmp/B.LM_jhl/BUILD/tmp/claws-mail-3.17.1-root-builder/usr/share/locale/cs/LC_MESSAGES/claws-mail.mo
installing da.gmo as /tmp/B.LM_jhl/BUILD/tmp/claws-mail-3.17.1-root-builder/usr/share/locale/da/LC_MESSAGES/claws-mail.mo
installing de.gmo as /tmp/B.LM_jhl/BUILD/tmp/claws-mail-3.17.1-root-builder/usr/share/locale/de/LC_MESSAGES/claws-mail.mo
installing en_GB.gmo as /tmp/B.LM_jhl/BUILD/tmp/claws-mail-3.17.1-root-builder/usr/share/locale/en_GB/LC_MESSAGES/claws-mail.mo
installing es.gmo as /tmp/B.LM_jhl/BUILD/tmp/claws-mail-3.17.1-root-builder/usr/share/locale/es/LC_MESSAGES/claws-mail.mo
installing fi.gmo as /tmp/B.LM_jhl/BUILD/tmp/claws-mail-3.17.1-root-builder/usr/share/locale/fi/LC_MESSAGES/claws-mail.mo
installing fr.gmo as /tmp/B.LM_jhl/BUILD/tmp/claws-mail-3.17.1-root-builder/usr/share/locale/fr/LC_MESSAGES/claws-mail.mo
installing hu.gmo as /tmp/B.LM_jhl/BUILD/tmp/claws-mail-3.17.1-root-builder/usr/share/locale/hu/LC_MESSAGES/claws-mail.mo
installing id_ID.gmo as /tmp/B.LM_jhl/BUILD/tmp/claws-mail-3.17.1-root-builder/usr/share/locale/id_ID/LC_MESSAGES/claws-mail.mo
installing it.gmo as /tmp/B.LM_jhl/BUILD/tmp/claws-mail-3.17.1-root-builder/usr/share/locale/it/LC_MESSAGES/claws-mail.mo
installing ja.gmo as /tmp/B.LM_jhl/BUILD/tmp/claws-mail-3.17.1-root-builder/usr/share/locale/ja/LC_MESSAGES/claws-mail.mo
installing nb.gmo as /tmp/B.LM_jhl/BUILD/tmp/claws-mail-3.17.1-root-builder/usr/share/locale/nb/LC_MESSAGES/claws-mail.mo
installing nl.gmo as /tmp/B.LM_jhl/BUILD/tmp/claws-mail-3.17.1-root-builder/usr/share/locale/nl/LC_MESSAGES/claws-mail.mo
installing pl.gmo as /tmp/B.LM_jhl/BUILD/tmp/claws-mail-3.17.1-root-builder/usr/share/locale/pl/LC_MESSAGES/claws-mail.mo
installing pt_BR.gmo as /tmp/B.LM_jhl/BUILD/tmp/claws-mail-3.17.1-root-builder/usr/share/locale/pt_BR/LC_MESSAGES/claws-mail.mo
installing ro.gmo as /tmp/B.LM_jhl/BUILD/tmp/claws-mail-3.17.1-root-builder/usr/share/locale/ro/LC_MESSAGES/claws-mail.mo
installing ru.gmo as /tmp/B.LM_jhl/BUILD/tmp/claws-mail-3.17.1-root-builder/usr/share/locale/ru/LC_MESSAGES/claws-mail.mo
installing sk.gmo as /tmp/B.LM_jhl/BUILD/tmp/claws-mail-3.17.1-root-builder/usr/share/locale/sk/LC_MESSAGES/claws-mail.mo
installing sv.gmo as /tmp/B.LM_jhl/BUILD/tmp/claws-mail-3.17.1-root-builder/usr/share/locale/sv/LC_MESSAGES/claws-mail.mo
installing tr.gmo as /tmp/B.LM_jhl/BUILD/tmp/claws-mail-3.17.1-root-builder/usr/share/locale/tr/LC_MESSAGES/claws-mail.mo
installing zh_TW.gmo as /tmp/B.LM_jhl/BUILD/tmp/claws-mail-3.17.1-root-builder/usr/share/locale/zh_TW/LC_MESSAGES/claws-mail.mo
make[1]: Leaving directory '/tmp/B.LM_jhl/BUILD/claws-mail-3.17.1/po'
make[1]: Entering directory '/tmp/B.LM_jhl/BUILD/claws-mail-3.17.1/po'
if test "claws-mail" = "gettext-tools"; then \
  /bin/mkdir -p /tmp/B.LM_jhl/BUILD/tmp/claws-mail-3.17.1-root-builder/usr/share/gettext/po; \
  for file in Makefile.in.in remove-potcdate.sin quot.sed boldquot.sed en@quot.header en@boldquot.header insert-header.sin Rules-quot   Makevars.template; do \
    /usr/bin/install -c -m 644 ./$file \
		    /tmp/B.LM_jhl/BUILD/tmp/claws-mail-3.17.1-root-builder/usr/share/gettext/po/$file; \
  done; \
  for file in Makevars; do \
    rm -f /tmp/B.LM_jhl/BUILD/tmp/claws-mail-3.17.1-root-builder/usr/share/gettext/po/$file; \
  done; \
else \
  : ; \
fi
make[1]: Leaving directory '/tmp/B.LM_jhl/BUILD/claws-mail-3.17.1/po'
Making install in src
/usr/bin/make  install-recursive
Making install in common
make[4]: Nothing to be done for 'install-exec-am'.
make[4]: Entering directory '/tmp/B.LM_jhl/BUILD/claws-mail-3.17.1/src/common'
 /bin/mkdir -p '/tmp/B.LM_jhl/BUILD/tmp/claws-mail-3.17.1-root-builder/usr/include/claws-mail/common'
 /usr/bin/install -c -m 644 defs.h hooks.h log.h md5.h mgutils.h passcrypt.h plugin.h prefs.h progressindicator.h proxy.h quoted-printable.h session.h smtp.h socket.h ssl_certificate.h ssl.h string_match.h stringtable.h claws.h tags.h template.h timing.h tlds.h utils.h uuencode.h version.h xml.h xmlprops.h pkcs5_pbkdf2.h '/tmp/B.LM_jhl/BUILD/tmp/claws-mail-3.17.1-root-builder/usr/include/claws-mail/common'
make[4]: Leaving directory '/tmp/B.LM_jhl/BUILD/claws-mail-3.17.1/src/common'
Making install in gtk
/usr/bin/make  install-am
make[5]: Nothing to be done for 'install-exec-am'.
make[5]: Entering directory '/tmp/B.LM_jhl/BUILD/claws-mail-3.17.1/src/gtk'
 /bin/mkdir -p '/tmp/B.LM_jhl/BUILD/tmp/claws-mail-3.17.1-root-builder/usr/include/claws-mail/gtk'
 /usr/bin/install -c -m 644 about.h authors.h colorlabel.h colorsel.h combobox.h description_window.h filesel.h foldersort.h gtkaspell.h gtkutils.h gtkunit.h gtkvscrollbutton.h headers.h icon_legend.h inputdialog.h logwindow.h manage_window.h menu.h pluginwindow.h prefswindow.h progressdialog.h quicksearch.h spell_entry.h sslcertwindow.h claws-marshal.h gtkcmctree.h gtkcmclist.h gtkcmoptionmenu.h gtksctree.h gtkshruler.h gdkkeysyms-new.h '/tmp/B.LM_jhl/BUILD/tmp/claws-mail-3.17.1-root-builder/usr/include/claws-mail/gtk'
make[5]: Leaving directory '/tmp/B.LM_jhl/BUILD/claws-mail-3.17.1/src/gtk'
Making install in etpan
make[4]: Nothing to be done for 'install-exec-am'.
make[4]: Entering directory '/tmp/B.LM_jhl/BUILD/claws-mail-3.17.1/src/etpan'
 /bin/mkdir -p '/tmp/B.LM_jhl/BUILD/tmp/claws-mail-3.17.1-root-builder/usr/include/claws-mail/etpan'
 /usr/bin/install -c -m 644 etpan-thread-manager-types.h etpan-thread-manager.h etpan-errors.h imap-thread.h nntp-thread.h etpan-ssl.h '/tmp/B.LM_jhl/BUILD/tmp/claws-mail-3.17.1-root-builder/usr/include/claws-mail/etpan'
make[4]: Leaving directory '/tmp/B.LM_jhl/BUILD/claws-mail-3.17.1/src/etpan'
Making install in .
make[4]: Entering directory '/tmp/B.LM_jhl/BUILD/claws-mail-3.17.1/src'
 /bin/mkdir -p '/tmp/B.LM_jhl/BUILD/tmp/claws-mail-3.17.1-root-builder/usr/include/claws-mail'
 /usr/bin/install -c -m 644 account.h action.h addrcache.h addr_compl.h addrdefs.h addressadd.h addritem.h addressitem.h addrgather.h addrharvest.h advsearch.h alertpanel.h autofaces.h avatars.h codeconv.h compose.h crash.h customheader.h displayheader.h edittags.h enriched.h entity.h export.h filtering.h folder.h folder_item_prefs.h foldersel.h folderutils.h folderview.h grouplistdialog.h headerview.h html.h image_viewer.h imap.h imap_gtk.h import.h inc.h localfolder.h main.h mainwindow.h '/tmp/B.LM_jhl/BUILD/tmp/claws-mail-3.17.1-root-builder/usr/include/claws-mail'
 /usr/bin/install -c -m 644 manual.h matcher.h matchertypes.h matcher_parser.h matcher_parser_lex.h matcher_parser_parse.h mbox.h message_search.h messageview.h mh.h mh_gtk.h mimeview.h msgcache.h news.h news_gtk.h noticeview.h partial_download.h password.h password_gtk.h passwordstore.h pop.h prefs_account.h prefs_actions.h prefs_common.h prefs_compose_writing.h prefs_customheader.h prefs_display_header.h prefs_ext_prog.h prefs_filtering_action.h prefs_filtering.h prefs_folder_item.h prefs_fonts.h prefs_gtk.h prefs_image_viewer.h prefs_logging.h prefs_matcher.h prefs_message.h prefs_migration.h prefs_msg_colors.h prefs_other.h '/tmp/B.LM_jhl/BUILD/tmp/claws-mail-3.17.1-root-builder/usr/include/claws-mail'
 /usr/bin/install -c -m 644 prefs_proxy.h prefs_quote.h prefs_receive.h prefs_send.h prefs_spelling.h prefs_summaries.h prefs_summary_column.h prefs_summary_open.h prefs_folder_column.h prefs_template.h prefs_themes.h prefs_toolbar.h prefs_wrapping.h printing.h privacy.h procheader.h procmime.h procmsg.h proctypes.h quote_fmt.h quote_fmt_lex.h quote_fmt_parse.h recv.h remotefolder.h send_message.h setup.h sourcewindow.h ssl_manager.h statusbar.h stock_pixmap.h summary_search.h summaryview.h textview.h toolbar.h undo.h unmime.h uri_opener.h viewtypes.h wizard.h addressbook-dbus.h '/tmp/B.LM_jhl/BUILD/tmp/claws-mail-3.17.1-root-builder/usr/include/claws-mail'
 /usr/bin/install -c -m 644 adbookbase.h addrbook.h addrclip.h addrcustomattr.h addressbook.h addressbook_foldersel.h addrindex.h addrquery.h addrselect.h addrduplicates.h addrmerge.h browseldap.h editaddress.h editaddress_other_attributes_ldap.h editbook.h editgroup.h editjpilot.h editldap_basedn.h editldap.h editvcard.h exphtmldlg.h expldifdlg.h exporthtml.h exportldif.h file_checker.h importldif.h importmutt.h importpine.h jpilot.h ldapctrl.h ldaplocate.h ldapquery.h ldapserver.h ldapupdate.h ldaputil.h ldif.h mutt.h pine.h vcard.h '/tmp/B.LM_jhl/BUILD/tmp/claws-mail-3.17.1-root-builder/usr/include/claws-mail'
make[4]: Leaving directory '/tmp/B.LM_jhl/BUILD/claws-mail-3.17.1/src'
make[4]: Entering directory '/tmp/B.LM_jhl/BUILD/claws-mail-3.17.1/src'
 /bin/mkdir -p '/tmp/B.LM_jhl/BUILD/tmp/claws-mail-3.17.1-root-builder/usr/bin'
  /bin/sh ../libtool   --mode=install /usr/bin/install -c claws-mail '/tmp/B.LM_jhl/BUILD/tmp/claws-mail-3.17.1-root-builder/usr/bin'
libtool: install: /usr/bin/install -c claws-mail /tmp/B.LM_jhl/BUILD/tmp/claws-mail-3.17.1-root-builder/usr/bin/claws-mail
make[4]: Leaving directory '/tmp/B.LM_jhl/BUILD/claws-mail-3.17.1/src'
/usr/bin/make  install-exec-hook
Making install in plugins
Making install in acpi_notifier
make[5]: Nothing to be done for 'install-exec-am'.
make[5]: Entering directory '/tmp/B.LM_jhl/BUILD/claws-mail-3.17.1/src/plugins/acpi_notifier'
 /bin/mkdir -p '/tmp/B.LM_jhl/BUILD/tmp/claws-mail-3.17.1-root-builder/usr/lib/claws-mail/plugins'
 /bin/sh ../../../libtool   --mode=install /usr/bin/install -c   acpi_notifier.la '/tmp/B.LM_jhl/BUILD/tmp/claws-mail-3.17.1-root-builder/usr/lib/claws-mail/plugins'
libtool: install: /usr/bin/install -c .libs/acpi_notifier.so /tmp/B.LM_jhl/BUILD/tmp/claws-mail-3.17.1-root-builder/usr/lib/claws-mail/plugins/acpi_notifier.so
libtool: install: /usr/bin/install -c .libs/acpi_notifier.lai /tmp/B.LM_jhl/BUILD/tmp/claws-mail-3.17.1-root-builder/usr/lib/claws-mail/plugins/acpi_notifier.la
libtool: warning: remember to run 'libtool --finish /usr/lib/claws-mail/plugins'
make[5]: Leaving directory '/tmp/B.LM_jhl/BUILD/claws-mail-3.17.1/src/plugins/acpi_notifier'
Making install in address_keeper
make[5]: Nothing to be done for 'install-exec-am'.
make[5]: Entering directory '/tmp/B.LM_jhl/BUILD/claws-mail-3.17.1/src/plugins/address_keeper'
 /bin/mkdir -p '/tmp/B.LM_jhl/BUILD/tmp/claws-mail-3.17.1-root-builder/usr/lib/claws-mail/plugins'
 /bin/sh ../../../libtool   --mode=install /usr/bin/install -c   address_keeper.la '/tmp/B.LM_jhl/BUILD/tmp/claws-mail-3.17.1-root-builder/usr/lib/claws-mail/plugins'
libtool: install: /usr/bin/install -c .libs/address_keeper.so /tmp/B.LM_jhl/BUILD/tmp/claws-mail-3.17.1-root-builder/usr/lib/claws-mail/plugins/address_keeper.so
libtool: install: /usr/bin/install -c .libs/address_keeper.lai /tmp/B.LM_jhl/BUILD/tmp/claws-mail-3.17.1-root-builder/usr/lib/claws-mail/plugins/address_keeper.la
libtool: warning: remember to run 'libtool --finish /usr/lib/claws-mail/plugins'
make[5]: Leaving directory '/tmp/B.LM_jhl/BUILD/claws-mail-3.17.1/src/plugins/address_keeper'
Making install in archive
make[5]: Nothing to be done for 'install-exec-am'.
make[5]: Entering directory '/tmp/B.LM_jhl/BUILD/claws-mail-3.17.1/src/plugins/archive'
 /bin/mkdir -p '/tmp/B.LM_jhl/BUILD/tmp/claws-mail-3.17.1-root-builder/usr/lib/claws-mail/plugins'
 /bin/sh ../../../libtool   --mode=install /usr/bin/install -c   archive.la '/tmp/B.LM_jhl/BUILD/tmp/claws-mail-3.17.1-root-builder/usr/lib/claws-mail/plugins'
libtool: install: /usr/bin/install -c .libs/archive.so /tmp/B.LM_jhl/BUILD/tmp/claws-mail-3.17.1-root-builder/usr/lib/claws-mail/plugins/archive.so
libtool: install: /usr/bin/install -c .libs/archive.lai /tmp/B.LM_jhl/BUILD/tmp/claws-mail-3.17.1-root-builder/usr/lib/claws-mail/plugins/archive.la
libtool: warning: remember to run 'libtool --finish /usr/lib/claws-mail/plugins'
make[5]: Leaving directory '/tmp/B.LM_jhl/BUILD/claws-mail-3.17.1/src/plugins/archive'
Making install in att_remover
make[5]: Nothing to be done for 'install-exec-am'.
make[5]: Entering directory '/tmp/B.LM_jhl/BUILD/claws-mail-3.17.1/src/plugins/att_remover'
 /bin/mkdir -p '/tmp/B.LM_jhl/BUILD/tmp/claws-mail-3.17.1-root-builder/usr/lib/claws-mail/plugins'
 /bin/sh ../../../libtool   --mode=install /usr/bin/install -c   att_remover.la '/tmp/B.LM_jhl/BUILD/tmp/claws-mail-3.17.1-root-builder/usr/lib/claws-mail/plugins'
libtool: install: /usr/bin/install -c .libs/att_remover.so /tmp/B.LM_jhl/BUILD/tmp/claws-mail-3.17.1-root-builder/usr/lib/claws-mail/plugins/att_remover.so
libtool: install: /usr/bin/install -c .libs/att_remover.lai /tmp/B.LM_jhl/BUILD/tmp/claws-mail-3.17.1-root-builder/usr/lib/claws-mail/plugins/att_remover.la
libtool: warning: remember to run 'libtool --finish /usr/lib/claws-mail/plugins'
make[5]: Leaving directory '/tmp/B.LM_jhl/BUILD/claws-mail-3.17.1/src/plugins/att_remover'
Making install in attachwarner
make[5]: Nothing to be done for 'install-exec-am'.
make[5]: Entering directory '/tmp/B.LM_jhl/BUILD/claws-mail-3.17.1/src/plugins/attachwarner'
 /bin/mkdir -p '/tmp/B.LM_jhl/BUILD/tmp/claws-mail-3.17.1-root-builder/usr/lib/claws-mail/plugins'
 /bin/sh ../../../libtool   --mode=install /usr/bin/install -c   attachwarner.la '/tmp/B.LM_jhl/BUILD/tmp/claws-mail-3.17.1-root-builder/usr/lib/claws-mail/plugins'
libtool: install: /usr/bin/install -c .libs/attachwarner.so /tmp/B.LM_jhl/BUILD/tmp/claws-mail-3.17.1-root-builder/usr/lib/claws-mail/plugins/attachwarner.so
libtool: install: /usr/bin/install -c .libs/attachwarner.lai /tmp/B.LM_jhl/BUILD/tmp/claws-mail-3.17.1-root-builder/usr/lib/claws-mail/plugins/attachwarner.la
libtool: warning: remember to run 'libtool --finish /usr/lib/claws-mail/plugins'
make[5]: Leaving directory '/tmp/B.LM_jhl/BUILD/claws-mail-3.17.1/src/plugins/attachwarner'
Making install in bogofilter
make[5]: Nothing to be done for 'install-exec-am'.
make[5]: Entering directory '/tmp/B.LM_jhl/BUILD/claws-mail-3.17.1/src/plugins/bogofilter'
 /bin/mkdir -p '/tmp/B.LM_jhl/BUILD/tmp/claws-mail-3.17.1-root-builder/usr/lib/claws-mail/plugins'
 /bin/sh ../../../libtool   --mode=install /usr/bin/install -c   bogofilter.la '/tmp/B.LM_jhl/BUILD/tmp/claws-mail-3.17.1-root-builder/usr/lib/claws-mail/plugins'
libtool: install: /usr/bin/install -c .libs/bogofilter.so /tmp/B.LM_jhl/BUILD/tmp/claws-mail-3.17.1-root-builder/usr/lib/claws-mail/plugins/bogofilter.so
libtool: install: /usr/bin/install -c .libs/bogofilter.lai /tmp/B.LM_jhl/BUILD/tmp/claws-mail-3.17.1-root-builder/usr/lib/claws-mail/plugins/bogofilter.la
libtool: warning: remember to run 'libtool --finish /usr/lib/claws-mail/plugins'
make[5]: Leaving directory '/tmp/B.LM_jhl/BUILD/claws-mail-3.17.1/src/plugins/bogofilter'
Making install in bsfilter
make[5]: Nothing to be done for 'install-exec-am'.
make[5]: Entering directory '/tmp/B.LM_jhl/BUILD/claws-mail-3.17.1/src/plugins/bsfilter'
 /bin/mkdir -p '/tmp/B.LM_jhl/BUILD/tmp/claws-mail-3.17.1-root-builder/usr/lib/claws-mail/plugins'
 /bin/sh ../../../libtool   --mode=install /usr/bin/install -c   bsfilter.la '/tmp/B.LM_jhl/BUILD/tmp/claws-mail-3.17.1-root-builder/usr/lib/claws-mail/plugins'
libtool: install: /usr/bin/install -c .libs/bsfilter.so /tmp/B.LM_jhl/BUILD/tmp/claws-mail-3.17.1-root-builder/usr/lib/claws-mail/plugins/bsfilter.so
libtool: install: /usr/bin/install -c .libs/bsfilter.lai /tmp/B.LM_jhl/BUILD/tmp/claws-mail-3.17.1-root-builder/usr/lib/claws-mail/plugins/bsfilter.la
libtool: warning: remember to run 'libtool --finish /usr/lib/claws-mail/plugins'
make[5]: Leaving directory '/tmp/B.LM_jhl/BUILD/claws-mail-3.17.1/src/plugins/bsfilter'
Making install in clamd
Making install in libclamd
make[6]: Nothing to be done for 'install-exec-am'.
make[6]: Nothing to be done for 'install-data-am'.
make[6]: Nothing to be done for 'install-exec-am'.
make[6]: Entering directory '/tmp/B.LM_jhl/BUILD/claws-mail-3.17.1/src/plugins/clamd'
 /bin/mkdir -p '/tmp/B.LM_jhl/BUILD/tmp/claws-mail-3.17.1-root-builder/usr/lib/claws-mail/plugins'
 /bin/sh ../../../libtool   --mode=install /usr/bin/install -c   clamd.la '/tmp/B.LM_jhl/BUILD/tmp/claws-mail-3.17.1-root-builder/usr/lib/claws-mail/plugins'
libtool: install: /usr/bin/install -c .libs/clamd.so /tmp/B.LM_jhl/BUILD/tmp/claws-mail-3.17.1-root-builder/usr/lib/claws-mail/plugins/clamd.so
libtool: install: /usr/bin/install -c .libs/clamd.lai /tmp/B.LM_jhl/BUILD/tmp/claws-mail-3.17.1-root-builder/usr/lib/claws-mail/plugins/clamd.la
libtool: warning: remember to run 'libtool --finish /usr/lib/claws-mail/plugins'
make[6]: Leaving directory '/tmp/B.LM_jhl/BUILD/claws-mail-3.17.1/src/plugins/clamd'
Making install in demo
make[5]: Nothing to be done for 'install-exec-am'.
Making install in dillo
make[5]: Nothing to be done for 'install-exec-am'.
make[5]: Entering directory '/tmp/B.LM_jhl/BUILD/claws-mail-3.17.1/src/plugins/dillo'
 /bin/mkdir -p '/tmp/B.LM_jhl/BUILD/tmp/claws-mail-3.17.1-root-builder/usr/lib/claws-mail/plugins'
 /bin/sh ../../../libtool   --mode=install /usr/bin/install -c   dillo.la '/tmp/B.LM_jhl/BUILD/tmp/claws-mail-3.17.1-root-builder/usr/lib/claws-mail/plugins'
libtool: install: /usr/bin/install -c .libs/dillo.so /tmp/B.LM_jhl/BUILD/tmp/claws-mail-3.17.1-root-builder/usr/lib/claws-mail/plugins/dillo.so
libtool: install: /usr/bin/install -c .libs/dillo.lai /tmp/B.LM_jhl/BUILD/tmp/claws-mail-3.17.1-root-builder/usr/lib/claws-mail/plugins/dillo.la
libtool: warning: remember to run 'libtool --finish /usr/lib/claws-mail/plugins'
make[5]: Leaving directory '/tmp/B.LM_jhl/BUILD/claws-mail-3.17.1/src/plugins/dillo'
Making install in fancy
make[5]: Nothing to be done for 'install-exec-am'.
make[5]: Entering directory '/tmp/B.LM_jhl/BUILD/claws-mail-3.17.1/src/plugins/fancy'
 /bin/mkdir -p '/tmp/B.LM_jhl/BUILD/tmp/claws-mail-3.17.1-root-builder/usr/lib/claws-mail/plugins'
 /bin/sh ../../../libtool   --mode=install /usr/bin/install -c   fancy.la '/tmp/B.LM_jhl/BUILD/tmp/claws-mail-3.17.1-root-builder/usr/lib/claws-mail/plugins'
libtool: install: /usr/bin/install -c .libs/fancy.so /tmp/B.LM_jhl/BUILD/tmp/claws-mail-3.17.1-root-builder/usr/lib/claws-mail/plugins/fancy.so
libtool: install: /usr/bin/install -c .libs/fancy.lai /tmp/B.LM_jhl/BUILD/tmp/claws-mail-3.17.1-root-builder/usr/lib/claws-mail/plugins/fancy.la
libtool: warning: remember to run 'libtool --finish /usr/lib/claws-mail/plugins'
make[5]: Leaving directory '/tmp/B.LM_jhl/BUILD/claws-mail-3.17.1/src/plugins/fancy'
Making install in fetchinfo
make[5]: Nothing to be done for 'install-exec-am'.
make[5]: Entering directory '/tmp/B.LM_jhl/BUILD/claws-mail-3.17.1/src/plugins/fetchinfo'
 /bin/mkdir -p '/tmp/B.LM_jhl/BUILD/tmp/claws-mail-3.17.1-root-builder/usr/lib/claws-mail/plugins'
 /bin/sh ../../../libtool   --mode=install /usr/bin/install -c   fetchinfo.la '/tmp/B.LM_jhl/BUILD/tmp/claws-mail-3.17.1-root-builder/usr/lib/claws-mail/plugins'
libtool: install: /usr/bin/install -c .libs/fetchinfo.so /tmp/B.LM_jhl/BUILD/tmp/claws-mail-3.17.1-root-builder/usr/lib/claws-mail/plugins/fetchinfo.so
libtool: install: /usr/bin/install -c .libs/fetchinfo.lai /tmp/B.LM_jhl/BUILD/tmp/claws-mail-3.17.1-root-builder/usr/lib/claws-mail/plugins/fetchinfo.la
libtool: warning: remember to run 'libtool --finish /usr/lib/claws-mail/plugins'
make[5]: Leaving directory '/tmp/B.LM_jhl/BUILD/claws-mail-3.17.1/src/plugins/fetchinfo'
Making install in gdata
make[5]: Nothing to be done for 'install-exec-am'.
make[5]: Entering directory '/tmp/B.LM_jhl/BUILD/claws-mail-3.17.1/src/plugins/gdata'
 /bin/mkdir -p '/tmp/B.LM_jhl/BUILD/tmp/claws-mail-3.17.1-root-builder/usr/lib/claws-mail/plugins'
 /bin/sh ../../../libtool   --mode=install /usr/bin/install -c   gdata.la '/tmp/B.LM_jhl/BUILD/tmp/claws-mail-3.17.1-root-builder/usr/lib/claws-mail/plugins'
libtool: install: /usr/bin/install -c .libs/gdata.so /tmp/B.LM_jhl/BUILD/tmp/claws-mail-3.17.1-root-builder/usr/lib/claws-mail/plugins/gdata.so
libtool: install: /usr/bin/install -c .libs/gdata.lai /tmp/B.LM_jhl/BUILD/tmp/claws-mail-3.17.1-root-builder/usr/lib/claws-mail/plugins/gdata.la
libtool: warning: remember to run 'libtool --finish /usr/lib/claws-mail/plugins'
make[5]: Leaving directory '/tmp/B.LM_jhl/BUILD/claws-mail-3.17.1/src/plugins/gdata'
Making install in libravatar
make[5]: Nothing to be done for 'install-exec-am'.
make[5]: Entering directory '/tmp/B.LM_jhl/BUILD/claws-mail-3.17.1/src/plugins/libravatar'
 /bin/mkdir -p '/tmp/B.LM_jhl/BUILD/tmp/claws-mail-3.17.1-root-builder/usr/lib/claws-mail/plugins'
 /bin/sh ../../../libtool   --mode=install /usr/bin/install -c   libravatar.la '/tmp/B.LM_jhl/BUILD/tmp/claws-mail-3.17.1-root-builder/usr/lib/claws-mail/plugins'
libtool: install: /usr/bin/install -c .libs/libravatar.so /tmp/B.LM_jhl/BUILD/tmp/claws-mail-3.17.1-root-builder/usr/lib/claws-mail/plugins/libravatar.so
libtool: install: /usr/bin/install -c .libs/libravatar.lai /tmp/B.LM_jhl/BUILD/tmp/claws-mail-3.17.1-root-builder/usr/lib/claws-mail/plugins/libravatar.la
libtool: warning: remember to run 'libtool --finish /usr/lib/claws-mail/plugins'
make[5]: Leaving directory '/tmp/B.LM_jhl/BUILD/claws-mail-3.17.1/src/plugins/libravatar'
Making install in mailmbox
make[5]: Nothing to be done for 'install-exec-am'.
make[5]: Entering directory '/tmp/B.LM_jhl/BUILD/claws-mail-3.17.1/src/plugins/mailmbox'
 /bin/mkdir -p '/tmp/B.LM_jhl/BUILD/tmp/claws-mail-3.17.1-root-builder/usr/lib/claws-mail/plugins'
 /bin/sh ../../../libtool   --mode=install /usr/bin/install -c   mailmbox.la '/tmp/B.LM_jhl/BUILD/tmp/claws-mail-3.17.1-root-builder/usr/lib/claws-mail/plugins'
libtool: install: /usr/bin/install -c .libs/mailmbox.so /tmp/B.LM_jhl/BUILD/tmp/claws-mail-3.17.1-root-builder/usr/lib/claws-mail/plugins/mailmbox.so
libtool: install: /usr/bin/install -c .libs/mailmbox.lai /tmp/B.LM_jhl/BUILD/tmp/claws-mail-3.17.1-root-builder/usr/lib/claws-mail/plugins/mailmbox.la
libtool: warning: remember to run 'libtool --finish /usr/lib/claws-mail/plugins'
make[5]: Leaving directory '/tmp/B.LM_jhl/BUILD/claws-mail-3.17.1/src/plugins/mailmbox'
Making install in managesieve
make[5]: Nothing to be done for 'install-exec-am'.
make[5]: Entering directory '/tmp/B.LM_jhl/BUILD/claws-mail-3.17.1/src/plugins/managesieve'
 /bin/mkdir -p '/tmp/B.LM_jhl/BUILD/tmp/claws-mail-3.17.1-root-builder/usr/lib/claws-mail/plugins'
 /bin/sh ../../../libtool   --mode=install /usr/bin/install -c   managesieve.la '/tmp/B.LM_jhl/BUILD/tmp/claws-mail-3.17.1-root-builder/usr/lib/claws-mail/plugins'
libtool: install: /usr/bin/install -c .libs/managesieve.so /tmp/B.LM_jhl/BUILD/tmp/claws-mail-3.17.1-root-builder/usr/lib/claws-mail/plugins/managesieve.so
libtool: install: /usr/bin/install -c .libs/managesieve.lai /tmp/B.LM_jhl/BUILD/tmp/claws-mail-3.17.1-root-builder/usr/lib/claws-mail/plugins/managesieve.la
libtool: warning: remember to run 'libtool --finish /usr/lib/claws-mail/plugins'
make[5]: Leaving directory '/tmp/B.LM_jhl/BUILD/claws-mail-3.17.1/src/plugins/managesieve'
Making install in newmail
make[5]: Nothing to be done for 'install-exec-am'.
make[5]: Entering directory '/tmp/B.LM_jhl/BUILD/claws-mail-3.17.1/src/plugins/newmail'
 /bin/mkdir -p '/tmp/B.LM_jhl/BUILD/tmp/claws-mail-3.17.1-root-builder/usr/lib/claws-mail/plugins'
 /bin/sh ../../../libtool   --mode=install /usr/bin/install -c   newmail.la '/tmp/B.LM_jhl/BUILD/tmp/claws-mail-3.17.1-root-builder/usr/lib/claws-mail/plugins'
libtool: install: /usr/bin/install -c .libs/newmail.so /tmp/B.LM_jhl/BUILD/tmp/claws-mail-3.17.1-root-builder/usr/lib/claws-mail/plugins/newmail.so
libtool: install: /usr/bin/install -c .libs/newmail.lai /tmp/B.LM_jhl/BUILD/tmp/claws-mail-3.17.1-root-builder/usr/lib/claws-mail/plugins/newmail.la
libtool: warning: remember to run 'libtool --finish /usr/lib/claws-mail/plugins'
make[5]: Leaving directory '/tmp/B.LM_jhl/BUILD/claws-mail-3.17.1/src/plugins/newmail'
Making install in notification
Making install in gtkhotkey
make[6]: Nothing to be done for 'install-exec-am'.
make[6]: Nothing to be done for 'install-data-am'.
make[6]: Nothing to be done for 'install-exec-am'.
make[6]: Entering directory '/tmp/B.LM_jhl/BUILD/claws-mail-3.17.1/src/plugins/notification'
 /bin/mkdir -p '/tmp/B.LM_jhl/BUILD/tmp/claws-mail-3.17.1-root-builder/usr/lib/claws-mail/plugins'
 /bin/sh ../../../libtool   --mode=install /usr/bin/install -c   notification.la '/tmp/B.LM_jhl/BUILD/tmp/claws-mail-3.17.1-root-builder/usr/lib/claws-mail/plugins'
libtool: install: /usr/bin/install -c .libs/notification.so /tmp/B.LM_jhl/BUILD/tmp/claws-mail-3.17.1-root-builder/usr/lib/claws-mail/plugins/notification.so
libtool: install: /usr/bin/install -c .libs/notification.lai /tmp/B.LM_jhl/BUILD/tmp/claws-mail-3.17.1-root-builder/usr/lib/claws-mail/plugins/notification.la
libtool: warning: remember to run 'libtool --finish /usr/lib/claws-mail/plugins'
make[6]: Leaving directory '/tmp/B.LM_jhl/BUILD/claws-mail-3.17.1/src/plugins/notification'
Making install in pdf_viewer
make[5]: Nothing to be done for 'install-exec-am'.
make[5]: Entering directory '/tmp/B.LM_jhl/BUILD/claws-mail-3.17.1/src/plugins/pdf_viewer'
 /bin/mkdir -p '/tmp/B.LM_jhl/BUILD/tmp/claws-mail-3.17.1-root-builder/usr/lib/claws-mail/plugins'
 /bin/sh ../../../libtool   --mode=install /usr/bin/install -c   pdf_viewer.la '/tmp/B.LM_jhl/BUILD/tmp/claws-mail-3.17.1-root-builder/usr/lib/claws-mail/plugins'
libtool: install: /usr/bin/install -c .libs/pdf_viewer.so /tmp/B.LM_jhl/BUILD/tmp/claws-mail-3.17.1-root-builder/usr/lib/claws-mail/plugins/pdf_viewer.so
libtool: install: /usr/bin/install -c .libs/pdf_viewer.lai /tmp/B.LM_jhl/BUILD/tmp/claws-mail-3.17.1-root-builder/usr/lib/claws-mail/plugins/pdf_viewer.la
libtool: warning: remember to run 'libtool --finish /usr/lib/claws-mail/plugins'
make[5]: Leaving directory '/tmp/B.LM_jhl/BUILD/claws-mail-3.17.1/src/plugins/pdf_viewer'
Making install in perl
Making install in tools
make[5]: Entering directory '/tmp/B.LM_jhl/BUILD/claws-mail-3.17.1/src/plugins/perl/tools'
for file in matcherrc2perlfilter.pl; do \
if [ ! -e ../../../../src/plugins/perl/tools/$file ]; then \
todir=../../../../src/plugins/perl/tools; \
dir=$(dirname $file); \
if [ ! $dir = . ]; then \
todir=$todir/$dir; \
fi; \
cp ../../../../src/plugins/perl/tools/$file $todir; \
fi; \
done;
chmod u+x matcherrc2perlfilter.pl
make[5]: Leaving directory '/tmp/B.LM_jhl/BUILD/claws-mail-3.17.1/src/plugins/perl/tools'
make[6]: Nothing to be done for 'install-exec-am'.
make[6]: Nothing to be done for 'install-data-am'.
make[6]: Nothing to be done for 'install-exec-am'.
make[6]: Entering directory '/tmp/B.LM_jhl/BUILD/claws-mail-3.17.1/src/plugins/perl'
 /bin/mkdir -p '/tmp/B.LM_jhl/BUILD/tmp/claws-mail-3.17.1-root-builder/usr/lib/claws-mail/plugins'
 /bin/sh ../../../libtool   --mode=install /usr/bin/install -c   perl.la '/tmp/B.LM_jhl/BUILD/tmp/claws-mail-3.17.1-root-builder/usr/lib/claws-mail/plugins'
libtool: install: /usr/bin/install -c .libs/perl.so /tmp/B.LM_jhl/BUILD/tmp/claws-mail-3.17.1-root-builder/usr/lib/claws-mail/plugins/perl.so
libtool: install: /usr/bin/install -c .libs/perl.lai /tmp/B.LM_jhl/BUILD/tmp/claws-mail-3.17.1-root-builder/usr/lib/claws-mail/plugins/perl.la
libtool: warning: remember to run 'libtool --finish /usr/lib/claws-mail/plugins'
make[6]: Leaving directory '/tmp/B.LM_jhl/BUILD/claws-mail-3.17.1/src/plugins/perl'
Making install in python
Making install in examples
make[6]: Nothing to be done for 'install-exec-am'.
make[6]: Nothing to be done for 'install-data-am'.
make[6]: Nothing to be done for 'install-exec-am'.
make[6]: Entering directory '/tmp/B.LM_jhl/BUILD/claws-mail-3.17.1/src/plugins/python'
 /bin/mkdir -p '/tmp/B.LM_jhl/BUILD/tmp/claws-mail-3.17.1-root-builder/usr/lib/claws-mail/plugins'
 /bin/sh ../../../libtool   --mode=install /usr/bin/install -c   python.la '/tmp/B.LM_jhl/BUILD/tmp/claws-mail-3.17.1-root-builder/usr/lib/claws-mail/plugins'
libtool: install: /usr/bin/install -c .libs/python.so /tmp/B.LM_jhl/BUILD/tmp/claws-mail-3.17.1-root-builder/usr/lib/claws-mail/plugins/python.so
libtool: install: /usr/bin/install -c .libs/python.lai /tmp/B.LM_jhl/BUILD/tmp/claws-mail-3.17.1-root-builder/usr/lib/claws-mail/plugins/python.la
libtool: warning: remember to run 'libtool --finish /usr/lib/claws-mail/plugins'
make[6]: Leaving directory '/tmp/B.LM_jhl/BUILD/claws-mail-3.17.1/src/plugins/python'
Making install in pgpcore
make[5]: Nothing to be done for 'install-exec-am'.
make[5]: Entering directory '/tmp/B.LM_jhl/BUILD/claws-mail-3.17.1/src/plugins/pgpcore'
 /bin/mkdir -p '/tmp/B.LM_jhl/BUILD/tmp/claws-mail-3.17.1-root-builder/usr/include/claws-mail/plugins/pgpcore'
 /usr/bin/install -c -m 644 passphrase.h prefs_gpg.h sgpgme.h pgp_utils.h '/tmp/B.LM_jhl/BUILD/tmp/claws-mail-3.17.1-root-builder/usr/include/claws-mail/plugins/pgpcore'
make[5]: Leaving directory '/tmp/B.LM_jhl/BUILD/claws-mail-3.17.1/src/plugins/pgpcore'
make[5]: Entering directory '/tmp/B.LM_jhl/BUILD/claws-mail-3.17.1/src/plugins/pgpcore'
 /bin/mkdir -p '/tmp/B.LM_jhl/BUILD/tmp/claws-mail-3.17.1-root-builder/usr/lib/claws-mail/plugins'
 /bin/sh ../../../libtool   --mode=install /usr/bin/install -c   pgpcore.la '/tmp/B.LM_jhl/BUILD/tmp/claws-mail-3.17.1-root-builder/usr/lib/claws-mail/plugins'
libtool: install: /usr/bin/install -c .libs/pgpcore.so /tmp/B.LM_jhl/BUILD/tmp/claws-mail-3.17.1-root-builder/usr/lib/claws-mail/plugins/pgpcore.so
libtool: install: /usr/bin/install -c .libs/pgpcore.lai /tmp/B.LM_jhl/BUILD/tmp/claws-mail-3.17.1-root-builder/usr/lib/claws-mail/plugins/pgpcore.la
libtool: warning: remember to run 'libtool --finish /usr/lib/claws-mail/plugins'
make[5]: Leaving directory '/tmp/B.LM_jhl/BUILD/claws-mail-3.17.1/src/plugins/pgpcore'
Making install in pgpmime
make[5]: Nothing to be done for 'install-exec-am'.
make[5]: Entering directory '/tmp/B.LM_jhl/BUILD/claws-mail-3.17.1/src/plugins/pgpmime'
 /bin/mkdir -p '/tmp/B.LM_jhl/BUILD/tmp/claws-mail-3.17.1-root-builder/usr/lib/claws-mail/plugins'
 /usr/bin/install -c -m 644 pgpmime.deps '/tmp/B.LM_jhl/BUILD/tmp/claws-mail-3.17.1-root-builder/usr/lib/claws-mail/plugins'
make[5]: Leaving directory '/tmp/B.LM_jhl/BUILD/claws-mail-3.17.1/src/plugins/pgpmime'
make[5]: Entering directory '/tmp/B.LM_jhl/BUILD/claws-mail-3.17.1/src/plugins/pgpmime'
 /bin/mkdir -p '/tmp/B.LM_jhl/BUILD/tmp/claws-mail-3.17.1-root-builder/usr/lib/claws-mail/plugins'
 /bin/sh ../../../libtool   --mode=install /usr/bin/install -c   pgpmime.la '/tmp/B.LM_jhl/BUILD/tmp/claws-mail-3.17.1-root-builder/usr/lib/claws-mail/plugins'
libtool: install: /usr/bin/install -c .libs/pgpmime.so /tmp/B.LM_jhl/BUILD/tmp/claws-mail-3.17.1-root-builder/usr/lib/claws-mail/plugins/pgpmime.so
libtool: install: /usr/bin/install -c .libs/pgpmime.lai /tmp/B.LM_jhl/BUILD/tmp/claws-mail-3.17.1-root-builder/usr/lib/claws-mail/plugins/pgpmime.la
libtool: warning: remember to run 'libtool --finish /usr/lib/claws-mail/plugins'
make[5]: Leaving directory '/tmp/B.LM_jhl/BUILD/claws-mail-3.17.1/src/plugins/pgpmime'
Making install in pgpinline
make[5]: Nothing to be done for 'install-exec-am'.
make[5]: Entering directory '/tmp/B.LM_jhl/BUILD/claws-mail-3.17.1/src/plugins/pgpinline'
 /bin/mkdir -p '/tmp/B.LM_jhl/BUILD/tmp/claws-mail-3.17.1-root-builder/usr/lib/claws-mail/plugins'
 /usr/bin/install -c -m 644 pgpinline.deps '/tmp/B.LM_jhl/BUILD/tmp/claws-mail-3.17.1-root-builder/usr/lib/claws-mail/plugins'
make[5]: Leaving directory '/tmp/B.LM_jhl/BUILD/claws-mail-3.17.1/src/plugins/pgpinline'
make[5]: Entering directory '/tmp/B.LM_jhl/BUILD/claws-mail-3.17.1/src/plugins/pgpinline'
 /bin/mkdir -p '/tmp/B.LM_jhl/BUILD/tmp/claws-mail-3.17.1-root-builder/usr/lib/claws-mail/plugins'
 /bin/sh ../../../libtool   --mode=install /usr/bin/install -c   pgpinline.la '/tmp/B.LM_jhl/BUILD/tmp/claws-mail-3.17.1-root-builder/usr/lib/claws-mail/plugins'
libtool: install: /usr/bin/install -c .libs/pgpinline.so /tmp/B.LM_jhl/BUILD/tmp/claws-mail-3.17.1-root-builder/usr/lib/claws-mail/plugins/pgpinline.so
libtool: install: /usr/bin/install -c .libs/pgpinline.lai /tmp/B.LM_jhl/BUILD/tmp/claws-mail-3.17.1-root-builder/usr/lib/claws-mail/plugins/pgpinline.la
libtool: warning: remember to run 'libtool --finish /usr/lib/claws-mail/plugins'
make[5]: Leaving directory '/tmp/B.LM_jhl/BUILD/claws-mail-3.17.1/src/plugins/pgpinline'
Making install in rssyl
Making install in libfeed
make[6]: Nothing to be done for 'install-exec-am'.
make[6]: Nothing to be done for 'install-data-am'.
make[6]: Nothing to be done for 'install-exec-am'.
make[6]: Entering directory '/tmp/B.LM_jhl/BUILD/claws-mail-3.17.1/src/plugins/rssyl'
 /bin/mkdir -p '/tmp/B.LM_jhl/BUILD/tmp/claws-mail-3.17.1-root-builder/usr/lib/claws-mail/plugins'
 /bin/sh ../../../libtool   --mode=install /usr/bin/install -c   rssyl.la '/tmp/B.LM_jhl/BUILD/tmp/claws-mail-3.17.1-root-builder/usr/lib/claws-mail/plugins'
libtool: install: /usr/bin/install -c .libs/rssyl.so /tmp/B.LM_jhl/BUILD/tmp/claws-mail-3.17.1-root-builder/usr/lib/claws-mail/plugins/rssyl.so
libtool: install: /usr/bin/install -c .libs/rssyl.lai /tmp/B.LM_jhl/BUILD/tmp/claws-mail-3.17.1-root-builder/usr/lib/claws-mail/plugins/rssyl.la
libtool: warning: remember to run 'libtool --finish /usr/lib/claws-mail/plugins'
make[6]: Leaving directory '/tmp/B.LM_jhl/BUILD/claws-mail-3.17.1/src/plugins/rssyl'
Making install in smime
make[5]: Nothing to be done for 'install-exec-am'.
make[5]: Entering directory '/tmp/B.LM_jhl/BUILD/claws-mail-3.17.1/src/plugins/smime'
 /bin/mkdir -p '/tmp/B.LM_jhl/BUILD/tmp/claws-mail-3.17.1-root-builder/usr/lib/claws-mail/plugins'
 /usr/bin/install -c -m 644 smime.deps '/tmp/B.LM_jhl/BUILD/tmp/claws-mail-3.17.1-root-builder/usr/lib/claws-mail/plugins'
make[5]: Leaving directory '/tmp/B.LM_jhl/BUILD/claws-mail-3.17.1/src/plugins/smime'
make[5]: Entering directory '/tmp/B.LM_jhl/BUILD/claws-mail-3.17.1/src/plugins/smime'
 /bin/mkdir -p '/tmp/B.LM_jhl/BUILD/tmp/claws-mail-3.17.1-root-builder/usr/lib/claws-mail/plugins'
 /bin/sh ../../../libtool   --mode=install /usr/bin/install -c   smime.la '/tmp/B.LM_jhl/BUILD/tmp/claws-mail-3.17.1-root-builder/usr/lib/claws-mail/plugins'
libtool: install: /usr/bin/install -c .libs/smime.so /tmp/B.LM_jhl/BUILD/tmp/claws-mail-3.17.1-root-builder/usr/lib/claws-mail/plugins/smime.so
libtool: install: /usr/bin/install -c .libs/smime.lai /tmp/B.LM_jhl/BUILD/tmp/claws-mail-3.17.1-root-builder/usr/lib/claws-mail/plugins/smime.la
libtool: warning: remember to run 'libtool --finish /usr/lib/claws-mail/plugins'
make[5]: Leaving directory '/tmp/B.LM_jhl/BUILD/claws-mail-3.17.1/src/plugins/smime'
Making install in spamassassin
make[5]: Nothing to be done for 'install-exec-am'.
make[5]: Entering directory '/tmp/B.LM_jhl/BUILD/claws-mail-3.17.1/src/plugins/spamassassin'
 /bin/mkdir -p '/tmp/B.LM_jhl/BUILD/tmp/claws-mail-3.17.1-root-builder/usr/lib/claws-mail/plugins'
 /bin/sh ../../../libtool   --mode=install /usr/bin/install -c   spamassassin.la '/tmp/B.LM_jhl/BUILD/tmp/claws-mail-3.17.1-root-builder/usr/lib/claws-mail/plugins'
libtool: install: /usr/bin/install -c .libs/spamassassin.so /tmp/B.LM_jhl/BUILD/tmp/claws-mail-3.17.1-root-builder/usr/lib/claws-mail/plugins/spamassassin.so
libtool: install: /usr/bin/install -c .libs/spamassassin.lai /tmp/B.LM_jhl/BUILD/tmp/claws-mail-3.17.1-root-builder/usr/lib/claws-mail/plugins/spamassassin.la
libtool: warning: remember to run 'libtool --finish /usr/lib/claws-mail/plugins'
make[5]: Leaving directory '/tmp/B.LM_jhl/BUILD/claws-mail-3.17.1/src/plugins/spamassassin'
Making install in spam_report
make[5]: Nothing to be done for 'install-exec-am'.
make[5]: Entering directory '/tmp/B.LM_jhl/BUILD/claws-mail-3.17.1/src/plugins/spam_report'
 /bin/mkdir -p '/tmp/B.LM_jhl/BUILD/tmp/claws-mail-3.17.1-root-builder/usr/lib/claws-mail/plugins'
 /bin/sh ../../../libtool   --mode=install /usr/bin/install -c   spamreport.la '/tmp/B.LM_jhl/BUILD/tmp/claws-mail-3.17.1-root-builder/usr/lib/claws-mail/plugins'
libtool: install: /usr/bin/install -c .libs/spamreport.so /tmp/B.LM_jhl/BUILD/tmp/claws-mail-3.17.1-root-builder/usr/lib/claws-mail/plugins/spamreport.so
libtool: install: /usr/bin/install -c .libs/spamreport.lai /tmp/B.LM_jhl/BUILD/tmp/claws-mail-3.17.1-root-builder/usr/lib/claws-mail/plugins/spamreport.la
libtool: warning: remember to run 'libtool --finish /usr/lib/claws-mail/plugins'
make[5]: Leaving directory '/tmp/B.LM_jhl/BUILD/claws-mail-3.17.1/src/plugins/spam_report'
Making install in tnef_parse
make[5]: Nothing to be done for 'install-exec-am'.
make[5]: Entering directory '/tmp/B.LM_jhl/BUILD/claws-mail-3.17.1/src/plugins/tnef_parse'
 /bin/mkdir -p '/tmp/B.LM_jhl/BUILD/tmp/claws-mail-3.17.1-root-builder/usr/lib/claws-mail/plugins'
 /bin/sh ../../../libtool   --mode=install /usr/bin/install -c   tnef_parse.la '/tmp/B.LM_jhl/BUILD/tmp/claws-mail-3.17.1-root-builder/usr/lib/claws-mail/plugins'
libtool: install: /usr/bin/install -c .libs/tnef_parse.so /tmp/B.LM_jhl/BUILD/tmp/claws-mail-3.17.1-root-builder/usr/lib/claws-mail/plugins/tnef_parse.so
libtool: install: /usr/bin/install -c .libs/tnef_parse.lai /tmp/B.LM_jhl/BUILD/tmp/claws-mail-3.17.1-root-builder/usr/lib/claws-mail/plugins/tnef_parse.la
libtool: warning: remember to run 'libtool --finish /usr/lib/claws-mail/plugins'
make[5]: Leaving directory '/tmp/B.LM_jhl/BUILD/claws-mail-3.17.1/src/plugins/tnef_parse'
Making install in vcalendar
make[5]: Nothing to be done for 'install-exec-am'.
make[5]: Entering directory '/tmp/B.LM_jhl/BUILD/claws-mail-3.17.1/src/plugins/vcalendar'
 /bin/mkdir -p '/tmp/B.LM_jhl/BUILD/tmp/claws-mail-3.17.1-root-builder/usr/lib/claws-mail/plugins'
 /bin/sh ../../../libtool   --mode=install /usr/bin/install -c   vcalendar.la '/tmp/B.LM_jhl/BUILD/tmp/claws-mail-3.17.1-root-builder/usr/lib/claws-mail/plugins'
libtool: install: /usr/bin/install -c .libs/vcalendar.so /tmp/B.LM_jhl/BUILD/tmp/claws-mail-3.17.1-root-builder/usr/lib/claws-mail/plugins/vcalendar.so
libtool: install: /usr/bin/install -c .libs/vcalendar.lai /tmp/B.LM_jhl/BUILD/tmp/claws-mail-3.17.1-root-builder/usr/lib/claws-mail/plugins/vcalendar.la
libtool: warning: remember to run 'libtool --finish /usr/lib/claws-mail/plugins'
make[5]: Leaving directory '/tmp/B.LM_jhl/BUILD/claws-mail-3.17.1/src/plugins/vcalendar'
make[5]: Nothing to be done for 'install-exec-am'.
make[5]: Nothing to be done for 'install-data-am'.
Making install in tools
make[1]: Entering directory '/tmp/B.LM_jhl/BUILD/claws-mail-3.17.1/tools'
if [ ! -d kdeservicemenu -a ! -e kdeservicemenu ]; then \
mkdir kdeservicemenu; \
fi; \
for file in OOo2claws-mail.pl acroread2claws-mail.pl calypso_convert.pl claws-mail-compose-insert-files.pl cm-reparent.pl convert_mbox.pl csv2addressbook.pl eud2gc.py filter_conv.pl filter_conv_new.pl fix_date.sh gif2xface.pl google_msgid.pl google_search.pl kmail2claws-mail.pl kmail2claws-mail_v2.pl kmail-mailbox2claws-mail.pl mairix.sh mew2claws-mail.pl multiwebsearch.pl nautilus2claws-mail.sh outlook2claws-mail.pl popfile-link.sh tb2claws-mail tbird2claws.py textviewer.pl textviewer.sh thunderbird-filters-convertor.pl update-po uudec uuooffice vcard2xml.py kdeservicemenu/install.sh kdeservicemenu/claws-mail-kdeservicemenu.pl; do \
if [ ! -e ../tools/$file ]; then \
todir=../tools; \
dir=$(dirname $file); \
if [ ! $dir = . ]; then \
todir=$todir/$dir; \
fi; \
cp ../tools/$file $todir; \
fi; \
done;
chmod u+x OOo2claws-mail.pl acroread2claws-mail.pl calypso_convert.pl claws-mail-compose-insert-files.pl cm-reparent.pl convert_mbox.pl csv2addressbook.pl eud2gc.py filter_conv.pl filter_conv_new.pl fix_date.sh gif2xface.pl google_msgid.pl google_search.pl kmail2claws-mail.pl kmail2claws-mail_v2.pl kmail-mailbox2claws-mail.pl mairix.sh mew2claws-mail.pl multiwebsearch.pl nautilus2claws-mail.sh outlook2claws-mail.pl popfile-link.sh tb2claws-mail tbird2claws.py textviewer.pl textviewer.sh thunderbird-filters-convertor.pl update-po uudec uuooffice vcard2xml.py kdeservicemenu/install.sh kdeservicemenu/claws-mail-kdeservicemenu.pl
make[1]: Leaving directory '/tmp/B.LM_jhl/BUILD/claws-mail-3.17.1/tools'
make[2]: Nothing to be done for 'install-exec-am'.
make[2]: Nothing to be done for 'install-data-am'.
Making install in config
make[2]: Nothing to be done for 'install-exec-am'.
make[2]: Nothing to be done for 'install-data-am'.
Making install in doc
Making install in man
make[3]: Nothing to be done for 'install-exec-am'.
make[3]: Entering directory '/tmp/B.LM_jhl/BUILD/claws-mail-3.17.1/doc/man'
 /bin/mkdir -p '/tmp/B.LM_jhl/BUILD/tmp/claws-mail-3.17.1-root-builder/usr/share/man/man1'
 /usr/bin/install -c -m 644 claws-mail.1 '/tmp/B.LM_jhl/BUILD/tmp/claws-mail-3.17.1-root-builder/usr/share/man/man1'
make[3]: Leaving directory '/tmp/B.LM_jhl/BUILD/claws-mail-3.17.1/doc/man'
make[3]: Nothing to be done for 'install-exec-am'.
make[3]: Nothing to be done for 'install-data-am'.
Making install in manual
Making install in dtd
make[3]: Nothing to be done for 'install-exec-am'.
make[3]: Nothing to be done for 'install-data-am'.
Making install in dist
Making install in html
make[4]: Nothing to be done for 'install-exec-am'.
make[4]: Entering directory '/tmp/B.LM_jhl/BUILD/claws-mail-3.17.1/manual/dist/html'
 /bin/mkdir -p '/tmp/B.LM_jhl/BUILD/tmp/claws-mail-3.17.1-root-builder/usr/share/doc/claws-mail/manual/en'
 /usr/bin/install -c -m 644 claws-mail-manual.html '/tmp/B.LM_jhl/BUILD/tmp/claws-mail-3.17.1-root-builder/usr/share/doc/claws-mail/manual/en'
make[4]: Leaving directory '/tmp/B.LM_jhl/BUILD/claws-mail-3.17.1/manual/dist/html'
Making install in pdf
make[3]: Entering directory '/tmp/B.LM_jhl/BUILD/claws-mail-3.17.1/manual/dist/pdf'
docbook2pdf -o . ../../claws-mail-manual.xml
Using catalogs: /etc/sgml/catalog
Using stylesheet: /usr/share/sgml/docbook/utils-0.6.14/docbook-utils.dsl#print
Working on: /tmp/B.LM_jhl/BUILD/claws-mail-3.17.1/manual/dist/pdf/../../claws-mail-manual.xml

kpathsea: Running mktexfmt pdfjadetex.fmt
fmtutil: running `pdftex -ini   -jobname=pdfjadetex -progname=pdfjadetex &pdflatex pdfjadetex.ini' ...
This is pdfTeXk, Version 3.1415926-1.40.9 (Web2C 7.5.7) (INITEX)
 %&-line parsing enabled.
entering extended mode
(/usr/share/texmf-dist/tex/jadetex/config/pdfjadetex.ini
LaTeX2e <2005/12/01>
Babel <v3.8l> and hyphenation patterns for english, usenglishmax, dumylang, noh
yphenation, german-x-2008-06-18, ngerman-x-2008-06-18, ancientgreek, ibycus, ar
abic, basque, bulgarian, catalan, pinyin, coptic, croatian, czech, danish, dutc
h, esperanto, estonian, farsi, finnish, french, galician, german, ngerman, mono
greek, greek, hungarian, icelandic, indonesian, interlingua, irish, italian, la
tin, mongolian, mongolian2a, bokmal, nynorsk, polish, portuguese, romanian, rus
sian, sanskrit, serbian, slovak, slovenian, spanish, swedish, turkish, ukenglis
h, ukrainian, uppersorbian, welsh, loaded.
(/usr/share/texmf/tex/generic/config/pdftexconfig.tex)
(/usr/share/texmf-dist/tex/jadetex/base/jadetex.ltx
(/usr/share/texmf-dist/tex/latex/base/minimal.cls
Document Class: minimal 2001/05/25 Standard LaTeX minimal class
) (/usr/share/texmf-dist/tex/latex/tools/array.sty)
(/usr/share/texmf-dist/tex/latex/tools/longtable.sty)
(/usr/share/texmf-dist/tex/latex/graphics/color.sty
(/usr/share/texmf/tex/latex/config/color.cfg)
(/usr/share/texmf-dist/tex/latex/pdftex-def/pdftex.def))
(/usr/share/texmf-dist/tex/latex/colortbl/colortbl.sty)
(/usr/share/texmf-dist/tex/latex/marvosym/marvosym.sty)
(/usr/share/texmf-dist/tex/latex/graphics/graphicx.sty
(/usr/share/texmf-dist/tex/latex/graphics/keyval.sty)
(/usr/share/texmf-dist/tex/latex/graphics/graphics.sty
(/usr/share/texmf-dist/tex/fontinst/base/trig.sty)
(/usr/share/texmf/tex/latex/config/graphics.cfg)))
(/usr/share/texmf-dist/tex/latex/tools/multicol.sty)
(/usr/share/texmf-dist/tex/latex/ltxmisc/ulem.sty)
(/usr/share/texmf-dist/tex/latex/fancyhdr/fancyhdr.sty)
(/usr/share/texmf-dist/tex/latex/hyperref/hyperref.sty
(/usr/share/texmf-dist/tex/generic/oberdiek/ifpdf.sty)
(/usr/share/texmf-dist/tex/generic/oberdiek/ifvtex.sty)
(/usr/share/texmf-dist/tex/generic/ifxetex/ifxetex.sty)
(/usr/share/texmf-dist/tex/latex/oberdiek/hycolor.sty
(/usr/share/texmf-dist/tex/latex/oberdiek/xcolor-patch.sty))
(/usr/share/texmf-dist/tex/latex/hyperref/pd1enc.def)
(/usr/share/texmf-dist/tex/generic/oberdiek/etexcmds.sty
(/usr/share/texmf-dist/tex/generic/oberdiek/infwarerr.sty))

Package hyperref Warning: Height of page (\paperheight) is invalid (0.0pt),
(hyperref)                using 11in.

(/usr/share/texmf/tex/latex/config/hyperref.cfg)
(/usr/share/texmf-dist/tex/latex/oberdiek/kvoptions.sty)
Implicit mode ON; LaTeX internals redefined
(/usr/share/texmf/tex/latex/latex2html/url.sty)
(/usr/share/texmf-dist/tex/generic/oberdiek/bitset.sty
(/usr/share/texmf-dist/tex/generic/oberdiek/intcalc.sty)
(/usr/share/texmf-dist/tex/generic/oberdiek/bigintcalc.sty
(/usr/share/texmf-dist/tex/generic/oberdiek/pdftexcmds.sty)))
(/usr/share/texmf-dist/tex/generic/oberdiek/kvsetkeys.sty)
(/usr/share/texmf-dist/tex/generic/oberdiek/atbegshi.sty))
*hyperref using default driver hpdftex*
(/usr/share/texmf-dist/tex/latex/hyperref/hpdftex.def)
(/usr/share/texmf-dist/tex/latex/base/inputenc.sty
(/usr/share/texmf-dist/tex/jadetex/base/dsssl.def))
(/usr/share/texmf-dist/tex/xmltex/passivetex/mlnames.sty)
(/usr/share/texmf-dist/tex/xmltex/passivetex/unicode.sty
(/usr/share/texmf-dist/tex/latex/base/fontenc.sty
(/usr/share/texmf-dist/tex/latex/tipa/t3enc.def)
(/usr/share/texmf-dist/tex/latex/base/t1enc.def))
(/usr/share/texmf-dist/tex/latex/tipa/tipa.sty)
(/usr/share/texmf-dist/tex/latex/tipa/tone.sty)
(/usr/share/texmf-dist/tex/latex/amsfonts/amssymb.sty
(/usr/share/texmf-dist/tex/latex/amsfonts/amsfonts.sty))
(/usr/share/texmf-dist/tex/latex/tools/bm.sty)
(/usr/share/texmf-dist/tex/latex/base/textcomp.sty
(/usr/share/texmf-dist/tex/latex/base/ts1enc.def))
(/usr/share/texmf-dist/tex/latex/psnfss/pifont.sty
(/usr/share/texmf-dist/tex/latex/psnfss/upzd.fd)
(/usr/share/texmf-dist/tex/latex/psnfss/upsy.fd))
(/usr/share/texmf-dist/tex/latex/wasysym/wasysym.sty)
(/usr/share/texmf-dist/tex/latex/stmaryrd/stmaryrd.sty)
WARNING: Elsevier font setup not found
(/usr/share/texmf-dist/tex/xmltex/passivetex/dummyels.sty)
WARNING: mmasym package not loaded. some symbols will fail
(/usr/share/texmf-dist/tex/latex/amsfonts/eucal.sty))
(/usr/share/texmf-dist/tex/xmltex/passivetex/ucharacters.sty)
(/usr/share/texmf-dist/tex/jadetex/base/uentities.sty)) )
Beginning to dump on file pdfjadetex.fmt
 (format=pdfjadetex 2018.9.2)
18234 strings of total length 227740
183976 memory locations dumped; current usage is 175&183185
15278 multiletter control sequences
\font\nullfont=nullfont
\font\OMX/cmex/m/n/10=cmex10
\font\tenln=line10
\font\tenlnw=linew10
\font\tencirc=lcircle10
\font\tencircw=lcirclew10
\font\OT1/cmr/m/n/5=cmr5
\font\OT1/cmr/m/n/7=cmr7
\font\OT1/cmr/m/n/10=cmr10
\font\OML/cmm/m/it/5=cmmi5
\font\OML/cmm/m/it/7=cmmi7
\font\OML/cmm/m/it/10=cmmi10
\font\OMS/cmsy/m/n/5=cmsy5
\font\OMS/cmsy/m/n/7=cmsy7
\font\OMS/cmsy/m/n/10=cmsy10
\font\sixly=lasy6
\font\OT1/cmr/m/sl/10=cmsl10
\font\OT1/cmr/m/it/10=cmti10
\font\OT1/cmr/bx/n/10=cmbx10
\font\OT1/cmss/m/n/10=cmss10
\font\T1/cmr/m/n/10=ecrm1000
\font\U/pzd/m/n/10=pzdr
\font\U/psy/m/n/10=psyr
6504 words of font info for 22 preloaded fonts
714 hyphenation exceptions
Hyphenation trie of length 218991 has 7024 ops out of 35111
  143 for language 53
  110 for language 52
  138 for language 51
  224 for language 50
  12 for language 49
  127 for language 48
  158 for language 47
  71 for language 46
  248 for language 45
  66 for language 44
  119 for language 42
  58 for language 41
  7 for language 40
  194 for language 39
  815 for language 38
  815 for language 37
  38 for language 36
  21 for language 35
  25 for language 34
  36 for language 33
  229 for language 32
  38 for language 31
  21 for language 30
  147 for language 29
  117 for language 28
  50 for language 27
  18 for language 26
  235 for language 25
  207 for language 24
  75 for language 23
  88 for language 22
  31 for language 21
  113 for language 19
  145 for language 18
  265 for language 17
  60 for language 16
  63 for language 15
  19 for language 14
  14 for language 13
  2 for language 12
  21 for language 11
  12 for language 10
  5 for language 9
  148 for language 7
  97 for language 6
  411 for language 5
  408 for language 4
  2 for language 2
  377 for language 1
  181 for language 0
16 words of pdfTeX memory
4 indirect objects
No pages of output.
Transcript written on pdfjadetex.log.
mv: cannot move 'pdfjadetex.log' to '/var/lib/texmf/web2c/pdftex/pdfjadetex.log': Permission denied
mv: cannot move 'pdfjadetex.fmt' to '/var/lib/texmf/web2c/pdftex/pdfjadetex.fmt': Permission denied
This is pdfTeXk, Version 3.1415926-1.40.9 (Web2C 7.5.7)
 %&-line parsing enabled.
I can't find the format file `pdfjadetex.fmt'!
make[3]: [Makefile:660: claws-mail-manual.pdf] Error 9 (ignored)
make[3]: Leaving directory '/tmp/B.LM_jhl/BUILD/claws-mail-3.17.1/manual/dist/pdf'
make[4]: Nothing to be done for 'install-exec-am'.
make[4]: Entering directory '/tmp/B.LM_jhl/BUILD/claws-mail-3.17.1/manual/dist/pdf'
docbook2pdf -o . ../../claws-mail-manual.xml
Using catalogs: /etc/sgml/catalog
Using stylesheet: /usr/share/sgml/docbook/utils-0.6.14/docbook-utils.dsl#print
Working on: /tmp/B.LM_jhl/BUILD/claws-mail-3.17.1/manual/dist/pdf/../../claws-mail-manual.xml

kpathsea: Running mktexfmt pdfjadetex.fmt
fmtutil: running `pdftex -ini   -jobname=pdfjadetex -progname=pdfjadetex &pdflatex pdfjadetex.ini' ...
This is pdfTeXk, Version 3.1415926-1.40.9 (Web2C 7.5.7) (INITEX)
 %&-line parsing enabled.
entering extended mode
(/usr/share/texmf-dist/tex/jadetex/config/pdfjadetex.ini
LaTeX2e <2005/12/01>
Babel <v3.8l> and hyphenation patterns for english, usenglishmax, dumylang, noh
yphenation, german-x-2008-06-18, ngerman-x-2008-06-18, ancientgreek, ibycus, ar
abic, basque, bulgarian, catalan, pinyin, coptic, croatian, czech, danish, dutc
h, esperanto, estonian, farsi, finnish, french, galician, german, ngerman, mono
greek, greek, hungarian, icelandic, indonesian, interlingua, irish, italian, la
tin, mongolian, mongolian2a, bokmal, nynorsk, polish, portuguese, romanian, rus
sian, sanskrit, serbian, slovak, slovenian, spanish, swedish, turkish, ukenglis
h, ukrainian, uppersorbian, welsh, loaded.
(/usr/share/texmf/tex/generic/config/pdftexconfig.tex)
(/usr/share/texmf-dist/tex/jadetex/base/jadetex.ltx
(/usr/share/texmf-dist/tex/latex/base/minimal.cls
Document Class: minimal 2001/05/25 Standard LaTeX minimal class
) (/usr/share/texmf-dist/tex/latex/tools/array.sty)
(/usr/share/texmf-dist/tex/latex/tools/longtable.sty)
(/usr/share/texmf-dist/tex/latex/graphics/color.sty
(/usr/share/texmf/tex/latex/config/color.cfg)
(/usr/share/texmf-dist/tex/latex/pdftex-def/pdftex.def))
(/usr/share/texmf-dist/tex/latex/colortbl/colortbl.sty)
(/usr/share/texmf-dist/tex/latex/marvosym/marvosym.sty)
(/usr/share/texmf-dist/tex/latex/graphics/graphicx.sty
(/usr/share/texmf-dist/tex/latex/graphics/keyval.sty)
(/usr/share/texmf-dist/tex/latex/graphics/graphics.sty
(/usr/share/texmf-dist/tex/fontinst/base/trig.sty)
(/usr/share/texmf/tex/latex/config/graphics.cfg)))
(/usr/share/texmf-dist/tex/latex/tools/multicol.sty)
(/usr/share/texmf-dist/tex/latex/ltxmisc/ulem.sty)
(/usr/share/texmf-dist/tex/latex/fancyhdr/fancyhdr.sty)
(/usr/share/texmf-dist/tex/latex/hyperref/hyperref.sty
(/usr/share/texmf-dist/tex/generic/oberdiek/ifpdf.sty)
(/usr/share/texmf-dist/tex/generic/oberdiek/ifvtex.sty)
(/usr/share/texmf-dist/tex/generic/ifxetex/ifxetex.sty)
(/usr/share/texmf-dist/tex/latex/oberdiek/hycolor.sty
(/usr/share/texmf-dist/tex/latex/oberdiek/xcolor-patch.sty))
(/usr/share/texmf-dist/tex/latex/hyperref/pd1enc.def)
(/usr/share/texmf-dist/tex/generic/oberdiek/etexcmds.sty
(/usr/share/texmf-dist/tex/generic/oberdiek/infwarerr.sty))

Package hyperref Warning: Height of page (\paperheight) is invalid (0.0pt),
(hyperref)                using 11in.

(/usr/share/texmf/tex/latex/config/hyperref.cfg)
(/usr/share/texmf-dist/tex/latex/oberdiek/kvoptions.sty)
Implicit mode ON; LaTeX internals redefined
(/usr/share/texmf/tex/latex/latex2html/url.sty)
(/usr/share/texmf-dist/tex/generic/oberdiek/bitset.sty
(/usr/share/texmf-dist/tex/generic/oberdiek/intcalc.sty)
(/usr/share/texmf-dist/tex/generic/oberdiek/bigintcalc.sty
(/usr/share/texmf-dist/tex/generic/oberdiek/pdftexcmds.sty)))
(/usr/share/texmf-dist/tex/generic/oberdiek/kvsetkeys.sty)
(/usr/share/texmf-dist/tex/generic/oberdiek/atbegshi.sty))
*hyperref using default driver hpdftex*
(/usr/share/texmf-dist/tex/latex/hyperref/hpdftex.def)
(/usr/share/texmf-dist/tex/latex/base/inputenc.sty
(/usr/share/texmf-dist/tex/jadetex/base/dsssl.def))
(/usr/share/texmf-dist/tex/xmltex/passivetex/mlnames.sty)
(/usr/share/texmf-dist/tex/xmltex/passivetex/unicode.sty
(/usr/share/texmf-dist/tex/latex/base/fontenc.sty
(/usr/share/texmf-dist/tex/latex/tipa/t3enc.def)
(/usr/share/texmf-dist/tex/latex/base/t1enc.def))
(/usr/share/texmf-dist/tex/latex/tipa/tipa.sty)
(/usr/share/texmf-dist/tex/latex/tipa/tone.sty)
(/usr/share/texmf-dist/tex/latex/amsfonts/amssymb.sty
(/usr/share/texmf-dist/tex/latex/amsfonts/amsfonts.sty))
(/usr/share/texmf-dist/tex/latex/tools/bm.sty)
(/usr/share/texmf-dist/tex/latex/base/textcomp.sty
(/usr/share/texmf-dist/tex/latex/base/ts1enc.def))
(/usr/share/texmf-dist/tex/latex/psnfss/pifont.sty
(/usr/share/texmf-dist/tex/latex/psnfss/upzd.fd)
(/usr/share/texmf-dist/tex/latex/psnfss/upsy.fd))
(/usr/share/texmf-dist/tex/latex/wasysym/wasysym.sty)
(/usr/share/texmf-dist/tex/latex/stmaryrd/stmaryrd.sty)
WARNING: Elsevier font setup not found
(/usr/share/texmf-dist/tex/xmltex/passivetex/dummyels.sty)
WARNING: mmasym package not loaded. some symbols will fail
(/usr/share/texmf-dist/tex/latex/amsfonts/eucal.sty))
(/usr/share/texmf-dist/tex/xmltex/passivetex/ucharacters.sty)
(/usr/share/texmf-dist/tex/jadetex/base/uentities.sty)) )
Beginning to dump on file pdfjadetex.fmt
 (format=pdfjadetex 2018.9.2)
18234 strings of total length 227740
183976 memory locations dumped; current usage is 175&183185
15278 multiletter control sequences
\font\nullfont=nullfont
\font\OMX/cmex/m/n/10=cmex10
\font\tenln=line10
\font\tenlnw=linew10
\font\tencirc=lcircle10
\font\tencircw=lcirclew10
\font\OT1/cmr/m/n/5=cmr5
\font\OT1/cmr/m/n/7=cmr7
\font\OT1/cmr/m/n/10=cmr10
\font\OML/cmm/m/it/5=cmmi5
\font\OML/cmm/m/it/7=cmmi7
\font\OML/cmm/m/it/10=cmmi10
\font\OMS/cmsy/m/n/5=cmsy5
\font\OMS/cmsy/m/n/7=cmsy7
\font\OMS/cmsy/m/n/10=cmsy10
\font\sixly=lasy6
\font\OT1/cmr/m/sl/10=cmsl10
\font\OT1/cmr/m/it/10=cmti10
\font\OT1/cmr/bx/n/10=cmbx10
\font\OT1/cmss/m/n/10=cmss10
\font\T1/cmr/m/n/10=ecrm1000
\font\U/pzd/m/n/10=pzdr
\font\U/psy/m/n/10=psyr
6504 words of font info for 22 preloaded fonts
714 hyphenation exceptions
Hyphenation trie of length 218991 has 7024 ops out of 35111
  143 for language 53
  110 for language 52
  138 for language 51
  224 for language 50
  12 for language 49
  127 for language 48
  158 for language 47
  71 for language 46
  248 for language 45
  66 for language 44
  119 for language 42
  58 for language 41
  7 for language 40
  194 for language 39
  815 for language 38
  815 for language 37
  38 for language 36
  21 for language 35
  25 for language 34
  36 for language 33
  229 for language 32
  38 for language 31
  21 for language 30
  147 for language 29
  117 for language 28
  50 for language 27
  18 for language 26
  235 for language 25
  207 for language 24
  75 for language 23
  88 for language 22
  31 for language 21
  113 for language 19
  145 for language 18
  265 for language 17
  60 for language 16
  63 for language 15
  19 for language 14
  14 for language 13
  2 for language 12
  21 for language 11
  12 for language 10
  5 for language 9
  148 for language 7
  97 for language 6
  411 for language 5
  408 for language 4
  2 for language 2
  377 for language 1
  181 for language 0
16 words of pdfTeX memory
4 indirect objects
No pages of output.
Transcript written on pdfjadetex.log.
mv: cannot move 'pdfjadetex.log' to '/var/lib/texmf/web2c/pdftex/pdfjadetex.log': Permission denied
mv: cannot move 'pdfjadetex.fmt' to '/var/lib/texmf/web2c/pdftex/pdfjadetex.fmt': Permission denied
This is pdfTeXk, Version 3.1415926-1.40.9 (Web2C 7.5.7)
 %&-line parsing enabled.
I can't find the format file `pdfjadetex.fmt'!
make[4]: [Makefile:660: claws-mail-manual.pdf] Error 9 (ignored)
make[4]: Leaving directory '/tmp/B.LM_jhl/BUILD/claws-mail-3.17.1/manual/dist/pdf'
make[4]: Entering directory '/tmp/B.LM_jhl/BUILD/claws-mail-3.17.1/manual/dist/pdf'
 /bin/mkdir -p '/tmp/B.LM_jhl/BUILD/tmp/claws-mail-3.17.1-root-builder/usr/share/doc/claws-mail/manual/en'
 /usr/bin/install -c -m 644 ./claws-mail-manual.pdf '/tmp/B.LM_jhl/BUILD/tmp/claws-mail-3.17.1-root-builder/usr/share/doc/claws-mail/manual/en'
/usr/bin/install: cannot stat './claws-mail-manual.pdf': No such file or directory
make[4]: *** [Makefile:467: install-manualdeDATA] Error 1
make[4]: Leaving directory '/tmp/B.LM_jhl/BUILD/claws-mail-3.17.1/manual/dist/pdf'
make[3]: *** [Makefile:539: install-am] Error 2
make[2]: *** [Makefile:501: install-recursive] Error 1
make[1]: *** [Makefile:516: install-recursive] Error 1
make: *** [Makefile:785: install-recursive] Error 1
error: Bad exit status from /tmp/B.LM_jhl/BUILD/tmp/rpm-tmp.94 (%install)


RPM build errors:
    Bad exit status from /tmp/B.LM_jhl/BUILD/tmp/rpm-tmp.94 (%install)
ended at: Sun Sep  2 18:50:13 2018, done in 0:03:52.776431
error: No files produced.
+ chmod -R u+rwX /tmp/B.LM_jhl/BUILD
+ rm -rf /tmp/B.LM_jhl/tmp /tmp/B.LM_jhl/BUILD
+ rm -rf /tmp/B.LM_jhl
Begin-PLD-Builder-Info
Build-Time: user:278.92s sys:42.72s real:237.66s (faults io:0 non-io:29547499)

End-PLD-Builder-Info
[Back to list of logs] [View rpm -qa of builder]