FailedOk

th/SRPMS[OK]
th/x32[OK]
th/i686[OK]
th/x86_64[OK]

ac/SRPMS[OK]
ac/i386[OK]
ac/i586[OK]
ac/i686[OK]
ac/alpha[OK]
ac/amd64[OK]
ac/athlon[OK]
ac/ppc[OK]
ac/sparc[OK]
ac/sparc64[OK]

Advanced Search
main()
Powered by PLD Linux
(c) 2002-2018 PLD Team
$Revision: 1.37 $
Powered by ed.
Your IP: 54.158.199.217

cpqarrayd 5e277dbd-f21f-40be-bf63-7d915c75fed3

Status:Failed
Source URL:ftp://buildlogs.pld-linux.org/th/i686/FAIL/cpqarrayd,5e277dbd-f21f-40be-bf63-7d915c75fed3.bz2
text/plain URL:View!
rpm -qa of builder:View!
Date:2018/09/02 19:16:01
Runtime:0:00:05.945676

Toc:

  • prep
  • Executing(%prep): /bin/sh -e /tmp/B.Setqpu/BUILD/tmp/rpm-tmp.66184
  • build
  • Executing(%build): /bin/sh -e /tmp/B.Setqpu/BUILD/tmp/rpm-tmp.66184
  • error 1
  • snmp_sess_perror("Error: sendtrap/snmp_send", &ss );
  • error 2
  • status.c:220:22: error: format not a string literal and no format arguments [-Werror=format-security]
  • error 3
  • status.c:222:12: error: format not a string literal and no format arguments [-Werror=format-security]
  • error 4
  • status.c:240:22: error: format not a string literal and no format arguments [-Werror=format-security]
  • error 5
  • status.c:242:12: error: format not a string literal and no format arguments [-Werror=format-security]
  • error 6
  • make[2]: *** [Makefile:471: status.o] Error 1
  • error 7
  • make[1]: *** [Makefile:533: all-recursive] Error 1
  • error 8
  • error: Bad exit status from /tmp/B.Setqpu/BUILD/tmp/rpm-tmp.66184 (%build)
  • error 9
  • RPM build errors:
  • error 10
  • error: No files produced.

Content:

request from: baggins
checking if we should skip the build
started at: Sun Sep  2 19:15:51 2018
killing old processes on a builder
sending signal 9 to pid -1
Killed
cleaning up /tmp
fetching https://srcbuilder.pld-linux.org/th//srpms/5e277dbd-f21f-40be-bf63-7d915c75fed3/cpqarrayd-2.3-5.src.rpm
fetched 186791 bytes, 379.2 K/s
installing srpm: cpqarrayd-2.3-5.src.rpm
+ install -d /tmp/B.Setqpu/BUILD /tmp/B.Setqpu/RPMS
+ LC_ALL=en_US.UTF-8
+ rpm -qp --changelog cpqarrayd-2.3-5.src.rpm
* Sun Sep 02 2018 PLD Linux Team <feedback@pld-linux.org>
- For complete changelog see: http://git.pld-linux.org/?p=packages/cpqarrayd.git;a=log;h=master
+ rpm -Uhv --nodeps --define '_topdir /tmp/B.Setqpu' --define '_specdir %{_topdir}' --define '_sourcedir %{_specdir}' --define '_rpmdir %{_topdir}/RPMS' --define '_builddir %{_topdir}/BUILD' cpqarrayd-2.3-5.src.rpm Preparing... ################################################## cpqarrayd ################################################## + rm -f cpqarrayd-2.3-5.src.rpm + install -m 700 -d /tmp/B.Setqpu/BUILD/tmp + TMPDIR=/tmp/B.Setqpu/BUILD/tmp + exec nice -n 0 rpmbuild -bp --short-circuit --nodeps --define '_topdir /tmp/B.Setqpu' --define '_specdir %{_topdir}' --define '_sourcedir %{_specdir}' --define '_rpmdir %{_topdir}/RPMS' --define '_builddir %{_topdir}/BUILD' --target i686-pld-linux --define 'prep exit 0' /tmp/B.Setqpu/cpqarrayd.spec Building target platforms: i686-pld-linux checking BuildConflict-ing packages no BuildConflicts found checking BR rpm: Building target platforms: i686-pld-linux no BR needed building RPM using: set -ex; : build-id: 5e277dbd-f21f-40be-bf63-7d915c75fed3; TMPDIR=/tmp/B.Setqpu/BUILD/tmp exec nice -n 0 rpmbuild -bb --define '_smp_mflags -j9' --define '_make_opts -Otarget' --define '_pld_builder 1' --define '_topdir /tmp/B.Setqpu' --define '_specdir %{_topdir}' --define '_sourcedir %{_specdir}' --define '_rpmdir %{_topdir}/RPMS' --define '_builddir %{_topdir}/BUILD' --target i686-pld-linux /tmp/B.Setqpu/cpqarrayd.spec + : build-id: 5e277dbd-f21f-40be-bf63-7d915c75fed3 + TMPDIR=/tmp/B.Setqpu/BUILD/tmp + exec nice -n 0 rpmbuild -bb --define '_smp_mflags -j9' --define '_make_opts -Otarget' --define '_pld_builder 1' --define '_topdir /tmp/B.Setqpu' --define '_specdir %{_topdir}' --define '_sourcedir %{_specdir}' --define '_rpmdir %{_topdir}/RPMS' --define '_builddir %{_topdir}/BUILD' --target i686-pld-linux /tmp/B.Setqpu/cpqarrayd.spec Building target platforms: i686-pld-linux Executing(%prep): /bin/sh -e /tmp/B.Setqpu/BUILD/tmp/rpm-tmp.66184 + umask 022 + cd /tmp/B.Setqpu/BUILD + cd /tmp/B.Setqpu/BUILD + rm -rf cpqarrayd-2.3 + /usr/bin/gzip -dc /tmp/B.Setqpu/cpqarrayd-2.3.tar.gz + /bin/tar -xf - + STATUS=0 + '[' 0 -ne 0 ']' + cd cpqarrayd-2.3 + /bin/id -u + '[' 1001 '=' 0 ']' + /bin/id -u + '[' 1001 '=' 0 ']' + /bin/chmod -Rf a+rX,u+w,g-w,o-w . + echo 'Patch #0 (cpqarrayd-headers.patch):' Patch #0 (cpqarrayd-headers.patch): + '[' -f /tmp/B.Setqpu/cpqarrayd-headers.patch ']' + /bin/cat /tmp/B.Setqpu/cpqarrayd-headers.patch + /usr/bin/patch -s -p1 + exit 0 Executing(%build): /bin/sh -e /tmp/B.Setqpu/BUILD/tmp/rpm-tmp.66184 TMP=/home/users/builder/tmp HOME=/home/users/builder PATH=/usr/local/bin:/usr/bin:/bin:/home/users/builder/bin TMPDIR=/tmp/B.Setqpu/BUILD/tmp + umask 022 + cd /tmp/B.Setqpu/BUILD + cd cpqarrayd-2.3 + aclocal + autoconf + autoheader + automake -a -c -f --foreign configure.ac:3: warning: AM_INIT_AUTOMAKE: two- and three-arguments forms are deprecated. For more info, see: configure.ac:3: https://www.gnu.org/software/automake/manual/automake.html#Modernize-AM_005fINIT_005fAUTOMAKE-invocation configure.ac:8: installing './compile' configure.ac:3: installing './install-sh' configure.ac:3: installing './missing' Makefile.am: installing './depcomp' + ./configure 'LDFLAGS=-Wl,--as-needed -Wl,--no-copy-dt-needed-entries -Wl,-z,relro -Wl,-z,combreloc ' 'CFLAGS=-O2 -fwrapv -pipe -Wformat -Werror=format-security -gdwarf-4 -fno-debug-types-section -fvar-tracking-assignments -g2 -Wp,-D_FORTIFY_SOURCE=2 -fstack-protector-strong --param=ssp-buffer-size=4 -fomit-frame-pointer -march=i686 -fasynchronous-unwind-tables -mtune=pentium4 -gdwarf-4 -fno-debug-types-section -fvar-tracking-assignments -g2 ' 'CXXFLAGS=-O2 -fwrapv -pipe -Wformat -Werror=format-security -gdwarf-4 -fno-debug-types-section -fvar-tracking-assignments -g2 -Wp,-D_FORTIFY_SOURCE=2 -fstack-protector-strong --param=ssp-buffer-size=4 -fomit-frame-pointer -march=i686 -fasynchronous-unwind-tables -mtune=pentium4 -gdwarf-4 -fno-debug-types-section -fvar-tracking-assignments -g2 ' 'FFLAGS=-O2 -fwrapv -pipe -Wformat -Werror=format-security -gdwarf-4 -fno-debug-types-section -fvar-tracking-assignments -g2 -Wp,-D_FORTIFY_SOURCE=2 -fstack-protector-strong --param=ssp-buffer-size=4 -fomit-frame-pointer -march=i686 -fasynchronous-unwind-tables -mtune=pentium4 -gdwarf-4 -fno-debug-types-section -fvar-tracking-assignments -g2 ' 'FCFLAGS=-O2 -fwrapv -pipe -Wformat -Werror=format-security -gdwarf-4 -fno-debug-types-section -fvar-tracking-assignments -g2 -Wp,-D_FORTIFY_SOURCE=2 -fstack-protector-strong --param=ssp-buffer-size=4 -fomit-frame-pointer -march=i686 -fasynchronous-unwind-tables -mtune=pentium4 -gdwarf-4 -fno-debug-types-section -fvar-tracking-assignments -g2 ' 'CPPFLAGS=' 'CC=i686-pld-linux-gcc' 'CXX=i686-pld-linux-g++' '--host=i686-pld-linux' '--build=i686-pld-linux' '--prefix=/usr' '--exec-prefix=/usr' '--bindir=/usr/bin' '--sbindir=/usr/sbin' '--sysconfdir=/etc' '--datadir=/usr/share' '--includedir=/usr/include' '--libdir=/usr/lib' '--libexecdir=/usr/libexec' '--localstatedir=/var' '--sharedstatedir=/var/lib' '--mandir=/usr/share/man' '--infodir=/usr/share/info' '--x-libraries=/usr/lib' checking for a BSD-compatible install... /usr/bin/install -c checking whether build environment is sane... yes checking for a thread-safe mkdir -p... /bin/mkdir -p checking for mawk... mawk checking whether make sets $(MAKE)... yes checking whether make supports nested variables... yes checking for i686-pld-linux-gcc... i686-pld-linux-gcc checking whether the C compiler works... yes checking for C compiler default output file name... a.out checking for suffix of executables... checking whether we are cross compiling... no checking for suffix of object files... o checking whether we are using the GNU C compiler... yes checking whether i686-pld-linux-gcc accepts -g... yes checking for i686-pld-linux-gcc option to accept ISO C89... none needed checking whether i686-pld-linux-gcc understands -c and -o together... yes checking whether make supports the include directive... yes (GNU style) checking dependency style of i686-pld-linux-gcc... gcc3 checking for mawk... (cached) mawk checking whether make sets $(MAKE)... (cached) yes checking how to run the C preprocessor... i686-pld-linux-gcc -E checking for grep that handles long lines and -e... /bin/grep checking for egrep... /bin/grep -E checking for ANSI C header files... yes checking for sys/types.h... yes checking for sys/stat.h... yes checking for stdlib.h... yes checking for string.h... yes checking for memory.h... yes checking for strings.h... yes checking for inttypes.h... yes checking for stdint.h... yes checking for unistd.h... yes checking arpa/inet.h usability... yes checking arpa/inet.h presence... yes checking for arpa/inet.h... yes checking fcntl.h usability... yes checking fcntl.h presence... yes checking for fcntl.h... yes checking netdb.h usability... yes checking netdb.h presence... yes checking for netdb.h... yes checking netinet/in.h usability... yes checking netinet/in.h presence... yes checking for netinet/in.h... yes checking for stdlib.h... (cached) yes checking for string.h... (cached) yes checking sys/ioctl.h usability... yes checking sys/ioctl.h presence... yes checking for sys/ioctl.h... yes checking sys/socket.h usability... yes checking sys/socket.h presence... yes checking for sys/socket.h... yes checking sys/time.h usability... yes checking sys/time.h presence... yes checking for sys/time.h... yes checking syslog.h usability... yes checking syslog.h presence... yes checking for syslog.h... yes checking for unistd.h... (cached) yes checking for kernel sources... found . checking linux/compiler.h usability... no checking linux/compiler.h presence... no checking for linux/compiler.h... no checking ida_ioctl.h usability... yes checking ida_ioctl.h presence... yes checking for ida_ioctl.h... yes checking ida_cmd.h usability... yes checking ida_cmd.h presence... yes checking for ida_cmd.h... yes checking cpqarray.h usability... yes checking cpqarray.h presence... yes checking for cpqarray.h... yes checking SmartArray driver version... ok checking linux/cciss_ioctl.h usability... yes checking linux/cciss_ioctl.h presence... yes checking for linux/cciss_ioctl.h... yes checking for an ANSI C-conforming const... yes checking for pid_t... yes checking vfork.h usability... no checking vfork.h presence... no checking for vfork.h... no checking for fork... yes checking for vfork... yes checking for working fork... yes checking for working vfork... (cached) yes checking whether i686-pld-linux-gcc needs -traditional... no checking for stdlib.h... (cached) yes checking for GNU libc compatible malloc... yes checking for dup2... yes checking for gethostbyname... yes checking for gethostname... yes checking for memset... yes checking for strerror... yes checking for HMAC in -lcrypto... yes checking for snmp_open in -lnetsnmp... yes checking that generated files are newer than configure... done configure: creating ./config.status config.status: creating Makefile config.status: creating scripts/Makefile config.status: creating config.h config.status: executing depfiles commands + /usr/bin/make -Otarget -j9 /usr/bin/make all-recursive Making all in scripts make[2]: Nothing to be done for 'all'. make[2]: Entering directory '/tmp/B.Setqpu/BUILD/cpqarrayd-2.3' i686-pld-linux-gcc -DHAVE_CONFIG_H -I. -I./include -I./drivers/block -O2 -fwrapv -pipe -Wformat -Werror=format-security -gdwarf-4 -fno-debug-types-section -fvar-tracking-assignments -g2 -Wp,-D_FORTIFY_SOURCE=2 -fstack-protector-strong --param=ssp-buffer-size=4 -fomit-frame-pointer -march=i686 -fasynchronous-unwind-tables -mtune=pentium4 -gdwarf-4 -fno-debug-types-section -fvar-tracking-assignments -g2 -I./include -I./drivers/block -MT cciss_functions.o -MD -MP -MF .deps/cciss_functions.Tpo -c -o cciss_functions.o cciss_functions.c In file included from cciss_functions.c:34: cciss_structs.h:36: warning: "CISS_MAX_LUN" redefined #define CISS_MAX_LUN 16 In file included from /usr/include/linux/cciss_ioctl.h:7, from cciss_functions.c:33: /usr/include/linux/cciss_defs.h:49: note: this is the location of the previous definition #define CISS_MAX_LUN 1024 mv -f .deps/cciss_functions.Tpo .deps/cciss_functions.Po make[2]: Leaving directory '/tmp/B.Setqpu/BUILD/cpqarrayd-2.3' make[2]: Entering directory '/tmp/B.Setqpu/BUILD/cpqarrayd-2.3' i686-pld-linux-gcc -DHAVE_CONFIG_H -I. -I./include -I./drivers/block -O2 -fwrapv -pipe -Wformat -Werror=format-security -gdwarf-4 -fno-debug-types-section -fvar-tracking-assignments -g2 -Wp,-D_FORTIFY_SOURCE=2 -fstack-protector-strong --param=ssp-buffer-size=4 -fomit-frame-pointer -march=i686 -fasynchronous-unwind-tables -mtune=pentium4 -gdwarf-4 -fno-debug-types-section -fvar-tracking-assignments -g2 -I./include -I./drivers/block -MT cpqarrayd.o -MD -MP -MF .deps/cpqarrayd.Tpo -c -o cpqarrayd.o cpqarrayd.c cpqarrayd.c: In function 'main': cpqarrayd.c:152:50: warning: implicit declaration of function 'malloc' [-Wimplicit-function-declaration] opts.traphosts[opts.nr_traphosts] = (char *)malloc(strlen(optarg)+1); ^~~~~~ cpqarrayd.c:152:50: warning: incompatible implicit declaration of built-in function 'malloc' cpqarrayd.c:152:50: note: include '<stdlib.h>' or provide a declaration of 'malloc' cpqarrayd.c:59:1: +#include <stdlib.h> cpqarrayd.c:152:50: opts.traphosts[opts.nr_traphosts] = (char *)malloc(strlen(optarg)+1); ^~~~~~ cpqarrayd.c:163:4: warning: implicit declaration of function 'exit' [-Wimplicit-function-declaration] exit(0); ^~~~ cpqarrayd.c:163:4: warning: incompatible implicit declaration of built-in function 'exit' cpqarrayd.c:163:4: note: include '<stdlib.h>' or provide a declaration of 'exit' cpqarrayd.c:176:5: warning: incompatible implicit declaration of built-in function 'exit' exit(1); ^~~~ cpqarrayd.c:176:5: note: include '<stdlib.h>' or provide a declaration of 'exit' cpqarrayd.c:219:7: warning: incompatible implicit declaration of built-in function 'exit' exit(1); ^~~~ cpqarrayd.c:219:7: note: include '<stdlib.h>' or provide a declaration of 'exit' cpqarrayd.c:226:7: warning: incompatible implicit declaration of built-in function 'exit' exit(0); ^~~~ cpqarrayd.c:226:7: note: include '<stdlib.h>' or provide a declaration of 'exit' cpqarrayd.c:232:10: warning: incompatible implicit declaration of built-in function 'exit' exit(1); ^~~~ cpqarrayd.c:232:10: note: include '<stdlib.h>' or provide a declaration of 'exit' cpqarrayd.c:253:5: warning: implicit declaration of function 'cciss_status_check'; did you mean 'status_check'? [-Wimplicit-function-declaration] cciss_status_check(opts); ^~~~~~~~~~~~~~~~~~ status_check mv -f .deps/cpqarrayd.Tpo .deps/cpqarrayd.Po make[2]: Leaving directory '/tmp/B.Setqpu/BUILD/cpqarrayd-2.3' make[2]: Entering directory '/tmp/B.Setqpu/BUILD/cpqarrayd-2.3' i686-pld-linux-gcc -DHAVE_CONFIG_H -I. -I./include -I./drivers/block -O2 -fwrapv -pipe -Wformat -Werror=format-security -gdwarf-4 -fno-debug-types-section -fvar-tracking-assignments -g2 -Wp,-D_FORTIFY_SOURCE=2 -fstack-protector-strong --param=ssp-buffer-size=4 -fomit-frame-pointer -march=i686 -fasynchronous-unwind-tables -mtune=pentium4 -gdwarf-4 -fno-debug-types-section -fvar-tracking-assignments -g2 -I./include -I./drivers/block -MT sendtrap.o -MD -MP -MF .deps/sendtrap.Tpo -c -o sendtrap.o sendtrap.c sendtrap.c: In function 'sendtrap': sendtrap.c:77:5: warning: 'remote_port' is deprecated [-Wdeprecated-declarations] session.remote_port = 162; ^~~~~~~ In file included from /usr/include/net-snmp/definitions.h:22, from /usr/include/net-snmp/net-snmp-includes.h:67, from sendtrap.c:40: /usr/include/net-snmp/types.h:345:21: note: declared here u_short remote_port NETSNMP_ATTRIBUTE_DEPRECATED; ^~~~~~~~~~~ sendtrap.c:87:19: warning: assignment to 'in_addr_t *' {aka 'unsigned int *'} from incompatible pointer type 'struct in_addr_t *' [-Wincompatible-pointer-types] pdu_in_addr_t = (struct in_addr_t *)&pdu->agent_addr; ^ sendtrap.c:107:53: warning: passing argument 2 of 'snmp_sess_perror' from incompatible pointer type [-Wincompatible-pointer-types] snmp_sess_perror("Error: sendtrap/snmp_send", &ss ); ^~~ In file included from /usr/include/net-snmp/library/snmp_client.h:32, from /usr/include/net-snmp/varbind_api.h:102, from /usr/include/net-snmp/library/snmp_api.h:33, from /usr/include/net-snmp/types.h:463, from /usr/include/net-snmp/definitions.h:22, from /usr/include/net-snmp/net-snmp-includes.h:67, from sendtrap.c:40: /usr/include/net-snmp/output_api.h:34:64: note: expected 'netsnmp_session *' {aka 'struct snmp_session *'} but argument is of type 'struct snmp_session **' void snmp_sess_perror(const char *msg, netsnmp_session *sess); ~~~~~~~~~~~~~~~~~^~~~ mv -f .deps/sendtrap.Tpo .deps/sendtrap.Po make[2]: Leaving directory '/tmp/B.Setqpu/BUILD/cpqarrayd-2.3' make[2]: Entering directory '/tmp/B.Setqpu/BUILD/cpqarrayd-2.3' i686-pld-linux-gcc -DHAVE_CONFIG_H -I. -I./include -I./drivers/block -O2 -fwrapv -pipe -Wformat -Werror=format-security -gdwarf-4 -fno-debug-types-section -fvar-tracking-assignments -g2 -Wp,-D_FORTIFY_SOURCE=2 -fstack-protector-strong --param=ssp-buffer-size=4 -fomit-frame-pointer -march=i686 -fasynchronous-unwind-tables -mtune=pentium4 -gdwarf-4 -fno-debug-types-section -fvar-tracking-assignments -g2 -I./include -I./drivers/block -MT status.o -MD -MP -MF .deps/status.Tpo -c -o status.o status.c In file included from status.c:45: cciss_structs.h:36: warning: "CISS_MAX_LUN" redefined #define CISS_MAX_LUN 16 In file included from /usr/include/linux/cciss_ioctl.h:7, from status.c:44: /usr/include/linux/cciss_defs.h:49: note: this is the location of the previous definition #define CISS_MAX_LUN 1024 status.c: In function 'status_check': status.c:143:15: warning: too many arguments for format [-Wformat-extra-args] printf("DEBUG: Problem sending snmp trap", ^~~~~~~~~~~~~~~~~~~~~~~~~~~~~~~~~~ status.c:171:15: warning: too many arguments for format [-Wformat-extra-args] printf("DEBUG: Problem sending snmp trap ", ^~~~~~~~~~~~~~~~~~~~~~~~~~~~~~~~~~~ status.c: In function 'cciss_status_check': status.c:220:22: error: format not a string literal and no format arguments [-Werror=format-security] syslog(LOG_WARNING, statusmsg); ^~~~~~~~~ status.c:222:12: error: format not a string literal and no format arguments [-Werror=format-security] printf (statusmsg); ^~~~~~~~~ status.c:229:13: warning: too many arguments for format [-Wformat-extra-args] printf("DEBUG: Problem sending snmp trap", ^~~~~~~~~~~~~~~~~~~~~~~~~~~~~~~~~~ status.c:240:22: error: format not a string literal and no format arguments [-Werror=format-security] syslog(LOG_WARNING, statusmsg); ^~~~~~~~~ status.c:242:12: error: format not a string literal and no format arguments [-Werror=format-security] printf (statusmsg); ^~~~~~~~~ status.c:249:13: warning: too many arguments for format [-Wformat-extra-args] printf("DEBUG: Problem sending snmp trap", ^~~~~~~~~~~~~~~~~~~~~~~~~~~~~~~~~~ In file included from /usr/include/stdio.h:873, from status.c:29: In function 'snprintf', inlined from 'cciss_status_check' at status.c:215:2: /usr/include/bits/stdio2.h:67:10: warning: '__builtin___snprintf_chk' specified bound 2048 exceeds destination size 1024 [-Wstringop-overflow=] return __builtin___snprintf_chk (__s, __n, __USE_FORTIFY_LEVEL - 1, ^~~~~~~~~~~~~~~~~~~~~~~~~~~~~~~~~~~~~~~~~~~~~~~~~~~~~~~~~~~~ __bos (__s), __fmt, __va_arg_pack ()); ~~~~~~~~~~~~~~~~~~~~~~~~~~~~~~~~~~~~~ In function 'snprintf', inlined from 'cciss_status_check' at status.c:236:2: /usr/include/bits/stdio2.h:67:10: warning: '__builtin___snprintf_chk' specified bound 2048 exceeds destination size 1024 [-Wstringop-overflow=] return __builtin___snprintf_chk (__s, __n, __USE_FORTIFY_LEVEL - 1, ^~~~~~~~~~~~~~~~~~~~~~~~~~~~~~~~~~~~~~~~~~~~~~~~~~~~~~~~~~~~ __bos (__s), __fmt, __va_arg_pack ()); ~~~~~~~~~~~~~~~~~~~~~~~~~~~~~~~~~~~~~ cc1: some warnings being treated as errors make[2]: *** [Makefile:471: status.o] Error 1 make[2]: Leaving directory '/tmp/B.Setqpu/BUILD/cpqarrayd-2.3' make[2]: *** Waiting for unfinished jobs.... make[2]: Entering directory '/tmp/B.Setqpu/BUILD/cpqarrayd-2.3' i686-pld-linux-gcc -DHAVE_CONFIG_H -I. -I./include -I./drivers/block -O2 -fwrapv -pipe -Wformat -Werror=format-security -gdwarf-4 -fno-debug-types-section -fvar-tracking-assignments -g2 -Wp,-D_FORTIFY_SOURCE=2 -fstack-protector-strong --param=ssp-buffer-size=4 -fomit-frame-pointer -march=i686 -fasynchronous-unwind-tables -mtune=pentium4 -gdwarf-4 -fno-debug-types-section -fvar-tracking-assignments -g2 -I./include -I./drivers/block -MT discover.o -MD -MP -MF .deps/discover.Tpo -c -o discover.o discover.c In file included from discover.c:50: cciss_structs.h:36: warning: "CISS_MAX_LUN" redefined #define CISS_MAX_LUN 16 In file included from /usr/include/linux/cciss_ioctl.h:7, from discover.c:49: /usr/include/linux/cciss_defs.h:49: note: this is the location of the previous definition #define CISS_MAX_LUN 1024 discover.c: In function 'discover_controllers': discover.c:113:8: warning: implicit declaration of function 'cciss_interrogate_controller'; did you mean 'interrogate_controller'? [-Wimplicit-function-declaration] if (cciss_interrogate_controller (opts, cciss_controllers[cntr])) ^~~~~~~~~~~~~~~~~~~~~~~~~~~~ interrogate_controller discover.c: In function 'interrogate_controller': discover.c:156:58: warning: implicit declaration of function 'malloc' [-Wimplicit-function-declaration] ctrls_found[ctrls_found_num].ctrl_devicename = (char *)malloc(strlen(buffer)+1); ^~~~~~ discover.c:156:58: warning: incompatible implicit declaration of built-in function 'malloc' discover.c:156:58: note: include '<stdlib.h>' or provide a declaration of 'malloc' discover.c:52:1: +#include <stdlib.h> discover.c:156:58: ctrls_found[ctrls_found_num].ctrl_devicename = (char *)malloc(strlen(buffer)+1); ^~~~~~ discover.c: In function 'cciss_interrogate_controller': discover.c:311:53: warning: incompatible implicit declaration of built-in function 'malloc' ctrls_found[ctrls_found_num].devicefile = (char *)malloc(strlen(devicefile)+1); ^~~~~~ discover.c:311:53: note: include '<stdlib.h>' or provide a declaration of 'malloc' mv -f .deps/discover.Tpo .deps/discover.Po make[2]: Leaving directory '/tmp/B.Setqpu/BUILD/cpqarrayd-2.3' make[1]: *** [Makefile:533: all-recursive] Error 1 make: *** [Makefile:352: all] Error 2 error: Bad exit status from /tmp/B.Setqpu/BUILD/tmp/rpm-tmp.66184 (%build) RPM build errors: Bad exit status from /tmp/B.Setqpu/BUILD/tmp/rpm-tmp.66184 (%build) ended at: Sun Sep 2 19:16:01 2018, done in 0:00:05.945676 error: No files produced. + chmod -R u+rwX /tmp/B.Setqpu/BUILD + rm -rf /tmp/B.Setqpu/tmp /tmp/B.Setqpu/BUILD + rm -rf /tmp/B.Setqpu Begin-PLD-Builder-Info Build-Time: user:6.74s sys:0.79s real:9.58s (faults io:0 non-io:359261) End-PLD-Builder-Info
[Back to list of logs] [View rpm -qa of builder]