FailedOk

th/SRPMS[OK]
th/x32[OK]
th/i686[OK]
th/x86_64[OK]

ac/SRPMS[OK]
ac/i386[OK]
ac/i586[OK]
ac/i686[OK]
ac/alpha[OK]
ac/amd64[OK]
ac/athlon[OK]
ac/ppc[OK]
ac/sparc[OK]
ac/sparc64[OK]

Advanced Search
main()
Powered by PLD Linux
(c) 2002-2018 PLD Team
$Revision: 1.37 $
Powered by php.
Your IP: 54.196.5.6

crossavr-gcc aad5b4e6-f962-46fd-bafa-4891b45fe7cb

Status:Failed
Source URL:ftp://buildlogs.pld-linux.org/th/i686/FAIL/crossavr-gcc,aad5b4e6-f962-46fd-bafa-4891b45fe7cb.bz2
text/plain URL:View!
full text:View!
rpm -qa of builder:View!
Date:2018/07/29 00:31:06
Runtime:0:00:49.577365

Toc:

  • error 1
  • make[2]: [Makefile:4460: gpl.pod] Error 255 (ignored)
  • error 2
  • make[2]: [Makefile:4451: gcc.pod] Error 255 (ignored)
  • error 3
  • make[2]: [Makefile:4435: doc/gpl.7] Error 1 (ignored)
  • error 4
  • make[2]: *** [Makefile:4342: doc/gcc.info] Error 1
  • error 5
  • make[1]: *** [Makefile:3831: all-gcc] Error 2
  • error 6
  • error: Bad exit status from /tmp/B.6iXztr/BUILD/tmp/rpm-tmp.7570 (%build)
  • error 7
  • RPM build errors:
  • error 8
  • error: No files produced.

Content:

config.status: creating collect-ld
config.status: creating nm
config.status: creating Makefile
config.status: creating ada/gcc-interface/Makefile
config.status: creating ada/Makefile
config.status: creating auto-host.h
config.status: executing default commands
make[1]: Leaving directory '/tmp/B.6iXztr/BUILD/gcc-4.7.3/obj-avr'
make[2]: Entering directory '/tmp/B.6iXztr/BUILD/gcc-4.7.3/obj-avr/gcc'
TARGET_CPU_DEFAULT="" \
HEADERS="auto-host.h ansidecl.h" DEFINES="" \
/bin/sh ../../gcc/mkconfig.sh config.h
make[2]: Leaving directory '/tmp/B.6iXztr/BUILD/gcc-4.7.3/obj-avr/gcc'
make[2]: Entering directory '/tmp/B.6iXztr/BUILD/gcc-4.7.3/obj-avr/gcc'
TARGET_CPU_DEFAULT="" \
HEADERS="auto-host.h ansidecl.h" DEFINES="" \
/bin/sh ../../gcc/mkconfig.sh bconfig.h
make[2]: Leaving directory '/tmp/B.6iXztr/BUILD/gcc-4.7.3/obj-avr/gcc'
make[2]: Entering directory '/tmp/B.6iXztr/BUILD/gcc-4.7.3/obj-avr/gcc'
TARGET_CPU_DEFAULT="" \
HEADERS="options.h insn-constants.h config/elfos.h config/avr/elf.h config/avr/avr.h config/dbxelf.h config/avr/avr-stdint.h config/initfini-array.h config/tm-dwarf2.h defaults.h" DEFINES="LIBC_GLIBC=1 LIBC_UCLIBC=2 LIBC_BIONIC=3" \
/bin/sh ../../gcc/mkconfig.sh tm.h
make[2]: Leaving directory '/tmp/B.6iXztr/BUILD/gcc-4.7.3/obj-avr/gcc'
make[2]: Entering directory '/tmp/B.6iXztr/BUILD/gcc-4.7.3/obj-avr/gcc'
i686-pld-linux-gcc -c   -O2 -fwrapv -pipe -gdwarf-4 -fno-debug-types-section -fvar-tracking-assignments -g2 -Wp,-D_FORTIFY_SOURCE=2 -fstack-protector-strong --param=ssp-buffer-size=4 -fomit-frame-pointer -march=i686 -fasynchronous-unwind-tables -mtune=pentium4 -gdwarf-4 -fno-debug-types-section -fvar-tracking-assignments -g2  -DIN_GCC -DCROSS_DIRECTORY_STRUCTURE  -W -Wall -Wno-narrowing -Wwrite-strings -Wcast-qual -Wstrict-prototypes -Wmissing-prototypes -Wmissing-format-attribute -pedantic -Wno-long-long -Wno-variadic-macros -Wno-overlength-strings -Wold-style-definition -Wc++-compat   -DHAVE_CONFIG_H -DGENERATOR_FILE -I. -Ibuild -I../../gcc -I../../gcc/build -I../../gcc/../include -I../../gcc/../libcpp/include  -I../../gcc/../libdecnumber -I../../gcc/../libdecnumber/dpd -I../libdecnumber    \
-DBASEVER="\"4.7.3\"" -DDATESTAMP="\"\"" \
-DREVISION="\"\"" \
-DDEVPHASE="\"\"" -DPKGVERSION="\"(GCC) \"" \
-DBUGURL="\"<http://gcc.gnu.org/bugs.html>\"" -o build/version.o ../../gcc/version.c
make[2]: Leaving directory '/tmp/B.6iXztr/BUILD/gcc-4.7.3/obj-avr/gcc'
make[2]: Entering directory '/tmp/B.6iXztr/BUILD/gcc-4.7.3/obj-avr/gcc'
/bin/sh ../../gcc/config/avr/genopt.sh ../../gcc/config/avr/avr-mcus.def > ../../gcc/config/avr/avr-tables.opt
make[2]: Leaving directory '/tmp/B.6iXztr/BUILD/gcc-4.7.3/obj-avr/gcc'
make[2]: Entering directory '/tmp/B.6iXztr/BUILD/gcc-4.7.3/obj-avr/gcc'
/bin/sh ../../gcc/../move-if-change tmp-gi.list gtyp-input.list
echo timestamp > s-gtyp-input
make[2]: Leaving directory '/tmp/B.6iXztr/BUILD/gcc-4.7.3/obj-avr/gcc'
make[2]: Entering directory '/tmp/B.6iXztr/BUILD/gcc-4.7.3/obj-avr/gcc'
TARGET_CPU_DEFAULT="" \
HEADERS="config/avr/avr-protos.h tm-preds.h" DEFINES="" \
/bin/sh ../../gcc/mkconfig.sh tm_p.h
make[2]: Leaving directory '/tmp/B.6iXztr/BUILD/gcc-4.7.3/obj-avr/gcc'
make[2]: Entering directory '/tmp/B.6iXztr/BUILD/gcc-4.7.3/obj-avr/gcc'
echo "#define BUILDING_GCC_MAJOR `echo 4.7.3 | sed -e 's/^\([0-9]*\).*$/\1/'`" > bversion.h
echo "#define BUILDING_GCC_MINOR `echo 4.7.3 | sed -e 's/^[0-9]*\.\([0-9]*\).*$/\1/'`" >> bversion.h
echo "#define BUILDING_GCC_PATCHLEVEL `echo 4.7.3 | sed -e 's/^[0-9]*\.[0-9]*\.\([0-9]*\)$/\1/'`" >> bversion.h
echo "#define BUILDING_GCC_VERSION (BUILDING_GCC_MAJOR * 1000 + BUILDING_GCC_MINOR)" >> bversion.h
echo timestamp > s-bversion
make[2]: Leaving directory '/tmp/B.6iXztr/BUILD/gcc-4.7.3/obj-avr/gcc'
make[2]: Entering directory '/tmp/B.6iXztr/BUILD/gcc-4.7.3/obj-avr/gcc'
echo "i686-pld-linux-gcc   -O2 -fwrapv -pipe -gdwarf-4 -fno-debug-types-section -fvar-tracking-assignments -g2 -Wp,-D_FORTIFY_SOURCE=2 -fstack-protector-strong --param=ssp-buffer-size=4 -fomit-frame-pointer -march=i686 -fasynchronous-unwind-tables -mtune=pentium4 -gdwarf-4 -fno-debug-types-section -fvar-tracking-assignments -g2  -DIN_GCC -DCROSS_DIRECTORY_STRUCTURE  -W -Wall -Wno-narrowing -Wwrite-strings -Wcast-qual -Wstrict-prototypes -Wmissing-prototypes -Wmissing-format-attribute -pedantic -Wno-long-long -Wno-variadic-macros -Wno-overlength-strings -Wold-style-definition -Wc++-compat   -DHAVE_CONFIG_H " > checksum-options.tmp \
&& ../../gcc/../move-if-change checksum-options.tmp checksum-options
make[2]: Leaving directory '/tmp/B.6iXztr/BUILD/gcc-4.7.3/obj-avr/gcc'
make[2]: Entering directory '/tmp/B.6iXztr/BUILD/gcc-4.7.3/obj-avr/gcc'
lsf="../../gcc/cp/lang-specs.h ../../gcc/lto/lang-specs.h"; for f in $lsf; do \
    echo "#include \"$f\""; \
done | sed 's|../../gcc/||' > tmp-specs.h
/bin/sh ../../gcc/../move-if-change tmp-specs.h specs.h
echo timestamp > s-specs
make[2]: Leaving directory '/tmp/B.6iXztr/BUILD/gcc-4.7.3/obj-avr/gcc'
make[2]: Entering directory '/tmp/B.6iXztr/BUILD/gcc-4.7.3/obj-avr/gcc'
cp ../../gcc/gcc-ar.c gcc-nm.c
make[2]: Leaving directory '/tmp/B.6iXztr/BUILD/gcc-4.7.3/obj-avr/gcc'
make[2]: Entering directory '/tmp/B.6iXztr/BUILD/gcc-4.7.3/obj-avr/gcc'
cp ../../gcc/gcc-ar.c gcc-ranlib.c
make[2]: Leaving directory '/tmp/B.6iXztr/BUILD/gcc-4.7.3/obj-avr/gcc'
make[2]: Entering directory '/tmp/B.6iXztr/BUILD/gcc-4.7.3/obj-avr/gcc'
rm -f tmp-all-tree.def
echo '#include "tree.def"' > tmp-all-tree.def
echo 'END_OF_BASE_TREE_CODES' >> tmp-all-tree.def
echo '#include "c-family/c-common.def"' >> tmp-all-tree.def
ltf="../../gcc/ada/gcc-interface/ada-tree.def ../../gcc/cp/cp-tree.def ../../gcc/java/java-tree.def ../../gcc/objc/objc-tree.def"; for f in $ltf; do \
  echo "#include \"$f\""; \
done | sed 's|../../gcc/||' >> tmp-all-tree.def
/bin/sh ../../gcc/../move-if-change tmp-all-tree.def all-tree.def
echo timestamp > s-alltree
make[2]: Leaving directory '/tmp/B.6iXztr/BUILD/gcc-4.7.3/obj-avr/gcc'
make[2]: Entering directory '/tmp/B.6iXztr/BUILD/gcc-4.7.3/obj-avr/gcc'
TARGET_CPU_DEFAULT="" \
HEADERS="auto-host.h ansidecl.h" DEFINES="USED_FOR_TARGET " \
/bin/sh ../../gcc/mkconfig.sh tconfig.h
make[2]: Leaving directory '/tmp/B.6iXztr/BUILD/gcc-4.7.3/obj-avr/gcc'
make[2]: Entering directory '/tmp/B.6iXztr/BUILD/gcc-4.7.3/obj-avr/gcc'
(echo "@set version-GCC 4.7.3"; \
 if [ "" = "experimental" ]; \
 then echo "@set DEVELOPMENT"; \
 else echo "@clear DEVELOPMENT"; \
 fi) > gcc-vers.texiT
echo @set srcdir /tmp/B.6iXztr/BUILD/gcc-4.7.3/obj-avr/gcc/../../gcc >> gcc-vers.texiT
if [ -n "(GCC) " ]; then \
  echo "@set VERSION_PACKAGE (GCC) " >> gcc-vers.texiT; \
fi
echo "@set BUGURL @uref{http://gcc.gnu.org/bugs.html}" >> gcc-vers.texiT; \
mv -f gcc-vers.texiT gcc-vers.texi
make[2]: Leaving directory '/tmp/B.6iXztr/BUILD/gcc-4.7.3/obj-avr/gcc'
make[2]: Entering directory '/tmp/B.6iXztr/BUILD/gcc-4.7.3/obj-avr/gcc'
echo timestamp > gpl.pod
perl ../../gcc/../contrib/texi2pod.pl ../../gcc/doc/include/gpl_v3.texi > gpl.pod
Unescaped left brace in regex is illegal here in regex; marked by <-- HERE in m/^\@strong{ <-- HERE (.*)}$/ at ../../gcc/../contrib/texi2pod.pl line 319.
make[2]: [Makefile:4460: gpl.pod] Error 255 (ignored)
make[2]: Leaving directory '/tmp/B.6iXztr/BUILD/gcc-4.7.3/obj-avr/gcc'
make[2]: Entering directory '/tmp/B.6iXztr/BUILD/gcc-4.7.3/obj-avr/gcc'
i686-pld-linux-gcc -c   -O2 -fwrapv -pipe -gdwarf-4 -fno-debug-types-section -fvar-tracking-assignments -g2 -Wp,-D_FORTIFY_SOURCE=2 -fstack-protector-strong --param=ssp-buffer-size=4 -fomit-frame-pointer -march=i686 -fasynchronous-unwind-tables -mtune=pentium4 -gdwarf-4 -fno-debug-types-section -fvar-tracking-assignments -g2  -DIN_GCC -DCROSS_DIRECTORY_STRUCTURE  -W -Wall -Wno-narrowing -Wwrite-strings -Wcast-qual -Wstrict-prototypes -Wmissing-prototypes -Wmissing-format-attribute -pedantic -Wno-long-long -Wno-variadic-macros -Wno-overlength-strings -Wold-style-definition -Wc++-compat   -DHAVE_CONFIG_H -DGENERATOR_FILE -I. -Ibuild -I../../gcc -I../../gcc/build -I../../gcc/../include -I../../gcc/../libcpp/include  -I../../gcc/../libdecnumber -I../../gcc/../libdecnumber/dpd -I../libdecnumber    \
	-o build/genenums.o ../../gcc/genenums.c
make[2]: Leaving directory '/tmp/B.6iXztr/BUILD/gcc-4.7.3/obj-avr/gcc'
make[2]: Entering directory '/tmp/B.6iXztr/BUILD/gcc-4.7.3/obj-avr/gcc'
i686-pld-linux-gcc -c  -DSTANDARD_STARTFILE_PREFIX=\"../../../\" -DSTANDARD_EXEC_PREFIX=\"/usr/lib/gcc/\" -DSTANDARD_LIBEXEC_PREFIX=\"/usr/lib/gcc/\" -DDEFAULT_TARGET_VERSION=\"4.7.3\" -DDEFAULT_TARGET_MACHINE=\"avr\" -DSTANDARD_BINDIR_PREFIX=\"/usr/bin/\" -DTOOLDIR_BASE_PREFIX=\"../../../../\"  `test "X${SHLIB}" = "X" || test "no" != "yes" || echo "-DENABLE_SHARED_LIBGCC"` -DCONFIGURE_SPECS="\"\"" -DTARGET_MACHINE=\"avr\" -DPERSONALITY=\"nm\" -O2 -fwrapv -pipe -gdwarf-4 -fno-debug-types-section -fvar-tracking-assignments -g2 -Wp,-D_FORTIFY_SOURCE=2 -fstack-protector-strong --param=ssp-buffer-size=4 -fomit-frame-pointer -march=i686 -fasynchronous-unwind-tables -mtune=pentium4 -gdwarf-4 -fno-debug-types-section -fvar-tracking-assignments -g2  -DIN_GCC -DCROSS_DIRECTORY_STRUCTURE  -W -Wall -Wno-narrowing -Wwrite-strings -Wcast-qual -Wstrict-prototypes -Wmissing-prototypes -Wmissing-format-attribute -pedantic -Wno-long-long -Wno-variadic-macros -Wno-overlength-strings -Wold-style-definition -Wc++-compat   -DHAVE_CONFIG_H -I. -I. -I../../gcc -I../../gcc/. -I../../gcc/../include -I../../gcc/../libcpp/include  -I../../gcc/../libdecnumber -I../../gcc/../libdecnumber/dpd -I../libdecnumber    gcc-nm.c -o gcc-nm.o
make[2]: Leaving directory '/tmp/B.6iXztr/BUILD/gcc-4.7.3/obj-avr/gcc'
make[2]: Entering directory '/tmp/B.6iXztr/BUILD/gcc-4.7.3/obj-avr/gcc'
i686-pld-linux-gcc -c   -O2 -fwrapv -pipe -gdwarf-4 -fno-debug-types-section -fvar-tracking-assignments -g2 -Wp,-D_FORTIFY_SOURCE=2 -fstack-protector-strong --param=ssp-buffer-size=4 -fomit-frame-pointer -march=i686 -fasynchronous-unwind-tables -mtune=pentium4 -gdwarf-4 -fno-debug-types-section -fvar-tracking-assignments -g2  -DIN_GCC -DCROSS_DIRECTORY_STRUCTURE  -W -Wall -Wno-narrowing -Wwrite-strings -Wcast-qual -Wstrict-prototypes -Wmissing-prototypes -Wmissing-format-attribute -pedantic -Wno-long-long -Wno-variadic-macros -Wno-overlength-strings -Wold-style-definition -Wc++-compat   -DHAVE_CONFIG_H -DGENERATOR_FILE -I. -Ibuild -I../../gcc -I../../gcc/build -I../../gcc/../include -I../../gcc/../libcpp/include  -I../../gcc/../libdecnumber -I../../gcc/../libdecnumber/dpd -I../libdecnumber    \
	-o build/genchecksum.o ../../gcc/genchecksum.c
make[2]: Leaving directory '/tmp/B.6iXztr/BUILD/gcc-4.7.3/obj-avr/gcc'
make[2]: Entering directory '/tmp/B.6iXztr/BUILD/gcc-4.7.3/obj-avr/gcc'
i686-pld-linux-gcc -c  -DSTANDARD_STARTFILE_PREFIX=\"../../../\" -DSTANDARD_EXEC_PREFIX=\"/usr/lib/gcc/\" -DSTANDARD_LIBEXEC_PREFIX=\"/usr/lib/gcc/\" -DDEFAULT_TARGET_VERSION=\"4.7.3\" -DDEFAULT_TARGET_MACHINE=\"avr\" -DSTANDARD_BINDIR_PREFIX=\"/usr/bin/\" -DTOOLDIR_BASE_PREFIX=\"../../../../\"  `test "X${SHLIB}" = "X" || test "no" != "yes" || echo "-DENABLE_SHARED_LIBGCC"` -DCONFIGURE_SPECS="\"\"" -DTARGET_MACHINE=\"avr\" -DPERSONALITY=\"ar\" -O2 -fwrapv -pipe -gdwarf-4 -fno-debug-types-section -fvar-tracking-assignments -g2 -Wp,-D_FORTIFY_SOURCE=2 -fstack-protector-strong --param=ssp-buffer-size=4 -fomit-frame-pointer -march=i686 -fasynchronous-unwind-tables -mtune=pentium4 -gdwarf-4 -fno-debug-types-section -fvar-tracking-assignments -g2  -DIN_GCC -DCROSS_DIRECTORY_STRUCTURE  -W -Wall -Wno-narrowing -Wwrite-strings -Wcast-qual -Wstrict-prototypes -Wmissing-prototypes -Wmissing-format-attribute -pedantic -Wno-long-long -Wno-variadic-macros -Wno-overlength-strings -Wold-style-definition -Wc++-compat   -DHAVE_CONFIG_H -I. -I. -I../../gcc -I../../gcc/. -I../../gcc/../include -I../../gcc/../libcpp/include  -I../../gcc/../libdecnumber -I../../gcc/../libdecnumber/dpd -I../libdecnumber    ../../gcc/gcc-ar.c -o gcc-ar.o
make[2]: Leaving directory '/tmp/B.6iXztr/BUILD/gcc-4.7.3/obj-avr/gcc'
make[2]: Entering directory '/tmp/B.6iXztr/BUILD/gcc-4.7.3/obj-avr/gcc'
i686-pld-linux-gcc -c  -DSTANDARD_STARTFILE_PREFIX=\"../../../\" -DSTANDARD_EXEC_PREFIX=\"/usr/lib/gcc/\" -DSTANDARD_LIBEXEC_PREFIX=\"/usr/lib/gcc/\" -DDEFAULT_TARGET_VERSION=\"4.7.3\" -DDEFAULT_TARGET_MACHINE=\"avr\" -DSTANDARD_BINDIR_PREFIX=\"/usr/bin/\" -DTOOLDIR_BASE_PREFIX=\"../../../../\"  `test "X${SHLIB}" = "X" || test "no" != "yes" || echo "-DENABLE_SHARED_LIBGCC"` -DCONFIGURE_SPECS="\"\"" -DTARGET_MACHINE=\"avr\" -DPERSONALITY=\"ranlib\" -O2 -fwrapv -pipe -gdwarf-4 -fno-debug-types-section -fvar-tracking-assignments -g2 -Wp,-D_FORTIFY_SOURCE=2 -fstack-protector-strong --param=ssp-buffer-size=4 -fomit-frame-pointer -march=i686 -fasynchronous-unwind-tables -mtune=pentium4 -gdwarf-4 -fno-debug-types-section -fvar-tracking-assignments -g2  -DIN_GCC -DCROSS_DIRECTORY_STRUCTURE  -W -Wall -Wno-narrowing -Wwrite-strings -Wcast-qual -Wstrict-prototypes -Wmissing-prototypes -Wmissing-format-attribute -pedantic -Wno-long-long -Wno-variadic-macros -Wno-overlength-strings -Wold-style-definition -Wc++-compat   -DHAVE_CONFIG_H -I. -I. -I../../gcc -I../../gcc/. -I../../gcc/../include -I../../gcc/../libcpp/include  -I../../gcc/../libdecnumber -I../../gcc/../libdecnumber/dpd -I../libdecnumber    gcc-ranlib.c -o gcc-ranlib.o
make[2]: Leaving directory '/tmp/B.6iXztr/BUILD/gcc-4.7.3/obj-avr/gcc'
make[2]: Entering directory '/tmp/B.6iXztr/BUILD/gcc-4.7.3/obj-avr/gcc'
i686-pld-linux-gcc -c   -O2 -fwrapv -pipe -gdwarf-4 -fno-debug-types-section -fvar-tracking-assignments -g2 -Wp,-D_FORTIFY_SOURCE=2 -fstack-protector-strong --param=ssp-buffer-size=4 -fomit-frame-pointer -march=i686 -fasynchronous-unwind-tables -mtune=pentium4 -gdwarf-4 -fno-debug-types-section -fvar-tracking-assignments -g2  -DIN_GCC -DCROSS_DIRECTORY_STRUCTURE  -W -Wall -Wno-narrowing -Wwrite-strings -Wcast-qual -Wstrict-prototypes -Wmissing-prototypes -Wmissing-format-attribute -pedantic -Wno-long-long -Wno-variadic-macros -Wno-overlength-strings -Wold-style-definition -Wc++-compat   -DHAVE_CONFIG_H -I. -I. -I../../gcc -I../../gcc/. -I../../gcc/../include -I../../gcc/../libcpp/include  -I../../gcc/../libdecnumber -I../../gcc/../libdecnumber/dpd -I../libdecnumber    ../../gcc/errors.c -o errors.o
make[2]: Leaving directory '/tmp/B.6iXztr/BUILD/gcc-4.7.3/obj-avr/gcc'
make[2]: Entering directory '/tmp/B.6iXztr/BUILD/gcc-4.7.3/obj-avr/gcc'
i686-pld-linux-gcc -c   -O2 -fwrapv -pipe -gdwarf-4 -fno-debug-types-section -fvar-tracking-assignments -g2 -Wp,-D_FORTIFY_SOURCE=2 -fstack-protector-strong --param=ssp-buffer-size=4 -fomit-frame-pointer -march=i686 -fasynchronous-unwind-tables -mtune=pentium4 -gdwarf-4 -fno-debug-types-section -fvar-tracking-assignments -g2  -DIN_GCC -DCROSS_DIRECTORY_STRUCTURE  -W -Wall -Wno-narrowing -Wwrite-strings -Wcast-qual -Wstrict-prototypes -Wmissing-prototypes -Wmissing-format-attribute -pedantic -Wno-long-long -Wno-variadic-macros -Wno-overlength-strings -Wold-style-definition -Wc++-compat   -DHAVE_CONFIG_H -DGENERATOR_FILE -I. -Ibuild -I../../gcc -I../../gcc/build -I../../gcc/../include -I../../gcc/../libcpp/include  -I../../gcc/../libdecnumber -I../../gcc/../libdecnumber/dpd -I../libdecnumber    \
	-o build/genhooks.o ../../gcc/genhooks.c
../../gcc/genhooks.c: In function 'emit_documentation':
../../gcc/genhooks.c:141:7: warning: ignoring return value of 'fscanf', declared with attribute warn_unused_result [-Wunused-result]
       fscanf (f, "%999s", buf);
       ^~~~~~~~~~~~~~~~~~~~~~~~
../../gcc/genhooks.c:132:10: warning: ignoring return value of 'fscanf', declared with attribute warn_unused_result [-Wunused-result]
   while (fscanf (f, "%*[^@]"), buf[0] = '\0',
          ^~~~~~~~~~~~~~~~~~~~
../../gcc/genhooks.c:195:7: warning: ignoring return value of 'fscanf', declared with attribute warn_unused_result [-Wunused-result]
       fscanf (f, "%5[^ \n]", buf);
       ^~~~~~~~~~~~~~~~~~~~~~~~~~~
../../gcc/genhooks.c:201:7: warning: ignoring return value of 'fscanf', declared with attribute warn_unused_result [-Wunused-result]
       fscanf (f, "%999s", buf);
       ^~~~~~~~~~~~~~~~~~~~~~~~
make[2]: Leaving directory '/tmp/B.6iXztr/BUILD/gcc-4.7.3/obj-avr/gcc'
make[2]: Entering directory '/tmp/B.6iXztr/BUILD/gcc-4.7.3/obj-avr/gcc'
gawk -f ../../gcc/opt-gather.awk ../../gcc/ada/gcc-interface/lang.opt ../../gcc/fortran/lang.opt ../../gcc/go/lang.opt ../../gcc/java/lang.opt ../../gcc/lto/lang.opt ../../gcc/c-family/c.opt ../../gcc/common.opt ../../gcc/config/avr/avr-tables.opt ../../gcc/config/avr/avr.opt > tmp-optionlist
/bin/sh ../../gcc/../move-if-change tmp-optionlist optionlist
echo timestamp > s-options
make[2]: Leaving directory '/tmp/B.6iXztr/BUILD/gcc-4.7.3/obj-avr/gcc'
make[2]: Entering directory '/tmp/B.6iXztr/BUILD/gcc-4.7.3/obj-avr/gcc'
i686-pld-linux-gcc -c   -O2 -fwrapv -pipe -gdwarf-4 -fno-debug-types-section -fvar-tracking-assignments -g2 -Wp,-D_FORTIFY_SOURCE=2 -fstack-protector-strong --param=ssp-buffer-size=4 -fomit-frame-pointer -march=i686 -fasynchronous-unwind-tables -mtune=pentium4 -gdwarf-4 -fno-debug-types-section -fvar-tracking-assignments -g2  -DIN_GCC -DCROSS_DIRECTORY_STRUCTURE  -W -Wall -Wno-narrowing -Wwrite-strings -Wcast-qual -Wstrict-prototypes -Wmissing-prototypes -Wmissing-format-attribute -pedantic -Wno-long-long -Wno-variadic-macros -Wno-overlength-strings -Wold-style-definition -Wc++-compat   -DHAVE_CONFIG_H -I. -I. -I../../gcc -I../../gcc/. -I../../gcc/../include -I../../gcc/../libcpp/include  -I../../gcc/../libdecnumber -I../../gcc/../libdecnumber/dpd -I../libdecnumber    ../../gcc/gengtype-parse.c -o gengtype-parse.o
In file included from ../../gcc/gengtype-parse.c:25:
../../gcc/gengtype.h: In function 'set_lang_bitmap':
../../gcc/system.h:674:55: warning: ISO C does not support '__FUNCTION__' predefined identifier [-Wpedantic]
    ((void)(!(EXPR) ? fancy_abort (__FILE__, __LINE__, __FUNCTION__), 0 : 0))
                                                       ^~~~~~~~~~~~
../../gcc/gengtype.h:102:3: note: in expansion of macro 'gcc_assert'
   gcc_assert (inpf);
   ^~~~~~~~~~
../../gcc/gengtype-parse.c: In function 'typedef_decl':
../../gcc/system.h:674:55: warning: ISO C does not support '__FUNCTION__' predefined identifier [-Wpedantic]
    ((void)(!(EXPR) ? fancy_abort (__FILE__, __LINE__, __FUNCTION__), 0 : 0))
                                                       ^~~~~~~~~~~~
../../gcc/gengtype-parse.c:824:3: note: in expansion of macro 'gcc_assert'
   gcc_assert (token () == TYPEDEF);
   ^~~~~~~~~~
make[2]: Leaving directory '/tmp/B.6iXztr/BUILD/gcc-4.7.3/obj-avr/gcc'
make[2]: Entering directory '/tmp/B.6iXztr/BUILD/gcc-4.7.3/obj-avr/gcc'
echo timestamp > gcc.pod
perl ../../gcc/../contrib/texi2pod.pl ../../gcc/doc/invoke.texi > gcc.pod
Unescaped left brace in regex is illegal here in regex; marked by <-- HERE in m/^\@strong{ <-- HERE (.*)}$/ at ../../gcc/../contrib/texi2pod.pl line 319.
make[2]: [Makefile:4451: gcc.pod] Error 255 (ignored)
make[2]: Leaving directory '/tmp/B.6iXztr/BUILD/gcc-4.7.3/obj-avr/gcc'
make[2]: Entering directory '/tmp/B.6iXztr/BUILD/gcc-4.7.3/obj-avr/gcc'
echo timestamp > doc/gpl.7
(pod2man --center="GNU" --release="gcc-4.7.3" --date=2013-04-11 --section=7 gpl.pod > doc/gpl.7.T$$ && \
	mv -f doc/gpl.7.T$$ doc/gpl.7) || \
	(rm -f doc/gpl.7.T$$ && exit 1)
pod2man: unable to format gpl.pod
make[2]: [Makefile:4435: doc/gpl.7] Error 1 (ignored)
make[2]: Leaving directory '/tmp/B.6iXztr/BUILD/gcc-4.7.3/obj-avr/gcc'
make[2]: Entering directory '/tmp/B.6iXztr/BUILD/gcc-4.7.3/obj-avr/gcc'
if [ xinfo = xinfo ]; then \
	makeinfo --split-size=5000000 --split-size=5000000 --no-split -I . -I ../../gcc/doc \
		-I ../../gcc/doc/include -o doc/gcc.info ../../gcc/doc/gcc.texi; \
fi
../../gcc/doc/gcc.texi:89: warning: @tex should only appear at the beginning of a line
../../gcc/doc/gcc.texi:209: no matching `@end tex'
../../gcc/doc/gcc.texi:209: no matching `@end multitable'
../../gcc/doc/gcc.texi:209: no matching `@end titlepage'
make[2]: *** [Makefile:4342: doc/gcc.info] Error 1
make[2]: Leaving directory '/tmp/B.6iXztr/BUILD/gcc-4.7.3/obj-avr/gcc'
make[2]: *** Waiting for unfinished jobs....
make[2]: Entering directory '/tmp/B.6iXztr/BUILD/gcc-4.7.3/obj-avr/gcc'
i686-pld-linux-gcc -c   -O2 -fwrapv -pipe -gdwarf-4 -fno-debug-types-section -fvar-tracking-assignments -g2 -Wp,-D_FORTIFY_SOURCE=2 -fstack-protector-strong --param=ssp-buffer-size=4 -fomit-frame-pointer -march=i686 -fasynchronous-unwind-tables -mtune=pentium4 -gdwarf-4 -fno-debug-types-section -fvar-tracking-assignments -g2  -DIN_GCC -DCROSS_DIRECTORY_STRUCTURE  -W -Wall -Wno-narrowing -Wwrite-strings -Wcast-qual -Wstrict-prototypes -Wmissing-prototypes -Wmissing-format-attribute -pedantic -Wno-long-long -Wno-variadic-macros -Wno-overlength-strings -Wold-style-definition -Wc++-compat   -DHAVE_CONFIG_H -DGENERATOR_FILE -I. -Ibuild -I../../gcc -I../../gcc/build -I../../gcc/../include -I../../gcc/../libcpp/include  -I../../gcc/../libdecnumber -I../../gcc/../libdecnumber/dpd -I../libdecnumber    \
	-o build/genconstants.o ../../gcc/genconstants.c
make[2]: Leaving directory '/tmp/B.6iXztr/BUILD/gcc-4.7.3/obj-avr/gcc'
make[2]: Entering directory '/tmp/B.6iXztr/BUILD/gcc-4.7.3/obj-avr/gcc'
i686-pld-linux-gcc -c   -O2 -fwrapv -pipe -gdwarf-4 -fno-debug-types-section -fvar-tracking-assignments -g2 -Wp,-D_FORTIFY_SOURCE=2 -fstack-protector-strong --param=ssp-buffer-size=4 -fomit-frame-pointer -march=i686 -fasynchronous-unwind-tables -mtune=pentium4 -gdwarf-4 -fno-debug-types-section -fvar-tracking-assignments -g2  -DIN_GCC -DCROSS_DIRECTORY_STRUCTURE  -W -Wall -Wno-narrowing -Wwrite-strings -Wcast-qual -Wstrict-prototypes -Wmissing-prototypes -Wmissing-format-attribute -pedantic -Wno-long-long -Wno-variadic-macros -Wno-overlength-strings -Wold-style-definition -Wc++-compat  -Wno-error -DHAVE_CONFIG_H -I. -I. -I../../gcc -I../../gcc/. -I../../gcc/../include -I../../gcc/../libcpp/include  -I../../gcc/../libdecnumber -I../../gcc/../libdecnumber/dpd -I../libdecnumber    ../../gcc/gengtype-lex.c -o gengtype-lex.o
In file included from /space/rguenther/gcc-4.7.3/gcc-4.7.3/gcc/gengtype-lex.l:30:
../../gcc/gengtype.h: In function 'set_lang_bitmap':
../../gcc/system.h:674:55: warning: ISO C does not support '__FUNCTION__' predefined identifier [-Wpedantic]
    ((void)(!(EXPR) ? fancy_abort (__FILE__, __LINE__, __FUNCTION__), 0 : 0))
                                                       ^~~~~~~~~~~~
../../gcc/gengtype.h:102:3: note: in expansion of macro 'gcc_assert'
   gcc_assert (inpf);
   ^~~~~~~~~~
gengtype-lex.c: In function 'yy_get_next_buffer':
gengtype-lex.c:1096:18: warning: comparison of integer expressions of different signedness: 'int' and 'unsigned int' [-Wsign-compare]
gengtype-lex.c:1887:3: note: in expansion of macro 'YY_INPUT'
gengtype-lex.c: In function 'yylex':
gengtype-lex.c:364:15: warning: this statement may fall through [-Wimplicit-fallthrough=]
/space/rguenther/gcc-4.7.3/gcc-4.7.3/gcc/gengtype-lex.l:134:1: note: in expansion of macro 'YY_DO_BEFORE_ACTION'
/space/rguenther/gcc-4.7.3/gcc-4.7.3/gcc/gengtype-lex.l:131:1: note: here
make[2]: Leaving directory '/tmp/B.6iXztr/BUILD/gcc-4.7.3/obj-avr/gcc'
make[2]: Entering directory '/tmp/B.6iXztr/BUILD/gcc-4.7.3/obj-avr/gcc'
i686-pld-linux-gcc -c   -O2 -fwrapv -pipe -gdwarf-4 -fno-debug-types-section -fvar-tracking-assignments -g2 -Wp,-D_FORTIFY_SOURCE=2 -fstack-protector-strong --param=ssp-buffer-size=4 -fomit-frame-pointer -march=i686 -fasynchronous-unwind-tables -mtune=pentium4 -gdwarf-4 -fno-debug-types-section -fvar-tracking-assignments -g2  -DIN_GCC -DCROSS_DIRECTORY_STRUCTURE  -W -Wall -Wno-narrowing -Wwrite-strings -Wcast-qual -Wstrict-prototypes -Wmissing-prototypes -Wmissing-format-attribute -pedantic -Wno-long-long -Wno-variadic-macros -Wno-overlength-strings -Wold-style-definition -Wc++-compat   -DHAVE_CONFIG_H -I. -I. -I../../gcc -I../../gcc/. -I../../gcc/../include -I../../gcc/../libcpp/include  -I../../gcc/../libdecnumber -I../../gcc/../libdecnumber/dpd -I../libdecnumber    ../../gcc/gengtype-state.c -o gengtype-state.o
In file included from ../../gcc/gengtype-state.c:31:
../../gcc/gengtype.h: In function 'set_lang_bitmap':
../../gcc/system.h:674:55: warning: ISO C does not support '__FUNCTION__' predefined identifier [-Wpedantic]
    ((void)(!(EXPR) ? fancy_abort (__FILE__, __LINE__, __FUNCTION__), 0 : 0))
                                                       ^~~~~~~~~~~~
../../gcc/gengtype.h:102:3: note: in expansion of macro 'gcc_assert'
   gcc_assert (inpf);
   ^~~~~~~~~~
../../gcc/gengtype-state.c: In function 'type_lineloc':
../../gcc/system.h:694:61: warning: ISO C does not support '__FUNCTION__' predefined identifier [-Wpedantic]
 #define gcc_unreachable() (fancy_abort (__FILE__, __LINE__, __FUNCTION__))
                                                             ^~~~~~~~~~~~
../../gcc/gengtype-state.c:50:7: note: in expansion of macro 'gcc_unreachable'
       gcc_unreachable ();
       ^~~~~~~~~~~~~~~
../../gcc/system.h:694:61: warning: ISO C does not support '__FUNCTION__' predefined identifier [-Wpedantic]
 #define gcc_unreachable() (fancy_abort (__FILE__, __LINE__, __FUNCTION__))
                                                             ^~~~~~~~~~~~
../../gcc/gengtype-state.c:63:7: note: in expansion of macro 'gcc_unreachable'
       gcc_unreachable ();
       ^~~~~~~~~~~~~~~
../../gcc/gengtype-state.c: In function 'write_state_fileloc':
../../gcc/system.h:674:55: warning: ISO C does not support '__FUNCTION__' predefined identifier [-Wpedantic]
    ((void)(!(EXPR) ? fancy_abort (__FILE__, __LINE__, __FUNCTION__), 0 : 0))
                                                       ^~~~~~~~~~~~
../../gcc/gengtype-state.c:560:7: note: in expansion of macro 'gcc_assert'
       gcc_assert (floc->file != NULL);
       ^~~~~~~~~~
../../gcc/gengtype-state.c: In function 'write_state_fields':
../../gcc/system.h:674:55: warning: ISO C does not support '__FUNCTION__' predefined identifier [-Wpedantic]
    ((void)(!(EXPR) ? fancy_abort (__FILE__, __LINE__, __FUNCTION__), 0 : 0))
                                                       ^~~~~~~~~~~~
../../gcc/gengtype-state.c:589:3: note: in expansion of macro 'gcc_assert'
   gcc_assert (nbpairs == nbfields);
   ^~~~~~~~~~
../../gcc/gengtype-state.c: In function 'write_state_lang_struct_type':
../../gcc/system.h:674:55: warning: ISO C does not support '__FUNCTION__' predefined identifier [-Wpedantic]
    ((void)(!(EXPR) ? fancy_abort (__FILE__, __LINE__, __FUNCTION__), 0 : 0))
                                                       ^~~~~~~~~~~~
../../gcc/gengtype-state.c:831:7: note: in expansion of macro 'gcc_assert'
       gcc_assert (UNION_OR_STRUCT_P (hty));
       ^~~~~~~~~~
../../gcc/system.h:674:55: warning: ISO C does not support '__FUNCTION__' predefined identifier [-Wpedantic]
    ((void)(!(EXPR) ? fancy_abort (__FILE__, __LINE__, __FUNCTION__), 0 : 0))
                                                       ^~~~~~~~~~~~
../../gcc/gengtype-state.c:832:7: note: in expansion of macro 'gcc_assert'
       gcc_assert (hty->u.s.lang_struct == current);
       ^~~~~~~~~~
../../gcc/system.h:674:55: warning: ISO C does not support '__FUNCTION__' predefined identifier [-Wpedantic]
    ((void)(!(EXPR) ? fancy_abort (__FILE__, __LINE__, __FUNCTION__), 0 : 0))
                                                       ^~~~~~~~~~~~
../../gcc/gengtype-state.c:835:7: note: in expansion of macro 'gcc_assert'
       gcc_assert (strcmp (homoname, hty->u.s.tag) == 0);
       ^~~~~~~~~~
../../gcc/gengtype-state.c: In function 'write_state_gc_used':
../../gcc/system.h:694:61: warning: ISO C does not support '__FUNCTION__' predefined identifier [-Wpedantic]
 #define gcc_unreachable() (fancy_abort (__FILE__, __LINE__, __FUNCTION__))
                                                             ^~~~~~~~~~~~
../../gcc/gengtype-state.c:905:7: note: in expansion of macro 'gcc_unreachable'
       gcc_unreachable ();
       ^~~~~~~~~~~~~~~
../../gcc/gengtype-state.c: In function 'write_state_typedefs':
../../gcc/system.h:674:55: warning: ISO C does not support '__FUNCTION__' predefined identifier [-Wpedantic]
    ((void)(!(EXPR) ? fancy_abort (__FILE__, __LINE__, __FUNCTION__), 0 : 0))
                                                       ^~~~~~~~~~~~
../../gcc/gengtype-state.c:1034:3: note: in expansion of macro 'gcc_assert'
   gcc_assert (nbpairs == nbtypedefs);
   ^~~~~~~~~~
../../gcc/gengtype-state.c: In function 'write_state_variables':
../../gcc/system.h:674:55: warning: ISO C does not support '__FUNCTION__' predefined identifier [-Wpedantic]
    ((void)(!(EXPR) ? fancy_abort (__FILE__, __LINE__, __FUNCTION__), 0 : 0))
                                                       ^~~~~~~~~~~~
../../gcc/gengtype-state.c:1086:3: note: in expansion of macro 'gcc_assert'
   gcc_assert (nbpairs == nbvars);
   ^~~~~~~~~~
../../gcc/gengtype-state.c: In function 'record_type':
../../gcc/system.h:674:55: warning: ISO C does not support '__FUNCTION__' predefined identifier [-Wpedantic]
    ((void)(!(EXPR) ? fancy_abort (__FILE__, __LINE__, __FUNCTION__), 0 : 0))
                                                       ^~~~~~~~~~~~
../../gcc/gengtype-state.c:1251:3: note: in expansion of macro 'gcc_assert'
   gcc_assert (slot);
   ^~~~~~~~~~
../../gcc/gengtype-state.c: In function 'read_state_fileloc':
../../gcc/system.h:674:55: warning: ISO C does not support '__FUNCTION__' predefined identifier [-Wpedantic]
    ((void)(!(EXPR) ? fancy_abort (__FILE__, __LINE__, __FUNCTION__), 0 : 0))
                                                       ^~~~~~~~~~~~
../../gcc/gengtype-state.c:1685:3: note: in expansion of macro 'gcc_assert'
   gcc_assert (floc != NULL);
   ^~~~~~~~~~
../../gcc/system.h:674:55: warning: ISO C does not support '__FUNCTION__' predefined identifier [-Wpedantic]
    ((void)(!(EXPR) ? fancy_abort (__FILE__, __LINE__, __FUNCTION__), 0 : 0))
                                                       ^~~~~~~~~~~~
../../gcc/gengtype-state.c:1686:3: note: in expansion of macro 'gcc_assert'
   gcc_assert (srcdir != NULL);
   ^~~~~~~~~~
../../gcc/gengtype-state.c: In function 'read_state_files_list':
../../gcc/gengtype-state.c:2346:34: warning: comparison of constant '4' with boolean expression is always false [-Wbool-compare]
       if (!state_token_kind (t0) == STOK_RIGHTPAR)
                                  ^~
../../gcc/gengtype-state.c:2346:34: warning: logical not is only applied to the left hand side of comparison [-Wlogical-not-parentheses]
../../gcc/gengtype-state.c:2346:11: note: add parentheses around left hand side expression to silence this warning
       if (!state_token_kind (t0) == STOK_RIGHTPAR)
           ^~~~~~~~~~~~~~~~~~~~~~
           (                     )
make[2]: Leaving directory '/tmp/B.6iXztr/BUILD/gcc-4.7.3/obj-avr/gcc'
make[2]: Entering directory '/tmp/B.6iXztr/BUILD/gcc-4.7.3/obj-avr/gcc'
if [ xinfo = xinfo ]; then \
	makeinfo --split-size=5000000 --split-size=5000000 --no-split -I . -I ../../gcc/doc \
		-I ../../gcc/doc/include -o doc/cppinternals.info ../../gcc/doc/cppinternals.texi; \
fi
make[2]: Leaving directory '/tmp/B.6iXztr/BUILD/gcc-4.7.3/obj-avr/gcc'
make[2]: Entering directory '/tmp/B.6iXztr/BUILD/gcc-4.7.3/obj-avr/gcc'
if test yes = yes \
   || test -n ""; then \
  /bin/sh ../../gcc/genmultilib \
    "mmcu=avr2/mmcu=avr25/mmcu=avr3/mmcu=avr31/mmcu=avr35/mmcu=avr4/mmcu=avr5/mmcu=avr51/mmcu=avr6/mmcu=avrxmega2/mmcu=avrxmega4/mmcu=avrxmega5/mmcu=avrxmega6/mmcu=avrxmega7 msp8" \
    "avr2 avr25 avr3 avr31 avr35 avr4 avr5 avr51 avr6 avrxmega2 avrxmega4 avrxmega5 avrxmega6 avrxmega7 tiny-stack avr25/tiny-stack" \
    "mmcu?avr2=mmcu?at90s2313 mmcu?avr2=mmcu?at90s2323 mmcu?avr2=mmcu?at90s2333 mmcu?avr2=mmcu?at90s2343 mmcu?avr2=mmcu?attiny22 mmcu?avr2=mmcu?attiny26 mmcu?avr2=mmcu?at90s4414 mmcu?avr2=mmcu?at90s4433 mmcu?avr2=mmcu?at90s4434 mmcu?avr2=mmcu?at90s8515 mmcu?avr2=mmcu?at90c8534 mmcu?avr2=mmcu?at90s8535 mmcu?avr25=mmcu?attiny13 mmcu?avr25=mmcu?attiny13a mmcu?avr25=mmcu?attiny2313 mmcu?avr25=mmcu?attiny2313a mmcu?avr25=mmcu?attiny24 mmcu?avr25=mmcu?attiny24a mmcu?avr25=mmcu?attiny4313 mmcu?avr25=mmcu?attiny44 mmcu?avr25=mmcu?attiny44a mmcu?avr25=mmcu?attiny84 mmcu?avr25=mmcu?attiny84a mmcu?avr25=mmcu?attiny25 mmcu?avr25=mmcu?attiny45 mmcu?avr25=mmcu?attiny85 mmcu?avr25=mmcu?attiny261 mmcu?avr25=mmcu?attiny261a mmcu?avr25=mmcu?attiny461 mmcu?avr25=mmcu?attiny461a mmcu?avr25=mmcu?attiny861 mmcu?avr25=mmcu?attiny861a mmcu?avr25=mmcu?attiny43u mmcu?avr25=mmcu?attiny87 mmcu?avr25=mmcu?attiny48 mmcu?avr25=mmcu?attiny88 mmcu?avr25=mmcu?at86rf401 mmcu?avr3=mmcu?at43usb355 mmcu?avr3=mmcu?at76c711 mmcu?avr31=mmcu?atmega103 mmcu?avr31=mmcu?at43usb320 mmcu?avr35=mmcu?at90usb82 mmcu?avr35=mmcu?at90usb162 mmcu?avr35=mmcu?atmega8u2 mmcu?avr35=mmcu?atmega16u2 mmcu?avr35=mmcu?atmega32u2 mmcu?avr35=mmcu?attiny167 mmcu?avr4=mmcu?ata6289 mmcu?avr4=mmcu?atmega8 mmcu?avr4=mmcu?atmega48 mmcu?avr4=mmcu?atmega48a mmcu?avr4=mmcu?atmega48p mmcu?avr4=mmcu?atmega88 mmcu?avr4=mmcu?atmega88a mmcu?avr4=mmcu?atmega88p mmcu?avr4=mmcu?atmega88pa mmcu?avr4=mmcu?atmega8515 mmcu?avr4=mmcu?atmega8535 mmcu?avr4=mmcu?atmega8hva mmcu?avr4=mmcu?at90pwm1 mmcu?avr4=mmcu?at90pwm2 mmcu?avr4=mmcu?at90pwm2b mmcu?avr4=mmcu?at90pwm3 mmcu?avr4=mmcu?at90pwm3b mmcu?avr4=mmcu?at90pwm81 mmcu?avr5=mmcu?atmega16 mmcu?avr5=mmcu?atmega16a mmcu?avr5=mmcu?atmega161 mmcu?avr5=mmcu?atmega162 mmcu?avr5=mmcu?atmega163 mmcu?avr5=mmcu?atmega164a mmcu?avr5=mmcu?atmega164p mmcu?avr5=mmcu?atmega165 mmcu?avr5=mmcu?atmega165a mmcu?avr5=mmcu?atmega165p mmcu?avr5=mmcu?atmega168 mmcu?avr5=mmcu?atmega168a mmcu?avr5=mmcu?atmega168p mmcu?avr5=mmcu?atmega169 mmcu?avr5=mmcu?atmega169a mmcu?avr5=mmcu?atmega169p mmcu?avr5=mmcu?atmega169pa mmcu?avr5=mmcu?atmega32 mmcu?avr5=mmcu?atmega323 mmcu?avr5=mmcu?atmega324a mmcu?avr5=mmcu?atmega324p mmcu?avr5=mmcu?atmega324pa mmcu?avr5=mmcu?atmega325 mmcu?avr5=mmcu?atmega325a mmcu?avr5=mmcu?atmega325p mmcu?avr5=mmcu?atmega3250 mmcu?avr5=mmcu?atmega3250a mmcu?avr5=mmcu?atmega3250p mmcu?avr5=mmcu?atmega328 mmcu?avr5=mmcu?atmega328p mmcu?avr5=mmcu?atmega329 mmcu?avr5=mmcu?atmega329a mmcu?avr5=mmcu?atmega329p mmcu?avr5=mmcu?atmega329pa mmcu?avr5=mmcu?atmega3290 mmcu?avr5=mmcu?atmega3290a mmcu?avr5=mmcu?atmega3290p mmcu?avr5=mmcu?atmega406 mmcu?avr5=mmcu?atmega64 mmcu?avr5=mmcu?atmega640 mmcu?avr5=mmcu?atmega644 mmcu?avr5=mmcu?atmega644a mmcu?avr5=mmcu?atmega644p mmcu?avr5=mmcu?atmega644pa mmcu?avr5=mmcu?atmega645 mmcu?avr5=mmcu?atmega645a mmcu?avr5=mmcu?atmega645p mmcu?avr5=mmcu?atmega6450 mmcu?avr5=mmcu?atmega6450a mmcu?avr5=mmcu?atmega6450p mmcu?avr5=mmcu?atmega649 mmcu?avr5=mmcu?atmega649a mmcu?avr5=mmcu?atmega649p mmcu?avr5=mmcu?atmega6490 mmcu?avr5=mmcu?atmega16hva mmcu?avr5=mmcu?atmega16hva2 mmcu?avr5=mmcu?atmega16hvb mmcu?avr5=mmcu?atmega32hvb mmcu?avr5=mmcu?atmega64hve mmcu?avr5=mmcu?at90can32 mmcu?avr5=mmcu?at90can64 mmcu?avr5=mmcu?at90pwm216 mmcu?avr5=mmcu?at90pwm316 mmcu?avr5=mmcu?atmega32c1 mmcu?avr5=mmcu?atmega64c1 mmcu?avr5=mmcu?atmega16m1 mmcu?avr5=mmcu?atmega32m1 mmcu?avr5=mmcu?atmega64m1 mmcu?avr5=mmcu?atmega16u4 mmcu?avr5=mmcu?atmega32u4 mmcu?avr5=mmcu?atmega32u6 mmcu?avr5=mmcu?at90scr100 mmcu?avr5=mmcu?at90usb646 mmcu?avr5=mmcu?at90usb647 mmcu?avr5=mmcu?at94k mmcu?avr5=mmcu?m3000 mmcu?avr51=mmcu?atmega128 mmcu?avr51=mmcu?atmega1280 mmcu?avr51=mmcu?atmega1281 mmcu?avr51=mmcu?atmega1284p mmcu?avr51=mmcu?atmega128rfa1 mmcu?avr51=mmcu?at90can128 mmcu?avr51=mmcu?at90usb1286 mmcu?avr51=mmcu?at90usb1287 mmcu?avr6=mmcu?atmega2560 mmcu?avr6=mmcu?atmega2561 mmcu?avrxmega2=mmcu?atxmega16a4 mmcu?avrxmega2=mmcu?atxmega16d4 mmcu?avrxmega2=mmcu?atxmega16x1 mmcu?avrxmega2=mmcu?atxmega32a4 mmcu?avrxmega2=mmcu?atxmega32d4 mmcu?avrxmega2=mmcu?atxmega32x1 mmcu?avrxmega4=mmcu?atxmega64a3 mmcu?avrxmega4=mmcu?atxmega64d3 mmcu?avrxmega5=mmcu?atxmega64a1 mmcu?avrxmega5=mmcu?atxmega64a1u mmcu?avrxmega6=mmcu?atxmega128a3 mmcu?avrxmega6=mmcu?atxmega128d3 mmcu?avrxmega6=mmcu?atxmega192a3 mmcu?avrxmega6=mmcu?atxmega192d3 mmcu?avrxmega6=mmcu?atxmega256a3 mmcu?avrxmega6=mmcu?atxmega256a3b mmcu?avrxmega6=mmcu?atxmega256a3bu mmcu?avrxmega6=mmcu?atxmega256d3 mmcu?avrxmega7=mmcu?atxmega128a1 mmcu?avrxmega7=mmcu?atxmega128a1u" \
    "mmcu=avr3/msp8 mmcu=avr31/msp8 mmcu=avr35/msp8 mmcu=avr4/msp8 mmcu=avr5/msp8 mmcu=avr51/msp8 mmcu=avr6/msp8 mmcu=avrxmega2/msp8 mmcu=avrxmega4/msp8 mmcu=avrxmega5/msp8 mmcu=avrxmega6/msp8 mmcu=avrxmega7/msp8" \
    "" \
    "" \
    "" \
    "" \
    "yes" \
    > tmp-mlib.h; \
else \
  /bin/sh ../../gcc/genmultilib '' '' '' '' '' '' '' "" no \
    > tmp-mlib.h; \
fi
/bin/sh ../../gcc/../move-if-change tmp-mlib.h multilib.h
echo timestamp > s-mlib
make[2]: Leaving directory '/tmp/B.6iXztr/BUILD/gcc-4.7.3/obj-avr/gcc'
make[2]: Entering directory '/tmp/B.6iXztr/BUILD/gcc-4.7.3/obj-avr/gcc'
i686-pld-linux-gcc -c   -O2 -fwrapv -pipe -gdwarf-4 -fno-debug-types-section -fvar-tracking-assignments -g2 -Wp,-D_FORTIFY_SOURCE=2 -fstack-protector-strong --param=ssp-buffer-size=4 -fomit-frame-pointer -march=i686 -fasynchronous-unwind-tables -mtune=pentium4 -gdwarf-4 -fno-debug-types-section -fvar-tracking-assignments -g2  -DIN_GCC -DCROSS_DIRECTORY_STRUCTURE  -W -Wall -Wno-narrowing -Wwrite-strings -Wcast-qual -Wstrict-prototypes -Wmissing-prototypes -Wmissing-format-attribute -pedantic -Wno-long-long -Wno-variadic-macros -Wno-overlength-strings -Wold-style-definition -Wc++-compat   -DHAVE_CONFIG_H -I. -I. -I../../gcc -I../../gcc/. -I../../gcc/../include -I../../gcc/../libcpp/include  -I../../gcc/../libdecnumber -I../../gcc/../libdecnumber/dpd -I../libdecnumber    ../../gcc/gengtype.c -o gengtype.o
In file included from ../../gcc/gengtype.c:26:
../../gcc/gengtype.h: In function 'set_lang_bitmap':
../../gcc/system.h:674:55: warning: ISO C does not support '__FUNCTION__' predefined identifier [-Wpedantic]
    ((void)(!(EXPR) ? fancy_abort (__FILE__, __LINE__, __FUNCTION__), 0 : 0))
                                                       ^~~~~~~~~~~~
../../gcc/gengtype.h:102:3: note: in expansion of macro 'gcc_assert'
   gcc_assert (inpf);
   ^~~~~~~~~~
../../gcc/gengtype.c: In function 'error_at_line':
../../gcc/system.h:674:55: warning: ISO C does not support '__FUNCTION__' predefined identifier [-Wpedantic]
    ((void)(!(EXPR) ? fancy_abort (__FILE__, __LINE__, __FUNCTION__), 0 : 0))
                                                       ^~~~~~~~~~~~
../../gcc/gengtype.c:109:3: note: in expansion of macro 'gcc_assert'
   gcc_assert (pos != NULL && pos->file != NULL);
   ^~~~~~~~~~
../../gcc/gengtype.c: In function 'read_input_list':
../../gcc/system.h:674:55: warning: ISO C does not support '__FUNCTION__' predefined identifier [-Wpedantic]
    ((void)(!(EXPR) ? fancy_abort (__FILE__, __LINE__, __FUNCTION__), 0 : 0))
                                                       ^~~~~~~~~~~~
../../gcc/gengtype.c:362:4: note: in expansion of macro 'gcc_assert'
    gcc_assert (here <= limit);
    ^~~~~~~~~~
../../gcc/system.h:674:55: warning: ISO C does not support '__FUNCTION__' predefined identifier [-Wpedantic]
    ((void)(!(EXPR) ? fancy_abort (__FILE__, __LINE__, __FUNCTION__), 0 : 0))
                                                       ^~~~~~~~~~~~
../../gcc/gengtype.c:368:8: note: in expansion of macro 'gcc_assert'
        gcc_assert (langno <= num_lang_dirs);
        ^~~~~~~~~~
../../gcc/system.h:674:55: warning: ISO C does not support '__FUNCTION__' predefined identifier [-Wpedantic]
    ((void)(!(EXPR) ? fancy_abort (__FILE__, __LINE__, __FUNCTION__), 0 : 0))
                                                       ^~~~~~~~~~~~
../../gcc/gengtype.c:386:8: note: in expansion of macro 'gcc_assert'
        gcc_assert (nfiles <= num_gt_files);
        ^~~~~~~~~~
../../gcc/gengtype.c: In function 'create_file':
../../gcc/system.h:674:55: warning: ISO C does not support '__FUNCTION__' predefined identifier [-Wpedantic]
    ((void)(!(EXPR) ? fancy_abort (__FILE__, __LINE__, __FUNCTION__), 0 : 0))
                                                       ^~~~~~~~~~~~
../../gcc/gengtype.c:1484:3: note: in expansion of macro 'gcc_assert'
   gcc_assert (name != NULL);
   ^~~~~~~~~~
../../gcc/system.h:674:55: warning: ISO C does not support '__FUNCTION__' predefined identifier [-Wpedantic]
    ((void)(!(EXPR) ? fancy_abort (__FILE__, __LINE__, __FUNCTION__), 0 : 0))
                                                       ^~~~~~~~~~~~
../../gcc/gengtype.c:1485:3: note: in expansion of macro 'gcc_assert'
   gcc_assert (oname != NULL);
   ^~~~~~~~~~
../../gcc/gengtype.c: In function 'matching_file_name_substitute':
../../gcc/system.h:694:61: warning: ISO C does not support '__FUNCTION__' predefined identifier [-Wpedantic]
 #define gcc_unreachable() (fancy_abort (__FILE__, __LINE__, __FUNCTION__))
                                                             ^~~~~~~~~~~~
../../gcc/gengtype.c:1946:6: note: in expansion of macro 'gcc_unreachable'
      gcc_unreachable();
      ^~~~~~~~~~~~~~~
../../gcc/gengtype.c: In function 'get_output_file_with_visibility':
../../gcc/system.h:694:61: warning: ISO C does not support '__FUNCTION__' predefined identifier [-Wpedantic]
 #define gcc_unreachable() (fancy_abort (__FILE__, __LINE__, __FUNCTION__))
                                                             ^~~~~~~~~~~~
../../gcc/gengtype.c:2027:3: note: in expansion of macro 'gcc_unreachable'
   gcc_unreachable ();
   ^~~~~~~~~~~~~~~
../../gcc/system.h:694:61: warning: ISO C does not support '__FUNCTION__' predefined identifier [-Wpedantic]
 #define gcc_unreachable() (fancy_abort (__FILE__, __LINE__, __FUNCTION__))
                                                             ^~~~~~~~~~~~
../../gcc/gengtype.c:2093:7: note: in expansion of macro 'gcc_unreachable'
       gcc_unreachable ();
       ^~~~~~~~~~~~~~~
../../gcc/system.h:674:55: warning: ISO C does not support '__FUNCTION__' predefined identifier [-Wpedantic]
    ((void)(!(EXPR) ? fancy_abort (__FILE__, __LINE__, __FUNCTION__), 0 : 0))
                                                       ^~~~~~~~~~~~
../../gcc/gengtype.c:2110:3: note: in expansion of macro 'gcc_assert'
   gcc_assert (r && r->name);
   ^~~~~~~~~~
../../gcc/gengtype.c: In function 'output_mangled_typename':
../../gcc/system.h:694:61: warning: ISO C does not support '__FUNCTION__' predefined identifier [-Wpedantic]
 #define gcc_unreachable() (fancy_abort (__FILE__, __LINE__, __FUNCTION__))
                                                             ^~~~~~~~~~~~
../../gcc/gengtype.c:2307:2: note: in expansion of macro 'gcc_unreachable'
  gcc_unreachable ();
  ^~~~~~~~~~~~~~~
../../gcc/system.h:694:61: warning: ISO C does not support '__FUNCTION__' predefined identifier [-Wpedantic]
 #define gcc_unreachable() (fancy_abort (__FILE__, __LINE__, __FUNCTION__))
                                                             ^~~~~~~~~~~~
../../gcc/gengtype.c:2335:2: note: in expansion of macro 'gcc_unreachable'
  gcc_unreachable ();
  ^~~~~~~~~~~~~~~
../../gcc/gengtype.c: In function 'walk_type':
../../gcc/system.h:694:61: warning: ISO C does not support '__FUNCTION__' predefined identifier [-Wpedantic]
 #define gcc_unreachable() (fancy_abort (__FILE__, __LINE__, __FUNCTION__))
                                                             ^~~~~~~~~~~~
../../gcc/gengtype.c:2839:7: note: in expansion of macro 'gcc_unreachable'
       gcc_unreachable ();
       ^~~~~~~~~~~~~~~
../../gcc/gengtype.c: In function 'write_types_process_field':
../../gcc/system.h:694:61: warning: ISO C does not support '__FUNCTION__' predefined identifier [-Wpedantic]
 #define gcc_unreachable() (fancy_abort (__FILE__, __LINE__, __FUNCTION__))
                                                             ^~~~~~~~~~~~
../../gcc/gengtype.c:2855:7: note: in expansion of macro 'gcc_unreachable'
       gcc_unreachable ();
       ^~~~~~~~~~~~~~~
../../gcc/system.h:694:61: warning: ISO C does not support '__FUNCTION__' predefined identifier [-Wpedantic]
 #define gcc_unreachable() (fancy_abort (__FILE__, __LINE__, __FUNCTION__))
                                                             ^~~~~~~~~~~~
../../gcc/gengtype.c:2909:7: note: in expansion of macro 'gcc_unreachable'
       gcc_unreachable ();
       ^~~~~~~~~~~~~~~
../../gcc/gengtype.c: In function 'get_output_file_for_structure':
../../gcc/system.h:674:55: warning: ISO C does not support '__FUNCTION__' predefined identifier [-Wpedantic]
    ((void)(!(EXPR) ? fancy_abort (__FILE__, __LINE__, __FUNCTION__), 0 : 0))
                                                       ^~~~~~~~~~~~
../../gcc/gengtype.c:2941:3: note: in expansion of macro 'gcc_assert'
   gcc_assert (UNION_OR_STRUCT_P (s));
   ^~~~~~~~~~
../../gcc/gengtype.c: In function 'write_types_local_process_field':
../../gcc/system.h:694:61: warning: ISO C does not support '__FUNCTION__' predefined identifier [-Wpedantic]
 #define gcc_unreachable() (fancy_abort (__FILE__, __LINE__, __FUNCTION__))
                                                             ^~~~~~~~~~~~
../../gcc/gengtype.c:3319:7: note: in expansion of macro 'gcc_unreachable'
       gcc_unreachable ();
       ^~~~~~~~~~~~~~~
../../gcc/gengtype.c: In function 'write_roots':
../../gcc/system.h:674:55: warning: ISO C does not support '__FUNCTION__' predefined identifier [-Wpedantic]
    ((void)(!(EXPR) ? fancy_abort (__FILE__, __LINE__, __FUNCTION__), 0 : 0))
                                                       ^~~~~~~~~~~~
../../gcc/gengtype.c:3930:4: note: in expansion of macro 'gcc_assert'
    gcc_assert (fli->file);
    ^~~~~~~~~~
../../gcc/gengtype.c: In function 'write_typed_alloc_def':
../../gcc/system.h:674:55: warning: ISO C does not support '__FUNCTION__' predefined identifier [-Wpedantic]
    ((void)(!(EXPR) ? fancy_abort (__FILE__, __LINE__, __FUNCTION__), 0 : 0))
                                                       ^~~~~~~~~~~~
../../gcc/gengtype.c:4267:3: note: in expansion of macro 'gcc_assert'
   gcc_assert (f != NULL);
   ^~~~~~~~~~
../../gcc/gengtype.c: In function 'write_typed_struct_alloc_def':
../../gcc/system.h:674:55: warning: ISO C does not support '__FUNCTION__' predefined identifier [-Wpedantic]
    ((void)(!(EXPR) ? fancy_abort (__FILE__, __LINE__, __FUNCTION__), 0 : 0))
                                                       ^~~~~~~~~~~~
../../gcc/gengtype.c:4296:3: note: in expansion of macro 'gcc_assert'
   gcc_assert (UNION_OR_STRUCT_P (s));
   ^~~~~~~~~~
../../gcc/gengtype.c: In function 'write_typed_alloc_defns':
../../gcc/system.h:674:55: warning: ISO C does not support '__FUNCTION__' predefined identifier [-Wpedantic]
    ((void)(!(EXPR) ? fancy_abort (__FILE__, __LINE__, __FUNCTION__), 0 : 0))
                                                       ^~~~~~~~~~~~
../../gcc/gengtype.c:4324:3: note: in expansion of macro 'gcc_assert'
   gcc_assert (f != NULL);
   ^~~~~~~~~~
../../gcc/system.h:674:55: warning: ISO C does not support '__FUNCTION__' predefined identifier [-Wpedantic]
    ((void)(!(EXPR) ? fancy_abort (__FILE__, __LINE__, __FUNCTION__), 0 : 0))
                                                       ^~~~~~~~~~~~
../../gcc/gengtype.c:4331:7: note: in expansion of macro 'gcc_assert'
       gcc_assert (UNION_OR_STRUCT_P (s));
       ^~~~~~~~~~
../../gcc/gengtype.c: In function 'output_typename':
../../gcc/system.h:694:61: warning: ISO C does not support '__FUNCTION__' predefined identifier [-Wpedantic]
 #define gcc_unreachable() (fancy_abort (__FILE__, __LINE__, __FUNCTION__))
                                                             ^~~~~~~~~~~~
../../gcc/gengtype.c:4412:7: note: in expansion of macro 'gcc_unreachable'
       gcc_unreachable ();
       ^~~~~~~~~~~~~~~
../../gcc/gengtype.c: In function 'dump_typekind':
../../gcc/system.h:694:61: warning: ISO C does not support '__FUNCTION__' predefined identifier [-Wpedantic]
 #define gcc_unreachable() (fancy_abort (__FILE__, __LINE__, __FUNCTION__))
                                                             ^~~~~~~~~~~~
../../gcc/gengtype.c:4492:7: note: in expansion of macro 'gcc_unreachable'
       gcc_unreachable ();
       ^~~~~~~~~~~~~~~
../../gcc/gengtype.c: In function 'dump_gc_used':
../../gcc/system.h:694:61: warning: ISO C does not support '__FUNCTION__' predefined identifier [-Wpedantic]
 #define gcc_unreachable() (fancy_abort (__FILE__, __LINE__, __FUNCTION__))
                                                             ^~~~~~~~~~~~
../../gcc/gengtype.c:4518:7: note: in expansion of macro 'gcc_unreachable'
       gcc_unreachable ();
       ^~~~~~~~~~~~~~~
../../gcc/gengtype.c: In function 'dump_options':
../../gcc/system.h:694:61: warning: ISO C does not support '__FUNCTION__' predefined identifier [-Wpedantic]
 #define gcc_unreachable() (fancy_abort (__FILE__, __LINE__, __FUNCTION__))
                                                             ^~~~~~~~~~~~
../../gcc/gengtype.c:4546:4: note: in expansion of macro 'gcc_unreachable'
    gcc_unreachable ();
    ^~~~~~~~~~~~~~~
../../gcc/gengtype.c: In function 'dump_type_u_s':
../../gcc/system.h:674:55: warning: ISO C does not support '__FUNCTION__' predefined identifier [-Wpedantic]
    ((void)(!(EXPR) ? fancy_abort (__FILE__, __LINE__, __FUNCTION__), 0 : 0))
                                                       ^~~~~~~~~~~~
../../gcc/gengtype.c:4571:3: note: in expansion of macro 'gcc_assert'
   gcc_assert (t->kind == TYPE_STRUCT || t->kind == TYPE_UNION
   ^~~~~~~~~~
../../gcc/gengtype.c: In function 'dump_type_u_a':
../../gcc/system.h:674:55: warning: ISO C does not support '__FUNCTION__' predefined identifier [-Wpedantic]
    ((void)(!(EXPR) ? fancy_abort (__FILE__, __LINE__, __FUNCTION__), 0 : 0))
                                                       ^~~~~~~~~~~~
../../gcc/gengtype.c:4597:3: note: in expansion of macro 'gcc_assert'
   gcc_assert (t->kind == TYPE_ARRAY);
   ^~~~~~~~~~
../../gcc/gengtype.c: In function 'dump_type_u_param_struct':
../../gcc/system.h:674:55: warning: ISO C does not support '__FUNCTION__' predefined identifier [-Wpedantic]
    ((void)(!(EXPR) ? fancy_abort (__FILE__, __LINE__, __FUNCTION__), 0 : 0))
                                                       ^~~~~~~~~~~~
../../gcc/gengtype.c:4608:3: note: in expansion of macro 'gcc_assert'
   gcc_assert (t->kind == TYPE_PARAM_STRUCT);
   ^~~~~~~~~~
../../gcc/gengtype.c: In function 'dump_type':
../../gcc/system.h:694:61: warning: ISO C does not support '__FUNCTION__' predefined identifier [-Wpedantic]
 #define gcc_unreachable() (fancy_abort (__FILE__, __LINE__, __FUNCTION__))
                                                             ^~~~~~~~~~~~
../../gcc/gengtype.c:4681:7: note: in expansion of macro 'gcc_unreachable'
       gcc_unreachable ();
       ^~~~~~~~~~~~~~~
../../gcc/gengtype.c: In function 'input_file_by_name':
../../gcc/system.h:674:55: warning: ISO C does not support '__FUNCTION__' predefined identifier [-Wpedantic]
    ((void)(!(EXPR) ? fancy_abort (__FILE__, __LINE__, __FUNCTION__), 0 : 0))
                                                       ^~~~~~~~~~~~
../../gcc/gengtype.c:4893:3: note: in expansion of macro 'gcc_assert'
   gcc_assert (slot != NULL);
   ^~~~~~~~~~
../../gcc/gengtype.c: In function 'htab_hash_inputfile':
../../gcc/system.h:674:55: warning: ISO C does not support '__FUNCTION__' predefined identifier [-Wpedantic]
    ((void)(!(EXPR) ? fancy_abort (__FILE__, __LINE__, __FUNCTION__), 0 : 0))
                                                       ^~~~~~~~~~~~
../../gcc/gengtype.c:4910:3: note: in expansion of macro 'gcc_assert'
   gcc_assert (inpf);
   ^~~~~~~~~~
../../gcc/gengtype.c: In function 'htab_eq_inputfile':
../../gcc/system.h:674:55: warning: ISO C does not support '__FUNCTION__' predefined identifier [-Wpedantic]
    ((void)(!(EXPR) ? fancy_abort (__FILE__, __LINE__, __FUNCTION__), 0 : 0))
                                                       ^~~~~~~~~~~~
../../gcc/gengtype.c:4919:3: note: in expansion of macro 'gcc_assert'
   gcc_assert (inpfx != NULL && inpfy != NULL);
   ^~~~~~~~~~
make[2]: Leaving directory '/tmp/B.6iXztr/BUILD/gcc-4.7.3/obj-avr/gcc'
make[2]: Entering directory '/tmp/B.6iXztr/BUILD/gcc-4.7.3/obj-avr/gcc'
if [ xinfo = xinfo ]; then \
	makeinfo --split-size=5000000 --split-size=5000000 --no-split -I ../../gcc/doc \
		-I ../../gcc/doc/include -o doc/gccinstall.info ../../gcc/doc/install.texi; \
fi
../../gcc/doc/install.texi:3162: warning: @anchor should not appear in @heading
../../gcc/doc/install.texi:3177: warning: @anchor should not appear in @heading
../../gcc/doc/install.texi:3234: warning: @anchor should not appear in @heading
../../gcc/doc/install.texi:3241: warning: @anchor should not appear in @heading
../../gcc/doc/install.texi:3250: warning: @anchor should not appear in @heading
../../gcc/doc/install.texi:3287: warning: @anchor should not appear in @heading
../../gcc/doc/install.texi:3304: warning: @anchor should not appear in @heading
../../gcc/doc/install.texi:3327: warning: @anchor should not appear in @heading
../../gcc/doc/install.texi:3362: warning: @anchor should not appear in @heading
../../gcc/doc/install.texi:3374: warning: @anchor should not appear in @heading
../../gcc/doc/install.texi:3381: warning: @anchor should not appear in @heading
../../gcc/doc/install.texi:3419: warning: @anchor should not appear in @heading
../../gcc/doc/install.texi:3432: warning: @anchor should not appear in @heading
../../gcc/doc/install.texi:3484: warning: @anchor should not appear in @heading
../../gcc/doc/install.texi:3497: warning: @anchor should not appear in @heading
../../gcc/doc/install.texi:3608: warning: @anchor should not appear in @heading
../../gcc/doc/install.texi:3617: warning: @anchor should not appear in @heading
../../gcc/doc/install.texi:3629: warning: @anchor should not appear in @heading
../../gcc/doc/install.texi:3649: warning: @anchor should not appear in @heading
../../gcc/doc/install.texi:3678: warning: @anchor should not appear in @heading
../../gcc/doc/install.texi:3698: warning: @anchor should not appear in @heading
../../gcc/doc/install.texi:3713: warning: @anchor should not appear in @heading
../../gcc/doc/install.texi:3863: warning: @anchor should not appear in @heading
../../gcc/doc/install.texi:3870: warning: @anchor should not appear in @heading
../../gcc/doc/install.texi:3877: warning: @anchor should not appear in @heading
../../gcc/doc/install.texi:3884: warning: @anchor should not appear in @heading
../../gcc/doc/install.texi:3891: warning: @anchor should not appear in @heading
../../gcc/doc/install.texi:3898: warning: @anchor should not appear in @heading
../../gcc/doc/install.texi:3926: warning: @anchor should not appear in @heading
../../gcc/doc/install.texi:3936: warning: @anchor should not appear in @heading
../../gcc/doc/install.texi:3943: warning: @anchor should not appear in @heading
../../gcc/doc/install.texi:3950: warning: @anchor should not appear in @heading
../../gcc/doc/install.texi:4002: warning: @anchor should not appear in @heading
../../gcc/doc/install.texi:4009: warning: @anchor should not appear in @heading
../../gcc/doc/install.texi:4108: warning: @anchor should not appear in @heading
../../gcc/doc/install.texi:4115: warning: @anchor should not appear in @heading
../../gcc/doc/install.texi:4127: warning: @anchor should not appear in @heading
../../gcc/doc/install.texi:4143: warning: @anchor should not appear in @heading
../../gcc/doc/install.texi:4149: warning: @anchor should not appear in @heading
../../gcc/doc/install.texi:4156: warning: @anchor should not appear in @heading
../../gcc/doc/install.texi:4162: warning: @anchor should not appear in @heading
../../gcc/doc/install.texi:4169: warning: @anchor should not appear in @heading
../../gcc/doc/install.texi:4175: warning: @anchor should not appear in @heading
../../gcc/doc/install.texi:4181: warning: @anchor should not appear in @heading
../../gcc/doc/install.texi:4188: warning: @anchor should not appear in @heading
../../gcc/doc/install.texi:4194: warning: @anchor should not appear in @heading
../../gcc/doc/install.texi:4201: warning: @anchor should not appear in @heading
../../gcc/doc/install.texi:4209: warning: @anchor should not appear in @heading
../../gcc/doc/install.texi:4215: warning: @anchor should not appear in @heading
../../gcc/doc/install.texi:4221: warning: @anchor should not appear in @heading
../../gcc/doc/install.texi:4232: warning: @anchor should not appear in @heading
../../gcc/doc/install.texi:4353: warning: @anchor should not appear in @heading
../../gcc/doc/install.texi:4368: warning: @anchor should not appear in @heading
../../gcc/doc/install.texi:4430: warning: @anchor should not appear in @heading
../../gcc/doc/install.texi:4446: warning: @anchor should not appear in @heading
../../gcc/doc/install.texi:4456: warning: @anchor should not appear in @heading
../../gcc/doc/install.texi:4481: warning: @anchor should not appear in @heading
../../gcc/doc/install.texi:4488: warning: @anchor should not appear in @heading
../../gcc/doc/install.texi:4495: warning: @anchor should not appear in @heading
../../gcc/doc/install.texi:4503: warning: @anchor should not appear in @heading
../../gcc/doc/install.texi:4511: warning: @anchor should not appear in @heading
../../gcc/doc/install.texi:4546: warning: @anchor should not appear in @heading
../../gcc/doc/install.texi:4556: warning: @anchor should not appear in @heading
../../gcc/doc/install.texi:4572: warning: @anchor should not appear in @heading
../../gcc/doc/install.texi:4590: warning: @anchor should not appear in @heading
../../gcc/doc/install.texi:4602: warning: @anchor should not appear in @heading
../../gcc/doc/install.texi:4659: warning: @anchor should not appear in @heading
../../gcc/doc/install.texi:4676: warning: @anchor should not appear in @heading
../../gcc/doc/install.texi:4686: warning: @anchor should not appear in @heading
../../gcc/doc/install.texi:4695: warning: @anchor should not appear in @heading
../../gcc/doc/install.texi:4741: warning: @anchor should not appear in @heading
make[2]: Leaving directory '/tmp/B.6iXztr/BUILD/gcc-4.7.3/obj-avr/gcc'
make[2]: Entering directory '/tmp/B.6iXztr/BUILD/gcc-4.7.3/obj-avr/gcc'
if [ xinfo = xinfo ]; then \
	makeinfo --split-size=5000000 --split-size=5000000 --no-split -I . -I ../../gcc/doc \
		-I ../../gcc/doc/include -o doc/cpp.info ../../gcc/doc/cpp.texi; \
fi
make[2]: Leaving directory '/tmp/B.6iXztr/BUILD/gcc-4.7.3/obj-avr/gcc'
rm gcc.pod
make[1]: *** [Makefile:3831: all-gcc] Error 2
make: *** [Makefile:850: all] Error 2
error: Bad exit status from /tmp/B.6iXztr/BUILD/tmp/rpm-tmp.7570 (%build)


RPM build errors:
    Bad exit status from /tmp/B.6iXztr/BUILD/tmp/rpm-tmp.7570 (%build)
ended at: Sun Jul 29 00:31:02 2018, done in 0:00:49.577365
error: No files produced.
+ chmod -R u+rwX /tmp/B.6iXztr/BUILD
+ rm -rf /tmp/B.6iXztr/tmp /tmp/B.6iXztr/BUILD
+ rm -rf /tmp/B.6iXztr
Begin-PLD-Builder-Info
Build-Time: user:86.13s sys:21.19s real:79.55s (faults io:0 non-io:5681597)

End-PLD-Builder-Info
[Back to list of logs] [View rpm -qa of builder]