FailedOk

th/SRPMS[OK]
th/x32[OK]
th/i686[OK]
th/x86_64[OK]

ac/SRPMS[OK]
ac/i386[OK]
ac/i586[OK]
ac/i686[OK]
ac/alpha[OK]
ac/amd64[OK]
ac/athlon[OK]
ac/ppc[OK]
ac/sparc[OK]
ac/sparc64[OK]

Advanced Search
main()
Powered by PLD Linux
(c) 2002-2018 PLD Team
$Revision: 1.37 $
Powered by GNU antilope.
Your IP: 54.166.141.69

cyrus-sasl b8bc4be0-26ac-4c87-8052-60b3a8f7bcfc

Status:Failed
Source URL:ftp://buildlogs.pld-linux.org/th/i686/FAIL/cyrus-sasl,b8bc4be0-26ac-4c87-8052-60b3a8f7bcfc.bz2
text/plain URL:View!
rpm -qa of builder:View!
Date:2018/09/14 16:11:52
Runtime:0:00:25.983392

Toc:

  • prep
  • Executing(%prep): /bin/sh -e /tmp/B.RcC6qk/BUILD/tmp/rpm-tmp.10561
  • build
  • Executing(%build): /bin/sh -e /tmp/B.RcC6qk/BUILD/tmp/rpm-tmp.10561
  • error 1
  • otp.c:121:16: error: storage size of 'mdctx' isn't known
  • error 2
  • otp.c:755:17: error: storage size of 'mdctx' isn't known
  • error 3
  • make[2]: *** [Makefile:809: otp.lo] Error 1
  • error 4
  • make[1]: *** [Makefile:583: all-recursive] Error 1
  • error 5
  • error: Bad exit status from /tmp/B.RcC6qk/BUILD/tmp/rpm-tmp.10561 (%build)
  • error 6
  • RPM build errors:
  • error 7
  • error: No files produced.

Content:

request from: arekm
checking if we should skip the build
started at: Fri Sep 14 16:11:21 2018
killing old processes on a builder
sending signal 9 to pid -1
Killed
cleaning up /tmp
fetching https://srcbuilder.pld-linux.org/th//srpms/b8bc4be0-26ac-4c87-8052-60b3a8f7bcfc/cyrus-sasl-2.1.26-7.src.rpm
fetched 5253121 bytes, 5597.1 K/s
installing srpm: cyrus-sasl-2.1.26-7.src.rpm
+ install -d /tmp/B.RcC6qk/BUILD /tmp/B.RcC6qk/RPMS
+ LC_ALL=en_US.UTF-8
+ rpm -qp --changelog cyrus-sasl-2.1.26-7.src.rpm
* Fri Sep 14 2018 PLD Linux Team <feedback@pld-linux.org>
- For complete changelog see: http://git.pld-linux.org/?p=packages/cyrus-sasl.git;a=log;h=master
* Fri Sep 14 2018 Arkadiusz Miśkiewicz <arekm@maven.pl> 2158cb0
- release 7 (by relup.sh) * Sun Mar 18 2018 Jan Rękorajski <baggins@pld-linux.org> faea6fc
- fix nagios plugin dir - rel 6 + rpm -Uhv --nodeps --define '_topdir /tmp/B.RcC6qk' --define '_specdir %{_topdir}' --define '_sourcedir %{_specdir}' --define '_rpmdir %{_topdir}/RPMS' --define '_builddir %{_topdir}/BUILD' cyrus-sasl-2.1.26-7.src.rpm Preparing... ################################################## cyrus-sasl ################################################## + rm -f cyrus-sasl-2.1.26-7.src.rpm + install -m 700 -d /tmp/B.RcC6qk/BUILD/tmp + TMPDIR=/tmp/B.RcC6qk/BUILD/tmp + exec nice -n 0 rpmbuild -bp --short-circuit --nodeps --define '_topdir /tmp/B.RcC6qk' --define '_specdir %{_topdir}' --define '_sourcedir %{_specdir}' --define '_rpmdir %{_topdir}/RPMS' --define '_builddir %{_topdir}/BUILD' --target i686-pld-linux --define 'prep exit 0' /tmp/B.RcC6qk/cyrus-sasl.spec Building target platforms: i686-pld-linux checking BuildConflict-ing packages no BuildConflicts found checking BR rpm: Building target platforms: i686-pld-linux no BR needed building RPM using: set -ex; : build-id: b8bc4be0-26ac-4c87-8052-60b3a8f7bcfc; TMPDIR=/tmp/B.RcC6qk/BUILD/tmp exec nice -n 0 rpmbuild -bb --define '_smp_mflags -j9' --define '_make_opts -Otarget' --define '_pld_builder 1' --define '_topdir /tmp/B.RcC6qk' --define '_specdir %{_topdir}' --define '_sourcedir %{_specdir}' --define '_rpmdir %{_topdir}/RPMS' --define '_builddir %{_topdir}/BUILD' --target i686-pld-linux /tmp/B.RcC6qk/cyrus-sasl.spec + : build-id: b8bc4be0-26ac-4c87-8052-60b3a8f7bcfc + TMPDIR=/tmp/B.RcC6qk/BUILD/tmp + exec nice -n 0 rpmbuild -bb --define '_smp_mflags -j9' --define '_make_opts -Otarget' --define '_pld_builder 1' --define '_topdir /tmp/B.RcC6qk' --define '_specdir %{_topdir}' --define '_sourcedir %{_specdir}' --define '_rpmdir %{_topdir}/RPMS' --define '_builddir %{_topdir}/BUILD' --target i686-pld-linux /tmp/B.RcC6qk/cyrus-sasl.spec Building target platforms: i686-pld-linux Executing(%prep): /bin/sh -e /tmp/B.RcC6qk/BUILD/tmp/rpm-tmp.10561 + umask 022 + cd /tmp/B.RcC6qk/BUILD + cd /tmp/B.RcC6qk/BUILD + rm -rf cyrus-sasl-2.1.26 + /usr/bin/gzip -dc /tmp/B.RcC6qk/cyrus-sasl-2.1.26.tar.gz + /bin/tar -xf - gzip: stdout: Broken pipe + STATUS=0 + '[' 0 -ne 0 ']' + cd cyrus-sasl-2.1.26 + /bin/id -u + '[' 1001 '=' 0 ']' + /bin/id -u + '[' 1001 '=' 0 ']' + /bin/chmod -Rf a+rX,u+w,g-w,o-w . + echo 'Patch #0 (cyrus-sasl-nolibs.patch):' Patch #0 (cyrus-sasl-nolibs.patch): + '[' -f /tmp/B.RcC6qk/cyrus-sasl-nolibs.patch ']' + /bin/cat /tmp/B.RcC6qk/cyrus-sasl-nolibs.patch + /usr/bin/patch -s -p1 + echo 'Patch #1 (cyrus-sasl-lt.patch):' Patch #1 (cyrus-sasl-lt.patch): + '[' -f /tmp/B.RcC6qk/cyrus-sasl-lt.patch ']' + /bin/cat /tmp/B.RcC6qk/cyrus-sasl-lt.patch + /usr/bin/patch -s -p1 + echo 'Patch #2 (cyrus-sasl-split-sql.patch):' Patch #2 (cyrus-sasl-split-sql.patch): + '[' -f /tmp/B.RcC6qk/cyrus-sasl-split-sql.patch ']' + /bin/cat /tmp/B.RcC6qk/cyrus-sasl-split-sql.patch + /usr/bin/patch -s -p1 + echo 'Patch #3 (cyrus-sasl-opie.patch):' Patch #3 (cyrus-sasl-opie.patch): + '[' -f /tmp/B.RcC6qk/cyrus-sasl-opie.patch ']' + /bin/cat /tmp/B.RcC6qk/cyrus-sasl-opie.patch + /usr/bin/patch -s -p1 + echo 'Patch #4 (cyrus-sasl-gcc4.patch):' Patch #4 (cyrus-sasl-gcc4.patch): + '[' -f /tmp/B.RcC6qk/cyrus-sasl-gcc4.patch ']' + /bin/cat /tmp/B.RcC6qk/cyrus-sasl-gcc4.patch + /usr/bin/patch -s -p1 + echo 'Patch #5 (cyrus-sasl-cryptedpw.patch):' Patch #5 (cyrus-sasl-cryptedpw.patch): + '[' -f /tmp/B.RcC6qk/cyrus-sasl-cryptedpw.patch ']' + /bin/cat /tmp/B.RcC6qk/cyrus-sasl-cryptedpw.patch + /usr/bin/patch -s -p1 + echo 'Patch #6 (cyrus-sasl-md5sum-passwords.patch):' Patch #6 (cyrus-sasl-md5sum-passwords.patch): + '[' -f /tmp/B.RcC6qk/cyrus-sasl-md5sum-passwords.patch ']' + /bin/cat /tmp/B.RcC6qk/cyrus-sasl-md5sum-passwords.patch + /usr/bin/patch -s -p1 + echo 'Patch #7 (cyrus-sasl-db.patch):' Patch #7 (cyrus-sasl-db.patch): + '[' -f /tmp/B.RcC6qk/cyrus-sasl-db.patch ']' + /bin/cat /tmp/B.RcC6qk/cyrus-sasl-db.patch + /usr/bin/patch -s -p1 + echo 'Patch #8 (cyrus-sasl-keytab.patch):' Patch #8 (cyrus-sasl-keytab.patch): + '[' -f /tmp/B.RcC6qk/cyrus-sasl-keytab.patch ']' + /bin/cat /tmp/B.RcC6qk/cyrus-sasl-keytab.patch + /usr/bin/patch -s -p1 + echo 'Patch #9 (cyrus-sasl-sizes.patch):' Patch #9 (cyrus-sasl-sizes.patch): + '[' -f /tmp/B.RcC6qk/cyrus-sasl-sizes.patch ']' + /bin/cat /tmp/B.RcC6qk/cyrus-sasl-sizes.patch + /usr/bin/patch -s -p1 + echo 'Patch #10 (cyrus-sasl-nagios-plugin.patch):' Patch #10 (cyrus-sasl-nagios-plugin.patch): + '[' -f /tmp/B.RcC6qk/cyrus-sasl-nagios-plugin.patch ']' + /bin/cat /tmp/B.RcC6qk/cyrus-sasl-nagios-plugin.patch + /usr/bin/patch -s -p1 + echo 'Patch #11 (cyrus-sasl-parallel-make.patch):' Patch #11 (cyrus-sasl-parallel-make.patch): + '[' -f /tmp/B.RcC6qk/cyrus-sasl-parallel-make.patch ']' + /bin/cat /tmp/B.RcC6qk/cyrus-sasl-parallel-make.patch + /usr/bin/patch -s -p1 + echo 'Patch #12 (cyrus-sasl-gssapi-detect.patch):' Patch #12 (cyrus-sasl-gssapi-detect.patch): + '[' -f /tmp/B.RcC6qk/cyrus-sasl-gssapi-detect.patch ']' + /bin/cat /tmp/B.RcC6qk/cyrus-sasl-gssapi-detect.patch + /usr/bin/patch -s -p1 + echo 'Patch #13 (cyrus-sasl-saslauthd-httpform-urlescape.patch):' Patch #13 (cyrus-sasl-saslauthd-httpform-urlescape.patch): + '[' -f /tmp/B.RcC6qk/cyrus-sasl-saslauthd-httpform-urlescape.patch ']' + /bin/cat /tmp/B.RcC6qk/cyrus-sasl-saslauthd-httpform-urlescape.patch + /usr/bin/patch -s -p0 + echo 'Patch #14 (cyrus-sasl-ac-libs.patch):' Patch #14 (cyrus-sasl-ac-libs.patch): + '[' -f /tmp/B.RcC6qk/cyrus-sasl-ac-libs.patch ']' + /bin/cat /tmp/B.RcC6qk/cyrus-sasl-ac-libs.patch + /usr/bin/patch -s -p1 + echo 'Patch #15 (cyrus-sasl-pam.patch):' Patch #15 (cyrus-sasl-pam.patch): + '[' -f /tmp/B.RcC6qk/cyrus-sasl-pam.patch ']' + /bin/cat /tmp/B.RcC6qk/cyrus-sasl-pam.patch + /usr/bin/patch -s -p1 + echo 'Patch #16 (cyrus-sasl-gssapi_ext.patch):' Patch #16 (cyrus-sasl-gssapi_ext.patch): + '[' -f /tmp/B.RcC6qk/cyrus-sasl-gssapi_ext.patch ']' + /bin/cat /tmp/B.RcC6qk/cyrus-sasl-gssapi_ext.patch + /usr/bin/patch -s -p1 + echo 'Patch #17 (0032-revert_1.103_revision_to_unbreak_GSSAPI.patch):' Patch #17 (0032-revert_1.103_revision_to_unbreak_GSSAPI.patch): + '[' -f /tmp/B.RcC6qk/0032-revert_1.103_revision_to_unbreak_GSSAPI.patch ']' + /bin/cat /tmp/B.RcC6qk/0032-revert_1.103_revision_to_unbreak_GSSAPI.patch + /usr/bin/patch -s -p1 + echo 'Patch #18 (0033-fix_segfault_in_GSSAPI.patch):' Patch #18 (0033-fix_segfault_in_GSSAPI.patch): + '[' -f /tmp/B.RcC6qk/0033-fix_segfault_in_GSSAPI.patch ']' + /bin/cat /tmp/B.RcC6qk/0033-fix_segfault_in_GSSAPI.patch + /usr/bin/patch -s -p1 + echo 'Patch #19 (0034-fix_dovecot_authentication.patch):' Patch #19 (0034-fix_dovecot_authentication.patch): + '[' -f /tmp/B.RcC6qk/0034-fix_dovecot_authentication.patch ']' + /bin/cat /tmp/B.RcC6qk/0034-fix_dovecot_authentication.patch + /usr/bin/patch -s -p1 + echo 'Patch #20 (cyrus-sasl-auxprop.patch):' Patch #20 (cyrus-sasl-auxprop.patch): + '[' -f /tmp/B.RcC6qk/cyrus-sasl-auxprop.patch ']' + /bin/cat /tmp/B.RcC6qk/cyrus-sasl-auxprop.patch + /usr/bin/patch -s -p1 + echo 'Patch #21 (0030-dont_use_la_files_for_opening_plugins.patch):' Patch #21 (0030-dont_use_la_files_for_opening_plugins.patch): + '[' -f /tmp/B.RcC6qk/0030-dont_use_la_files_for_opening_plugins.patch ']' + /bin/cat /tmp/B.RcC6qk/0030-dont_use_la_files_for_opening_plugins.patch + /usr/bin/patch -s -p1 + echo 'Patch #22 (cyrus-sasl-stddef.patch):' Patch #22 (cyrus-sasl-stddef.patch): + '[' -f /tmp/B.RcC6qk/cyrus-sasl-stddef.patch ']' + /bin/cat /tmp/B.RcC6qk/cyrus-sasl-stddef.patch + /usr/bin/patch -s -p1 + echo 'Patch #23 (cyrus-sasl-2.1.26-glibc217-crypt.diff):' Patch #23 (cyrus-sasl-2.1.26-glibc217-crypt.diff): + '[' -f /tmp/B.RcC6qk/cyrus-sasl-2.1.26-glibc217-crypt.diff ']' + /bin/cat /tmp/B.RcC6qk/cyrus-sasl-2.1.26-glibc217-crypt.diff + /usr/bin/patch -s -p1 + cd doc + >rfc-compliance + echo 'cyrus-sasl complies with the following RFCs:' + >>rfc-compliance + ls rfc1321.txt rfc1939.txt rfc2104.txt rfc2195.txt rfc2222.txt rfc2243.txt rfc2245.txt rfc2289.txt rfc2444.txt rfc2595.txt rfc2831.txt rfc2945.txt rfc3174.txt + rm -f rfc1321.txt rfc1939.txt rfc2104.txt rfc2195.txt rfc2222.txt rfc2243.txt rfc2245.txt rfc2289.txt rfc2444.txt rfc2595.txt rfc2831.txt rfc2945.txt rfc3174.txt + cd .. + /bin/rm '--interactive=never' config/libtool.m4 + sed -i -e $'\n\ts,/usr/local/etc/saslauthd.conf,/etc/sasl/saslauthd.conf,g\n\ts,/etc/saslauthd.conf,/etc/sasl/saslauthd.conf,g\n\ts,/var/run/saslauthd/mux,/var/lib/sasl2/mux,g\n\ts,/var/state/saslauthd,/var/lib/sasl2,g\n' saslauthd/saslauthd.8 saslauthd/saslauthd.mdoc saslauthd/LDAP_SASLAUTHD doc/sysadmin.html + exit 0 Executing(%build): /bin/sh -e /tmp/B.RcC6qk/BUILD/tmp/rpm-tmp.10561 TMP=/home/users/builder/tmp HOME=/home/users/builder PATH=/usr/local/bin:/usr/bin:/bin:/home/users/builder/bin TMPDIR=/tmp/B.RcC6qk/BUILD/tmp + umask 022 + cd /tmp/B.RcC6qk/BUILD + cd cyrus-sasl-2.1.26 + libtoolize --copy --force --install libtoolize: putting auxiliary files in AC_CONFIG_AUX_DIR, 'config'. libtoolize: copying file 'config/config.guess' libtoolize: copying file 'config/config.sub' libtoolize: copying file 'config/install-sh' libtoolize: copying file 'config/ltmain.sh' libtoolize: You should add the contents of the following files to 'aclocal.m4': libtoolize: '/usr/share/aclocal/libtool.m4' libtoolize: '/usr/share/aclocal/ltoptions.m4' libtoolize: '/usr/share/aclocal/ltsugar.m4' libtoolize: '/usr/share/aclocal/ltversion.m4' libtoolize: '/usr/share/aclocal/lt~obsolete.m4' libtoolize: Consider adding 'AC_CONFIG_MACRO_DIRS([m4])' to configure.in, libtoolize: and rerunning libtoolize and aclocal. libtoolize: Consider adding '-I m4' to ACLOCAL_AMFLAGS in Makefile.am. + aclocal -I cmulocal -I config aclocal: warning: autoconf input should be named 'configure.ac', not 'configure.in' configure.in:535: warning: AC_CACHE_VAL(cyrus_krbinclude, ...): suspicious cache-id, must contain _cv_ to be cached ../../lib/autoconf/general.m4:2031: AC_CACHE_VAL is expanded from... ../../lib/autoconf/general.m4:2052: AC_CACHE_CHECK is expanded from... config/kerberos_v4.m4:76: SASL_KERBEROS_V4_CHK is expanded from... configure.in:535: the top level + autoheader configure.in:535: warning: AC_CACHE_VAL(cyrus_krbinclude, ...): suspicious cache-id, must contain _cv_ to be cached ../../lib/autoconf/general.m4:2031: AC_CACHE_VAL is expanded from... ../../lib/autoconf/general.m4:2052: AC_CACHE_CHECK is expanded from... config/kerberos_v4.m4:76: SASL_KERBEROS_V4_CHK is expanded from... configure.in:535: the top level + autoconf configure.in:535: warning: AC_CACHE_VAL(cyrus_krbinclude, ...): suspicious cache-id, must contain _cv_ to be cached ../../lib/autoconf/general.m4:2031: AC_CACHE_VAL is expanded from... ../../lib/autoconf/general.m4:2052: AC_CACHE_CHECK is expanded from... config/kerberos_v4.m4:76: SASL_KERBEROS_V4_CHK is expanded from... configure.in:535: the top level + automake -a -c -f --foreign automake: warning: autoconf input should be named 'configure.ac', not 'configure.in' configure.in:535: warning: AC_CACHE_VAL(cyrus_krbinclude, ...): suspicious cache-id, must contain _cv_ to be cached ../../lib/autoconf/general.m4:2031: AC_CACHE_VAL is expanded from... ../../lib/autoconf/general.m4:2052: AC_CACHE_CHECK is expanded from... config/kerberos_v4.m4:76: SASL_KERBEROS_V4_CHK is expanded from... configure.in:535: the top level configure.in:62: warning: AM_INIT_AUTOMAKE: two- and three-arguments forms are deprecated. For more info, see: configure.in:62: https://www.gnu.org/software/automake/manual/automake.html#Modernize-AM_005fINIT_005fAUTOMAKE-invocation configure.in:87: installing 'config/compile' configure.in:62: installing 'config/missing' automake: warning: autoconf input should be named 'configure.ac', not 'configure.in' include/Makefile.am: installing 'config/depcomp' java/CyrusSasl/Makefile.am:31: warning: 'INCLUDES' is the old name for 'AM_CPPFLAGS' (or '*_CPPFLAGS') lib/Makefile.am:48: warning: 'INCLUDES' is the old name for 'AM_CPPFLAGS' (or '*_CPPFLAGS') lib/Makefile.am:58: warning: source file '../plugins/plugin_common.c' is in a subdirectory, lib/Makefile.am:58: but option 'subdir-objects' is disabled automake: warning: possible forward-incompatibility. automake: At least a source file is in a subdirectory, but the 'subdir-objects' automake: automake option hasn't been enabled. For now, the corresponding output automake: object file(s) will be placed in the top-level directory. However, automake: this behaviour will change in future Automake versions: they will automake: unconditionally cause object files to be placed in the same subdirectory automake: of the corresponding sources. automake: You are advised to start using 'subdir-objects' option throughout your automake: project, to avoid future incompatibilities. plugins/Makefile.am:52: warning: 'INCLUDES' is the old name for 'AM_CPPFLAGS' (or '*_CPPFLAGS') pwcheck/Makefile.am:27: warning: 'INCLUDES' is the old name for 'AM_CPPFLAGS' (or '*_CPPFLAGS') sample/Makefile.am:45: warning: 'INCLUDES' is the old name for 'AM_CPPFLAGS' (or '*_CPPFLAGS') sasldb/Makefile.am:47: warning: 'INCLUDES' is the old name for 'AM_CPPFLAGS' (or '*_CPPFLAGS') sasldb/Makefile.am:62: warning: variable 'EXTRA_libsasldb_a_SOURCES' is defined but no program or sasldb/Makefile.am:62: library has 'libsasldb_a' as canonical name (possible typo) sasldb/Makefile.am:61: warning: variable 'libsasldb_a_SOURCES' is defined but no program or sasldb/Makefile.am:61: library has 'libsasldb_a' as canonical name (possible typo) utils/Makefile.am:92: warning: 'INCLUDES' is the old name for 'AM_CPPFLAGS' (or '*_CPPFLAGS') + cd saslauthd + aclocal -I ../cmulocal -I ../config aclocal: warning: autoconf input should be named 'configure.ac', not 'configure.in' configure.in:42: warning: AC_CACHE_VAL(cyrus_krbinclude, ...): suspicious cache-id, must contain _cv_ to be cached ../../lib/autoconf/general.m4:2031: AC_CACHE_VAL is expanded from... ../../lib/autoconf/general.m4:2052: AC_CACHE_CHECK is expanded from... ../config/kerberos_v4.m4:76: SASL_KERBEROS_V4_CHK is expanded from... configure.in:42: the top level configure.in:157: warning: AC_CACHE_VAL(have_func, ...): suspicious cache-id, must contain _cv_ to be cached ../../lib/autoconf/general.m4:2031: AC_CACHE_VAL is expanded from... configure.in:157: the top level configure.in:166: warning: AC_CACHE_VAL(have_pretty_function, ...): suspicious cache-id, must contain _cv_ to be cached ../../lib/autoconf/general.m4:2031: AC_CACHE_VAL is expanded from... configure.in:166: the top level configure.in:175: warning: AC_CACHE_VAL(have_function, ...): suspicious cache-id, must contain _cv_ to be cached ../../lib/autoconf/general.m4:2031: AC_CACHE_VAL is expanded from... configure.in:175: the top level + autoheader configure.in:42: warning: AC_CACHE_VAL(cyrus_krbinclude, ...): suspicious cache-id, must contain _cv_ to be cached ../../lib/autoconf/general.m4:2031: AC_CACHE_VAL is expanded from... ../../lib/autoconf/general.m4:2052: AC_CACHE_CHECK is expanded from... ../config/kerberos_v4.m4:76: SASL_KERBEROS_V4_CHK is expanded from... configure.in:42: the top level configure.in:157: warning: AC_CACHE_VAL(have_func, ...): suspicious cache-id, must contain _cv_ to be cached ../../lib/autoconf/general.m4:2031: AC_CACHE_VAL is expanded from... configure.in:157: the top level configure.in:166: warning: AC_CACHE_VAL(have_pretty_function, ...): suspicious cache-id, must contain _cv_ to be cached ../../lib/autoconf/general.m4:2031: AC_CACHE_VAL is expanded from... configure.in:166: the top level configure.in:175: warning: AC_CACHE_VAL(have_function, ...): suspicious cache-id, must contain _cv_ to be cached ../../lib/autoconf/general.m4:2031: AC_CACHE_VAL is expanded from... configure.in:175: the top level + autoconf configure.in:42: warning: AC_CACHE_VAL(cyrus_krbinclude, ...): suspicious cache-id, must contain _cv_ to be cached ../../lib/autoconf/general.m4:2031: AC_CACHE_VAL is expanded from... ../../lib/autoconf/general.m4:2052: AC_CACHE_CHECK is expanded from... ../config/kerberos_v4.m4:76: SASL_KERBEROS_V4_CHK is expanded from... configure.in:42: the top level configure.in:157: warning: AC_CACHE_VAL(have_func, ...): suspicious cache-id, must contain _cv_ to be cached ../../lib/autoconf/general.m4:2031: AC_CACHE_VAL is expanded from... configure.in:157: the top level configure.in:166: warning: AC_CACHE_VAL(have_pretty_function, ...): suspicious cache-id, must contain _cv_ to be cached ../../lib/autoconf/general.m4:2031: AC_CACHE_VAL is expanded from... configure.in:166: the top level configure.in:175: warning: AC_CACHE_VAL(have_function, ...): suspicious cache-id, must contain _cv_ to be cached ../../lib/autoconf/general.m4:2031: AC_CACHE_VAL is expanded from... configure.in:175: the top level + automake -a -c -f --foreign automake: warning: autoconf input should be named 'configure.ac', not 'configure.in' configure.in:42: warning: AC_CACHE_VAL(cyrus_krbinclude, ...): suspicious cache-id, must contain _cv_ to be cached ../../lib/autoconf/general.m4:2031: AC_CACHE_VAL is expanded from... ../../lib/autoconf/general.m4:2052: AC_CACHE_CHECK is expanded from... ../config/kerberos_v4.m4:76: SASL_KERBEROS_V4_CHK is expanded from... configure.in:42: the top level configure.in:157: warning: AC_CACHE_VAL(have_func, ...): suspicious cache-id, must contain _cv_ to be cached ../../lib/autoconf/general.m4:2031: AC_CACHE_VAL is expanded from... configure.in:157: the top level configure.in:166: warning: AC_CACHE_VAL(have_pretty_function, ...): suspicious cache-id, must contain _cv_ to be cached ../../lib/autoconf/general.m4:2031: AC_CACHE_VAL is expanded from... configure.in:166: the top level configure.in:175: warning: AC_CACHE_VAL(have_function, ...): suspicious cache-id, must contain _cv_ to be cached ../../lib/autoconf/general.m4:2031: AC_CACHE_VAL is expanded from... configure.in:175: the top level configure.in:18: warning: AM_INIT_AUTOMAKE: two- and three-arguments forms are deprecated. For more info, see: configure.in:18: https://www.gnu.org/software/automake/manual/automake.html#Modernize-AM_005fINIT_005fAUTOMAKE-invocation configure.in:22: installing 'config/compile' Makefile.am:34: warning: 'INCLUDES' is the old name for 'AM_CPPFLAGS' (or '*_CPPFLAGS') automake: warning: autoconf input should be named 'configure.ac', not 'configure.in' + cd .. + ./configure 'LDFLAGS=-Wl,--as-needed -Wl,--no-copy-dt-needed-entries -Wl,-z,relro -Wl,-z,combreloc ' 'CFLAGS=-O2 -fwrapv -pipe -Wformat -Werror=format-security -gdwarf-4 -fno-debug-types-section -fvar-tracking-assignments -g2 -Wp,-D_FORTIFY_SOURCE=2 -fno-strict-aliasing -fstack-protector-strong --param=ssp-buffer-size=4 -fomit-frame-pointer -march=i686 -fasynchronous-unwind-tables -mtune=pentium4 -gdwarf-4 -fno-debug-types-section -fvar-tracking-assignments -g2 ' 'CXXFLAGS=-O2 -fwrapv -pipe -Wformat -Werror=format-security -gdwarf-4 -fno-debug-types-section -fvar-tracking-assignments -g2 -Wp,-D_FORTIFY_SOURCE=2 -fno-strict-aliasing -fstack-protector-strong --param=ssp-buffer-size=4 -fomit-frame-pointer -march=i686 -fasynchronous-unwind-tables -mtune=pentium4 -gdwarf-4 -fno-debug-types-section -fvar-tracking-assignments -g2 ' 'FFLAGS=-O2 -fwrapv -pipe -Wformat -Werror=format-security -gdwarf-4 -fno-debug-types-section -fvar-tracking-assignments -g2 -Wp,-D_FORTIFY_SOURCE=2 -fno-strict-aliasing -fstack-protector-strong --param=ssp-buffer-size=4 -fomit-frame-pointer -march=i686 -fasynchronous-unwind-tables -mtune=pentium4 -gdwarf-4 -fno-debug-types-section -fvar-tracking-assignments -g2 ' 'FCFLAGS=-O2 -fwrapv -pipe -Wformat -Werror=format-security -gdwarf-4 -fno-debug-types-section -fvar-tracking-assignments -g2 -Wp,-D_FORTIFY_SOURCE=2 -fno-strict-aliasing -fstack-protector-strong --param=ssp-buffer-size=4 -fomit-frame-pointer -march=i686 -fasynchronous-unwind-tables -mtune=pentium4 -gdwarf-4 -fno-debug-types-section -fvar-tracking-assignments -g2 ' 'CPPFLAGS=' 'CC=i686-pld-linux-gcc' 'CXX=i686-pld-linux-g++' '--host=i686-pld-linux' '--build=i686-pld-linux' '--prefix=/usr' '--exec-prefix=/usr' '--bindir=/usr/bin' '--sbindir=/usr/sbin' '--sysconfdir=/etc/sasl' '--datadir=/usr/share' '--includedir=/usr/include' '--libdir=/usr/lib' '--libexecdir=/usr/libexec' '--localstatedir=/var' '--sharedstatedir=/var/lib' '--mandir=/usr/share/man' '--infodir=/usr/share/info' '--x-libraries=/usr/lib' 'LDFLAGS=-lcrypt' --disable-krb4 --enable-gssapi '--with-gss_impl=heimdal' --enable-login --enable-sample --enable-httpform --enable-sql --enable-passdss --enable-static '--with-plugindir=/usr/lib/sasl2' '--with-configdir=/etc/sasl' '--with-dblib=berkeley' '--with-dbpath=/var/lib/sasl2/sasl.db' '--with-ldap=/usr' --enable-ldapdb '--with-mysql=/usr' --enable-ntlm '--with-pgsql=/usr' '--with-sqlite=/usr' '--with-sqlite3=/usr' --with-pam '--with-saslauthd=/var/lib/sasl2' configure: creating cache ./config.cache checking build system type... i686-pld-linux-gnu checking host system type... i686-pld-linux-gnu checking target system type... i686-pld-linux-gnu checking for a BSD-compatible install... /usr/bin/install -c checking whether build environment is sane... yes checking for a thread-safe mkdir -p... /bin/mkdir -p checking for mawk... mawk checking whether make sets $(MAKE)... yes checking whether make supports nested variables... yes checking for i686-pld-linux-gcc... i686-pld-linux-gcc checking whether the C compiler works... yes checking for C compiler default output file name... a.out checking for suffix of executables... checking whether we are cross compiling... no checking for suffix of object files... o checking whether we are using the GNU C compiler... yes checking whether i686-pld-linux-gcc accepts -g... yes checking for i686-pld-linux-gcc option to accept ISO C89... none needed checking whether i686-pld-linux-gcc understands -c and -o together... yes checking whether make supports the include directive... yes (GNU style) checking dependency style of i686-pld-linux-gcc... gcc3 checking how to run the C preprocessor... i686-pld-linux-gcc -E checking for mawk... (cached) mawk checking whether ln -s works... yes checking whether make sets $(MAKE)... (cached) yes checking for __attribute__... yes checking how to print strings... print -r checking for a sed that does not truncate output... /bin/sed checking for grep that handles long lines and -e... /bin/grep checking for egrep... /bin/grep -E checking for fgrep... /bin/grep -F checking for ld used by i686-pld-linux-gcc... /usr/bin/ld checking if the linker (/usr/bin/ld) is GNU ld... yes checking for BSD- or MS-compatible name lister (nm)... /usr/bin/nm -B checking the name lister (/usr/bin/nm -B) interface... BSD nm checking the maximum length of command line arguments... 1572864 checking how to convert i686-pld-linux-gnu file names to i686-pld-linux-gnu format... func_convert_file_noop checking how to convert i686-pld-linux-gnu file names to toolchain format... func_convert_file_noop checking for /usr/bin/ld option to reload object files... -r checking for i686-pld-linux-objdump... no checking for objdump... objdump checking how to recognize dependent libraries... pass_all checking for i686-pld-linux-dlltool... no checking for dlltool... no checking how to associate runtime and link libraries... print -r -- checking for i686-pld-linux-ar... no checking for ar... ar checking for archiver @FILE support... @ checking for i686-pld-linux-strip... no checking for strip... strip checking for i686-pld-linux-ranlib... no checking for ranlib... ranlib checking command to parse /usr/bin/nm -B output from i686-pld-linux-gcc object... ok checking for sysroot... no checking for a working dd... /bin/dd checking how to truncate binary pipes... /bin/dd bs=4096 count=1 checking for i686-pld-linux-mt... no checking for mt... no checking if : is a manifest tool... no checking for ANSI C header files... yes checking for sys/types.h... yes checking for sys/stat.h... yes checking for stdlib.h... yes checking for string.h... yes checking for memory.h... yes checking for strings.h... yes checking for inttypes.h... yes checking for stdint.h... yes checking for unistd.h... yes checking for dlfcn.h... yes checking for objdir... .libs checking if i686-pld-linux-gcc supports -fno-rtti -fno-exceptions... no checking for i686-pld-linux-gcc option to produce PIC... -fPIC -DPIC checking if i686-pld-linux-gcc PIC flag -fPIC -DPIC works... yes checking if i686-pld-linux-gcc static flag -static works... yes checking if i686-pld-linux-gcc supports -c -o file.o... yes checking if i686-pld-linux-gcc supports -c -o file.o... (cached) yes checking whether the i686-pld-linux-gcc linker (/usr/bin/ld) supports shared libraries... yes checking whether -lc should be explicitly linked in... no checking dynamic linker characteristics... GNU/Linux ld.so checking how to hardcode library paths into programs... immediate checking whether stripping libraries is possible... yes checking if libtool supports shared libraries... yes checking whether to build shared libraries... yes checking whether to build static libraries... yes checking for connect... yes checking for res_search... no checking for dn_expand... no checking for dns_lookup... no checking DB path to use... /var/lib/sasl2/sasl.db checking db.h usability... yes checking db.h presence... yes checking for db.h... yes checking DB library to use... berkeley checking if Berkeley DB handle is kept open in SASLDB... no checking for dlopen in -ldl... yes checking /dev/random to use... /dev/random checking for nm... /usr/bin/nm -B checking for underscore before symbols... conftest.c:1:1: warning: return type defaults to 'int' [-Wimplicit-int] main(){int i=1;} ^~~~ conftest.c:2:5: warning: return type defaults to 'int' [-Wimplicit-int] foo(){int i=6;} ^~~ no checking for syslog... yes checking security/pam_appl.h usability... yes checking security/pam_appl.h presence... yes checking for security/pam_appl.h... yes checking pam/pam_appl.h usability... no checking pam/pam_appl.h presence... no checking for pam/pam_appl.h... no checking for pam_start in -lpam... yes checking if I should include saslauthd... /var/lib/sasl2 checking to include Courier authdaemond support... /dev/null checking if I should include pwcheck... no checking if I should include the alwaystrue verifier... no checking if we should enable sasl_checkapop... enabled checking CRAM-MD5... enabled checking size of long... 4 checking what directory libraries are found in... lib checking for RSAPublicEncrypt in -lrsaref... no checking openssl/evp.h usability... yes checking openssl/evp.h presence... yes checking for openssl/evp.h... yes checking for EVP_DigestInit in -lcrypto... yes checking for OpenSSL... yes checking for des_cbc_encrypt in -lcrypto... no checking for DES_cbc_encrypt in -lcrypto... yes checking openssl/des.h usability... yes checking openssl/des.h presence... yes checking for openssl/des.h... yes checking DIGEST-MD5... enabled checking SCRAM... enabled checking OTP... enabled checking for opiechallenge in -lopie... no checking for OPIE... no checking SRP... disabled checking KERBEROS_V4... disabled checking for crypt... yes checking gssapi.h usability... yes checking gssapi.h presence... yes checking for gssapi.h... yes checking gssapi/gssapi_ext.h usability... no checking gssapi/gssapi_ext.h presence... no checking for gssapi/gssapi_ext.h... no checking for res_search in -lresolv... yes checking for gss_unwrap in -lgssapi... yes checking GSSAPI... with implementation heimdal checking for res_search in -lresolv... (cached) yes checking gssapi/gssapi_krb5.h usability... yes checking gssapi/gssapi_krb5.h presence... yes checking for gssapi/gssapi_krb5.h... yes checking for gss_decapsulate_token... yes checking for gss_encapsulate_token... yes checking for gss_oid_equal... yes checking for gss_get_name_attribute... yes checking for SPNEGO support in GSSAPI libraries... yes checking to use mutexes aroung GSS calls... no checking PLAIN... enabled checking ANONYMOUS... enabled checking LOGIN... enabled checking NTLM... enabled checking PASSDSS... enabled checking SQL... enabled checking for mysql_select_db in -lmysqlclient... yes checking for PQsetdbLogin in -lpq... yes checking for sqlite_open in -lsqlite... yes checking for sqlite3_open in -lsqlite3... yes checking LDAPDB... enabled checking ldap.h usability... yes checking ldap.h presence... yes checking for ldap.h... yes checking lber.h usability... yes checking lber.h presence... yes checking for lber.h... yes checking OpenLDAP api... yes checking for ldap_initialize in -lldap... yes checking OpenLDAP version... yes checking for dmalloc library... no checking for sfio library... no checking for getsubopt... yes checking for snprintf... yes checking for vsnprintf... yes checking for library containing inet_aton... none required checking for getaddrinfo... yes checking for gai_strerror... yes checking for getnameinfo... yes checking for an ANSI C-conforming const... yes checking for inline... inline checking for mode_t... yes checking for pid_t... yes checking return type of signal handlers... void checking whether time.h and sys/time.h may both be included... yes checking for ANSI C header files... (cached) yes checking for dirent.h that defines DIR... yes checking for library containing opendir... none required checking for sys/wait.h that is POSIX.1 compatible... yes checking des.h usability... no checking des.h presence... no checking for des.h... no checking for dlfcn.h... (cached) yes checking fcntl.h usability... yes checking fcntl.h presence... yes checking for fcntl.h... yes checking limits.h usability... yes checking limits.h presence... yes checking for limits.h... yes checking malloc.h usability... yes checking malloc.h presence... yes checking for malloc.h... yes checking paths.h usability... yes checking paths.h presence... yes checking for paths.h... yes checking for strings.h... (cached) yes checking sys/file.h usability... yes checking sys/file.h presence... yes checking for sys/file.h... yes checking sys/time.h usability... yes checking sys/time.h presence... yes checking for sys/time.h... yes checking syslog.h usability... yes checking syslog.h presence... yes checking for syslog.h... yes checking for unistd.h... (cached) yes checking for inttypes.h... (cached) yes checking sys/uio.h usability... yes checking sys/uio.h presence... yes checking for sys/uio.h... yes checking sys/param.h usability... yes checking sys/param.h presence... yes checking for sys/param.h... yes checking sysexits.h usability... yes checking sysexits.h presence... yes checking for sysexits.h... yes checking stdarg.h usability... yes checking stdarg.h presence... yes checking for stdarg.h... yes checking varargs.h usability... no checking varargs.h presence... no checking for varargs.h... no checking for long long... yes checking for int8_t... yes checking for uint8_t... yes checking for int16_t... yes checking for uint16_t... yes checking for int32_t... yes checking for uint32_t... yes checking for int64_t... yes checking for uint64_t... yes checking whether you have ss_family in struct sockaddr_storage... yes checking whether you have sa_len in struct sockaddr... no checking for socklen_t... yes checking for gethostname... yes checking for getdomainname... yes checking for getpwnam... yes checking for getspnam... yes checking for gettimeofday... yes checking for inet_aton... yes checking for memcpy... yes checking for mkdir... yes checking for select... yes checking for socket... yes checking for strchr... yes checking for strdup... yes checking for strerror... yes checking for strspn... yes checking for strstr... yes checking for strtol... yes checking for jrand48... yes checking for getpassphrase... no configure: updating cache ./config.cache checking that generated files are newer than configure... done configure: creating ./config.status config.status: creating Makefile config.status: creating libsasl2.pc config.status: creating include/Makefile config.status: creating sasldb/Makefile config.status: creating plugins/Makefile config.status: creating lib/Makefile config.status: creating utils/Makefile config.status: creating doc/Makefile config.status: creating sample/Makefile config.status: creating java/Makefile config.status: creating java/CyrusSasl/Makefile config.status: creating java/Test/Makefile config.status: creating java/javax/Makefile config.status: creating java/javax/security/Makefile config.status: creating java/javax/security/auth/Makefile config.status: creating java/javax/security/auth/callback/Makefile config.status: creating pwcheck/Makefile config.status: creating man/Makefile config.status: creating config.h config.status: executing depfiles commands config.status: executing libtool commands === configuring in saslauthd (/tmp/B.RcC6qk/BUILD/cyrus-sasl-2.1.26/saslauthd) configure: running /bin/sh ./configure --disable-option-checking '--prefix=/usr' 'LDFLAGS=-Wl,--as-needed -Wl,--no-copy-dt-needed-entries -Wl,-z,relro -Wl,-z,combreloc ' 'CFLAGS=-O2 -fwrapv -pipe -Wformat -Werror=format-security -gdwarf-4 -fno-debug-types-section -fvar-tracking-assignments -g2 -Wp,-D_FORTIFY_SOURCE=2 -fno-strict-aliasing -fstack-protector-strong --param=ssp-buffer-size=4 -fomit-frame-pointer -march=i686 -fasynchronous-unwind-tables -mtune=pentium4 -gdwarf-4 -fno-debug-types-section -fvar-tracking-assignments -g2 ' 'CXXFLAGS=-O2 -fwrapv -pipe -Wformat -Werror=format-security -gdwarf-4 -fno-debug-types-section -fvar-tracking-assignments -g2 -Wp,-D_FORTIFY_SOURCE=2 -fno-strict-aliasing -fstack-protector-strong --param=ssp-buffer-size=4 -fomit-frame-pointer -march=i686 -fasynchronous-unwind-tables -mtune=pentium4 -gdwarf-4 -fno-debug-types-section -fvar-tracking-assignments -g2 ' 'FFLAGS=-O2 -fwrapv -pipe -Wformat -Werror=format-security -gdwarf-4 -fno-debug-types-section -fvar-tracking-assignments -g2 -Wp,-D_FORTIFY_SOURCE=2 -fno-strict-aliasing -fstack-protector-strong --param=ssp-buffer-size=4 -fomit-frame-pointer -march=i686 -fasynchronous-unwind-tables -mtune=pentium4 -gdwarf-4 -fno-debug-types-section -fvar-tracking-assignments -g2 ' 'FCFLAGS=-O2 -fwrapv -pipe -Wformat -Werror=format-security -gdwarf-4 -fno-debug-types-section -fvar-tracking-assignments -g2 -Wp,-D_FORTIFY_SOURCE=2 -fno-strict-aliasing -fstack-protector-strong --param=ssp-buffer-size=4 -fomit-frame-pointer -march=i686 -fasynchronous-unwind-tables -mtune=pentium4 -gdwarf-4 -fno-debug-types-section -fvar-tracking-assignments -g2 ' 'CPPFLAGS=' 'CC=i686-pld-linux-gcc' 'CXX=i686-pld-linux-g++' '--host=i686-pld-linux' '--build=i686-pld-linux' '--exec-prefix=/usr' '--bindir=/usr/bin' '--sbindir=/usr/sbin' '--sysconfdir=/etc/sasl' '--datadir=/usr/share' '--includedir=/usr/include' '--libdir=/usr/lib' '--libexecdir=/usr/libexec' '--localstatedir=/var' '--sharedstatedir=/var/lib' '--mandir=/usr/share/man' '--infodir=/usr/share/info' '--x-libraries=/usr/lib' 'LDFLAGS=-lcrypt' '--disable-krb4' '--enable-gssapi' '--with-gss_impl=heimdal' '--enable-login' '--enable-sample' '--enable-httpform' '--enable-sql' '--enable-passdss' '--enable-static' '--with-plugindir=/usr/lib/sasl2' '--with-configdir=/etc/sasl' '--with-dblib=berkeley' '--with-dbpath=/var/lib/sasl2/sasl.db' '--with-ldap=/usr' '--enable-ldapdb' '--with-mysql=/usr' '--enable-ntlm' '--with-pgsql=/usr' '--with-sqlite=/usr' '--with-sqlite3=/usr' '--with-pam' '--with-saslauthd=/var/lib/sasl2' 'build_alias=i686-pld-linux' 'host_alias=i686-pld-linux' --cache-file=.././config.cache --srcdir=. configure: loading cache .././config.cache checking build system type... (cached) i686-pld-linux-gnu checking host system type... (cached) i686-pld-linux-gnu checking for a BSD-compatible install... (cached) /usr/bin/install -c checking whether build environment is sane... yes checking for a thread-safe mkdir -p... (cached) /bin/mkdir -p checking for mawk... (cached) mawk checking whether make sets $(MAKE)... (cached) yes checking whether make supports nested variables... (cached) yes checking for i686-pld-linux-gcc... (cached) i686-pld-linux-gcc checking whether the C compiler works... yes checking for C compiler default output file name... a.out checking for suffix of executables... checking whether we are cross compiling... no checking for suffix of object files... (cached) o checking whether we are using the GNU C compiler... (cached) yes checking whether i686-pld-linux-gcc accepts -g... (cached) yes checking for i686-pld-linux-gcc option to accept ISO C89... (cached) none needed checking whether i686-pld-linux-gcc understands -c and -o together... (cached) yes checking whether make supports the include directive... yes (GNU style) checking dependency style of i686-pld-linux-gcc... (cached) gcc3 checking how to run the C preprocessor... (cached) i686-pld-linux-gcc -E checking for mawk... (cached) mawk checking whether make sets $(MAKE)... (cached) yes checking whether ln -s works... yes checking for __attribute__... (cached) yes checking for connect... (cached) yes checking for res_search... (cached) no checking for dn_expand... (cached) no checking for dns_lookup... (cached) no checking for grep that handles long lines and -e... (cached) /bin/grep checking for egrep... (cached) /bin/grep -E checking for ANSI C header files... (cached) yes checking for sys/types.h... (cached) yes checking for sys/stat.h... (cached) yes checking for stdlib.h... (cached) yes checking for string.h... (cached) yes checking for memory.h... (cached) yes checking for strings.h... (cached) yes checking for inttypes.h... (cached) yes checking for stdint.h... (cached) yes checking for unistd.h... (cached) yes checking size of long... (cached) 4 checking what directory libraries are found in... (cached) lib checking for RSAPublicEncrypt in -lrsaref... (cached) no checking for openssl/evp.h... (cached) yes checking for EVP_DigestInit in -lcrypto... (cached) yes checking for OpenSSL... yes checking for des_cbc_encrypt in -lcrypto... (cached) no checking for DES_cbc_encrypt in -lcrypto... (cached) yes checking for openssl/des.h... (cached) yes checking KERBEROS_V4... disabled checking for crypt... (cached) yes checking for gssapi.h... (cached) yes checking for gssapi/gssapi_ext.h... (cached) no checking for res_search in -lresolv... (cached) yes checking for gss_unwrap in -lgssapi... (cached) yes checking GSSAPI... with implementation heimdal checking for res_search in -lresolv... (cached) yes checking for gssapi/gssapi_krb5.h... (cached) yes checking for gss_decapsulate_token... (cached) yes checking for gss_encapsulate_token... (cached) yes checking for gss_oid_equal... (cached) yes checking for gss_get_name_attribute... (cached) yes checking for SPNEGO support in GSSAPI libraries... yes checking for crypt... (cached) yes checking for pam_start in -lpam... (cached) yes checking for security/pam_appl.h... (cached) yes checking for PAM support... yes checking for library containing inet_aton... (cached) none required checking to include LDAP support... /usr checking for ldap_initialize in -lldap... (cached) yes checking for ANSI C header files... (cached) yes checking for sys/wait.h that is POSIX.1 compatible... (cached) yes checking whether time.h and sys/time.h may both be included... (cached) yes checking crypt.h usability... yes checking crypt.h presence... yes checking for crypt.h... yes checking for fcntl.h... (cached) yes checking krb5.h usability... yes checking krb5.h presence... yes checking for krb5.h... yes checking for strings.h... (cached) yes checking for syslog.h... (cached) yes checking for unistd.h... (cached) yes checking for sys/time.h... (cached) yes checking for sys/uio.h... (cached) yes checking for an ANSI C-conforming const... (cached) yes checking for pid_t... (cached) yes checking whether i686-pld-linux-gcc implements __func__... yes checking return type of signal handlers... (cached) void checking for gethostname... (cached) yes checking for mkdir... (cached) yes checking for socket... (cached) yes checking for strdup... (cached) yes checking for getspnam... (cached) yes checking for asprintf... yes checking for strlcat... no checking for strlcpy... no checking if getpwnam_r/getspnam_r take 5 arguments... yes checking for getaddrinfo... (cached) yes checking for getnameinfo... (cached) yes checking whether you have ss_family in struct sockaddr_storage... (cached) yes checking whether you have sa_len in struct sockaddr... (cached) no checking for socklen_t... (cached) yes configure: updating cache .././config.cache checking that generated files are newer than configure... done configure: creating ./config.status config.status: creating Makefile config.status: creating saslauthd.h config.status: executing depfiles commands Configuration Complete. Type 'make' to build. + /usr/bin/make -Otarget -j9 /usr/bin/make all-recursive Making all in include make[2]: Entering directory '/tmp/B.RcC6qk/BUILD/cyrus-sasl-2.1.26/include' i686-pld-linux-gcc -DHAVE_CONFIG_H -I. -I.. -DOBSOLETE_CRAM_ATTR=1 -DKRB5_HEIMDAL -I/usr/include/mysql -I/usr/include -I/usr/include -I/usr/include -Wall -W -O2 -fwrapv -pipe -Wformat -Werror=format-security -gdwarf-4 -fno-debug-types-section -fvar-tracking-assignments -g2 -Wp,-D_FORTIFY_SOURCE=2 -fno-strict-aliasing -fstack-protector-strong --param=ssp-buffer-size=4 -fomit-frame-pointer -march=i686 -fasynchronous-unwind-tables -mtune=pentium4 -gdwarf-4 -fno-debug-types-section -fvar-tracking-assignments -g2 -MT makemd5.o -MD -MP -MF .deps/makemd5.Tpo -c -o makemd5.o makemd5.c makemd5.c: In function 'try_signed': makemd5.c:119:16: warning: '%s' directive writing up to 127 bytes into a region of size 110 [-Wformat-overflow=] sprintf(tmp2, "typedef %s %s;", #TYPE, tmp); \ ^~~~~~~~~~~~~~~~ ~~~ makemd5.c:149:5: note: in expansion of macro 'BITSIZE' BITSIZE(long long); ^~~~~~~ In file included from /usr/include/stdio.h:873, from makemd5.c:89: /usr/include/bits/stdio2.h:36:10: note: '__builtin___sprintf_chk' output between 20 and 147 bytes into a destination of size 128 return __builtin___sprintf_chk (__s, __USE_FORTIFY_LEVEL - 1, ^~~~~~~~~~~~~~~~~~~~~~~~~~~~~~~~~~~~~~~~~~~~~~~~~~~~~~ __bos (__s), __fmt, __va_arg_pack ()); ~~~~~~~~~~~~~~~~~~~~~~~~~~~~~~~~~~~~~ makemd5.c:119:16: warning: '%s' directive writing up to 127 bytes into a region of size 115 [-Wformat-overflow=] sprintf(tmp2, "typedef %s %s;", #TYPE, tmp); \ ^~~~~~~~~~~~~~~~ ~~~ makemd5.c:147:5: note: in expansion of macro 'BITSIZE' BITSIZE(long); ^~~~~~~ In file included from /usr/include/stdio.h:873, from makemd5.c:89: /usr/include/bits/stdio2.h:36:10: note: '__builtin___sprintf_chk' output between 15 and 142 bytes into a destination of size 128 return __builtin___sprintf_chk (__s, __USE_FORTIFY_LEVEL - 1, ^~~~~~~~~~~~~~~~~~~~~~~~~~~~~~~~~~~~~~~~~~~~~~~~~~~~~~ __bos (__s), __fmt, __va_arg_pack ()); ~~~~~~~~~~~~~~~~~~~~~~~~~~~~~~~~~~~~~ makemd5.c:119:16: warning: '%s' directive writing up to 127 bytes into a region of size 116 [-Wformat-overflow=] sprintf(tmp2, "typedef %s %s;", #TYPE, tmp); \ ^~~~~~~~~~~~~~~~ ~~~ makemd5.c:146:5: note: in expansion of macro 'BITSIZE' BITSIZE(int); ^~~~~~~ In file included from /usr/include/stdio.h:873, from makemd5.c:89: /usr/include/bits/stdio2.h:36:10: note: '__builtin___sprintf_chk' output between 14 and 141 bytes into a destination of size 128 return __builtin___sprintf_chk (__s, __USE_FORTIFY_LEVEL - 1, ^~~~~~~~~~~~~~~~~~~~~~~~~~~~~~~~~~~~~~~~~~~~~~~~~~~~~~ __bos (__s), __fmt, __va_arg_pack ()); ~~~~~~~~~~~~~~~~~~~~~~~~~~~~~~~~~~~~~ makemd5.c:119:16: warning: '%s' directive writing up to 127 bytes into a region of size 114 [-Wformat-overflow=] sprintf(tmp2, "typedef %s %s;", #TYPE, tmp); \ ^~~~~~~~~~~~~~~~ ~~~ makemd5.c:145:5: note: in expansion of macro 'BITSIZE' BITSIZE(short); ^~~~~~~ In file included from /usr/include/stdio.h:873, from makemd5.c:89: /usr/include/bits/stdio2.h:36:10: note: '__builtin___sprintf_chk' output between 16 and 143 bytes into a destination of size 128 return __builtin___sprintf_chk (__s, __USE_FORTIFY_LEVEL - 1, ^~~~~~~~~~~~~~~~~~~~~~~~~~~~~~~~~~~~~~~~~~~~~~~~~~~~~~ __bos (__s), __fmt, __va_arg_pack ()); ~~~~~~~~~~~~~~~~~~~~~~~~~~~~~~~~~~~~~ makemd5.c:119:16: warning: '%s' directive writing up to 127 bytes into a region of size 108 [-Wformat-overflow=] sprintf(tmp2, "typedef %s %s;", #TYPE, tmp); \ ^~~~~~~~~~~~~~~~ ~~~ makemd5.c:144:5: note: in expansion of macro 'BITSIZE' BITSIZE(signed char); ^~~~~~~ In file included from /usr/include/stdio.h:873, from makemd5.c:89: /usr/include/bits/stdio2.h:36:10: note: '__builtin___sprintf_chk' output between 22 and 149 bytes into a destination of size 128 return __builtin___sprintf_chk (__s, __USE_FORTIFY_LEVEL - 1, ^~~~~~~~~~~~~~~~~~~~~~~~~~~~~~~~~~~~~~~~~~~~~~~~~~~~~~ __bos (__s), __fmt, __va_arg_pack ()); ~~~~~~~~~~~~~~~~~~~~~~~~~~~~~~~~~~~~~ makemd5.c:119:16: warning: '%s' directive writing up to 127 bytes into a region of size 112 [-Wformat-overflow=] sprintf(tmp2, "typedef %s %s;", #TYPE, tmp); \ ^~~~~~~~~~~~~~~~ ~~~ makemd5.c:142:5: note: in expansion of macro 'BITSIZE' BITSIZE(int64_t); ^~~~~~~ In file included from /usr/include/stdio.h:873, from makemd5.c:89: /usr/include/bits/stdio2.h:36:10: note: '__builtin___sprintf_chk' output between 18 and 145 bytes into a destination of size 128 return __builtin___sprintf_chk (__s, __USE_FORTIFY_LEVEL - 1, ^~~~~~~~~~~~~~~~~~~~~~~~~~~~~~~~~~~~~~~~~~~~~~~~~~~~~~ __bos (__s), __fmt, __va_arg_pack ()); ~~~~~~~~~~~~~~~~~~~~~~~~~~~~~~~~~~~~~ makemd5.c:119:16: warning: '%s' directive writing up to 127 bytes into a region of size 112 [-Wformat-overflow=] sprintf(tmp2, "typedef %s %s;", #TYPE, tmp); \ ^~~~~~~~~~~~~~~~ ~~~ makemd5.c:139:5: note: in expansion of macro 'BITSIZE' BITSIZE(int32_t); ^~~~~~~ In file included from /usr/include/stdio.h:873, from makemd5.c:89: /usr/include/bits/stdio2.h:36:10: note: '__builtin___sprintf_chk' output between 18 and 145 bytes into a destination of size 128 return __builtin___sprintf_chk (__s, __USE_FORTIFY_LEVEL - 1, ^~~~~~~~~~~~~~~~~~~~~~~~~~~~~~~~~~~~~~~~~~~~~~~~~~~~~~ __bos (__s), __fmt, __va_arg_pack ()); ~~~~~~~~~~~~~~~~~~~~~~~~~~~~~~~~~~~~~ makemd5.c:119:16: warning: '%s' directive writing up to 127 bytes into a region of size 112 [-Wformat-overflow=] sprintf(tmp2, "typedef %s %s;", #TYPE, tmp); \ ^~~~~~~~~~~~~~~~ ~~~ makemd5.c:136:5: note: in expansion of macro 'BITSIZE' BITSIZE(int16_t); ^~~~~~~ In file included from /usr/include/stdio.h:873, from makemd5.c:89: /usr/include/bits/stdio2.h:36:10: note: '__builtin___sprintf_chk' output between 18 and 145 bytes into a destination of size 128 return __builtin___sprintf_chk (__s, __USE_FORTIFY_LEVEL - 1, ^~~~~~~~~~~~~~~~~~~~~~~~~~~~~~~~~~~~~~~~~~~~~~~~~~~~~~ __bos (__s), __fmt, __va_arg_pack ()); ~~~~~~~~~~~~~~~~~~~~~~~~~~~~~~~~~~~~~ makemd5.c:119:16: warning: '%s' directive writing up to 127 bytes into a region of size 113 [-Wformat-overflow=] sprintf(tmp2, "typedef %s %s;", #TYPE, tmp); \ ^~~~~~~~~~~~~~~~ ~~~ makemd5.c:133:5: note: in expansion of macro 'BITSIZE' BITSIZE(int8_t); ^~~~~~~ In file included from /usr/include/stdio.h:873, from makemd5.c:89: /usr/include/bits/stdio2.h:36:10: note: '__builtin___sprintf_chk' output between 17 and 144 bytes into a destination of size 128 return __builtin___sprintf_chk (__s, __USE_FORTIFY_LEVEL - 1, ^~~~~~~~~~~~~~~~~~~~~~~~~~~~~~~~~~~~~~~~~~~~~~~~~~~~~~ __bos (__s), __fmt, __va_arg_pack ()); ~~~~~~~~~~~~~~~~~~~~~~~~~~~~~~~~~~~~~ makemd5.c: In function 'try_unsigned': makemd5.c:119:16: warning: '%s' directive writing up to 127 bytes into a region of size 101 [-Wformat-overflow=] sprintf(tmp2, "typedef %s %s;", #TYPE, tmp); \ ^~~~~~~~~~~~~~~~ ~~~ makemd5.c:174:5: note: in expansion of macro 'BITSIZE' BITSIZE(unsigned long long); ^~~~~~~ In file included from /usr/include/stdio.h:873, from makemd5.c:89: /usr/include/bits/stdio2.h:36:10: note: '__builtin___sprintf_chk' output between 29 and 156 bytes into a destination of size 128 return __builtin___sprintf_chk (__s, __USE_FORTIFY_LEVEL - 1, ^~~~~~~~~~~~~~~~~~~~~~~~~~~~~~~~~~~~~~~~~~~~~~~~~~~~~~ __bos (__s), __fmt, __va_arg_pack ()); ~~~~~~~~~~~~~~~~~~~~~~~~~~~~~~~~~~~~~ makemd5.c:119:16: warning: '%s' directive writing up to 127 bytes into a region of size 106 [-Wformat-overflow=] sprintf(tmp2, "typedef %s %s;", #TYPE, tmp); \ ^~~~~~~~~~~~~~~~ ~~~ makemd5.c:172:5: note: in expansion of macro 'BITSIZE' BITSIZE(unsigned long); ^~~~~~~ In file included from /usr/include/stdio.h:873, from makemd5.c:89: /usr/include/bits/stdio2.h:36:10: note: '__builtin___sprintf_chk' output between 24 and 151 bytes into a destination of size 128 return __builtin___sprintf_chk (__s, __USE_FORTIFY_LEVEL - 1, ^~~~~~~~~~~~~~~~~~~~~~~~~~~~~~~~~~~~~~~~~~~~~~~~~~~~~~ __bos (__s), __fmt, __va_arg_pack ()); ~~~~~~~~~~~~~~~~~~~~~~~~~~~~~~~~~~~~~ makemd5.c:119:16: warning: '%s' directive writing up to 127 bytes into a region of size 107 [-Wformat-overflow=] sprintf(tmp2, "typedef %s %s;", #TYPE, tmp); \ ^~~~~~~~~~~~~~~~ ~~~ makemd5.c:171:5: note: in expansion of macro 'BITSIZE' BITSIZE(unsigned int); ^~~~~~~ In file included from /usr/include/stdio.h:873, from makemd5.c:89: /usr/include/bits/stdio2.h:36:10: note: '__builtin___sprintf_chk' output between 23 and 150 bytes into a destination of size 128 return __builtin___sprintf_chk (__s, __USE_FORTIFY_LEVEL - 1, ^~~~~~~~~~~~~~~~~~~~~~~~~~~~~~~~~~~~~~~~~~~~~~~~~~~~~~ __bos (__s), __fmt, __va_arg_pack ()); ~~~~~~~~~~~~~~~~~~~~~~~~~~~~~~~~~~~~~ makemd5.c:119:16: warning: '%s' directive writing up to 127 bytes into a region of size 105 [-Wformat-overflow=] sprintf(tmp2, "typedef %s %s;", #TYPE, tmp); \ ^~~~~~~~~~~~~~~~ ~~~ makemd5.c:170:5: note: in expansion of macro 'BITSIZE' BITSIZE(unsigned short); ^~~~~~~ In file included from /usr/include/stdio.h:873, from makemd5.c:89: /usr/include/bits/stdio2.h:36:10: note: '__builtin___sprintf_chk' output between 25 and 152 bytes into a destination of size 128 return __builtin___sprintf_chk (__s, __USE_FORTIFY_LEVEL - 1, ^~~~~~~~~~~~~~~~~~~~~~~~~~~~~~~~~~~~~~~~~~~~~~~~~~~~~~ __bos (__s), __fmt, __va_arg_pack ()); ~~~~~~~~~~~~~~~~~~~~~~~~~~~~~~~~~~~~~ makemd5.c:119:16: warning: '%s' directive writing up to 127 bytes into a region of size 106 [-Wformat-overflow=] sprintf(tmp2, "typedef %s %s;", #TYPE, tmp); \ ^~~~~~~~~~~~~~~~ ~~~ makemd5.c:169:5: note: in expansion of macro 'BITSIZE' BITSIZE(unsigned char); ^~~~~~~ In file included from /usr/include/stdio.h:873, from makemd5.c:89: /usr/include/bits/stdio2.h:36:10: note: '__builtin___sprintf_chk' output between 24 and 151 bytes into a destination of size 128 return __builtin___sprintf_chk (__s, __USE_FORTIFY_LEVEL - 1, ^~~~~~~~~~~~~~~~~~~~~~~~~~~~~~~~~~~~~~~~~~~~~~~~~~~~~~ __bos (__s), __fmt, __va_arg_pack ()); ~~~~~~~~~~~~~~~~~~~~~~~~~~~~~~~~~~~~~ makemd5.c:119:16: warning: '%s' directive writing up to 127 bytes into a region of size 111 [-Wformat-overflow=] sprintf(tmp2, "typedef %s %s;", #TYPE, tmp); \ ^~~~~~~~~~~~~~~~ ~~~ makemd5.c:167:5: note: in expansion of macro 'BITSIZE' BITSIZE(uint64_t); ^~~~~~~ In file included from /usr/include/stdio.h:873, from makemd5.c:89: /usr/include/bits/stdio2.h:36:10: note: '__builtin___sprintf_chk' output between 19 and 146 bytes into a destination of size 128 return __builtin___sprintf_chk (__s, __USE_FORTIFY_LEVEL - 1, ^~~~~~~~~~~~~~~~~~~~~~~~~~~~~~~~~~~~~~~~~~~~~~~~~~~~~~ __bos (__s), __fmt, __va_arg_pack ()); ~~~~~~~~~~~~~~~~~~~~~~~~~~~~~~~~~~~~~ makemd5.c:119:16: warning: '%s' directive writing up to 127 bytes into a region of size 111 [-Wformat-overflow=] sprintf(tmp2, "typedef %s %s;", #TYPE, tmp); \ ^~~~~~~~~~~~~~~~ ~~~ makemd5.c:164:5: note: in expansion of macro 'BITSIZE' BITSIZE(uint32_t); ^~~~~~~ In file included from /usr/include/stdio.h:873, from makemd5.c:89: /usr/include/bits/stdio2.h:36:10: note: '__builtin___sprintf_chk' output between 19 and 146 bytes into a destination of size 128 return __builtin___sprintf_chk (__s, __USE_FORTIFY_LEVEL - 1, ^~~~~~~~~~~~~~~~~~~~~~~~~~~~~~~~~~~~~~~~~~~~~~~~~~~~~~ __bos (__s), __fmt, __va_arg_pack ()); ~~~~~~~~~~~~~~~~~~~~~~~~~~~~~~~~~~~~~ makemd5.c:119:16: warning: '%s' directive writing up to 127 bytes into a region of size 111 [-Wformat-overflow=] sprintf(tmp2, "typedef %s %s;", #TYPE, tmp); \ ^~~~~~~~~~~~~~~~ ~~~ makemd5.c:161:5: note: in expansion of macro 'BITSIZE' BITSIZE(uint16_t); ^~~~~~~ In file included from /usr/include/stdio.h:873, from makemd5.c:89: /usr/include/bits/stdio2.h:36:10: note: '__builtin___sprintf_chk' output between 19 and 146 bytes into a destination of size 128 return __builtin___sprintf_chk (__s, __USE_FORTIFY_LEVEL - 1, ^~~~~~~~~~~~~~~~~~~~~~~~~~~~~~~~~~~~~~~~~~~~~~~~~~~~~~ __bos (__s), __fmt, __va_arg_pack ()); ~~~~~~~~~~~~~~~~~~~~~~~~~~~~~~~~~~~~~ makemd5.c:119:16: warning: '%s' directive writing up to 127 bytes into a region of size 112 [-Wformat-overflow=] sprintf(tmp2, "typedef %s %s;", #TYPE, tmp); \ ^~~~~~~~~~~~~~~~ ~~~ makemd5.c:158:5: note: in expansion of macro 'BITSIZE' BITSIZE(uint8_t); ^~~~~~~ In file included from /usr/include/stdio.h:873, from makemd5.c:89: /usr/include/bits/stdio2.h:36:10: note: '__builtin___sprintf_chk' output between 18 and 145 bytes into a destination of size 128 return __builtin___sprintf_chk (__s, __USE_FORTIFY_LEVEL - 1, ^~~~~~~~~~~~~~~~~~~~~~~~~~~~~~~~~~~~~~~~~~~~~~~~~~~~~~ __bos (__s), __fmt, __va_arg_pack ()); ~~~~~~~~~~~~~~~~~~~~~~~~~~~~~~~~~~~~~ mv -f .deps/makemd5.Tpo .deps/makemd5.Po make[2]: Leaving directory '/tmp/B.RcC6qk/BUILD/cyrus-sasl-2.1.26/include' make[2]: Entering directory '/tmp/B.RcC6qk/BUILD/cyrus-sasl-2.1.26/include' /bin/sh ../libtool --tag=CC --mode=link i686-pld-linux-gcc -Wall -W -O2 -fwrapv -pipe -Wformat -Werror=format-security -gdwarf-4 -fno-debug-types-section -fvar-tracking-assignments -g2 -Wp,-D_FORTIFY_SOURCE=2 -fno-strict-aliasing -fstack-protector-strong --param=ssp-buffer-size=4 -fomit-frame-pointer -march=i686 -fasynchronous-unwind-tables -mtune=pentium4 -gdwarf-4 -fno-debug-types-section -fvar-tracking-assignments -g2 -lcrypt -o makemd5 makemd5.o -lresolv -lpam libtool: link: i686-pld-linux-gcc -Wall -W -O2 -fwrapv -pipe -Wformat -Werror=format-security -gdwarf-4 -fno-debug-types-section -fvar-tracking-assignments -g2 -Wp,-D_FORTIFY_SOURCE=2 -fno-strict-aliasing -fstack-protector-strong --param=ssp-buffer-size=4 -fomit-frame-pointer -march=i686 -fasynchronous-unwind-tables -mtune=pentium4 -gdwarf-4 -fno-debug-types-section -fvar-tracking-assignments -g2 -o makemd5 makemd5.o -lcrypt -lresolv /usr/lib/libpam.so /usr/lib/libaudit.so /usr/lib/libcap-ng.so -ldl make[2]: Leaving directory '/tmp/B.RcC6qk/BUILD/cyrus-sasl-2.1.26/include' make[2]: Entering directory '/tmp/B.RcC6qk/BUILD/cyrus-sasl-2.1.26/include' rm -f md5global.h ./makemd5 md5global.h make[2]: Leaving directory '/tmp/B.RcC6qk/BUILD/cyrus-sasl-2.1.26/include' Making all in sasldb make[2]: Entering directory '/tmp/B.RcC6qk/BUILD/cyrus-sasl-2.1.26/sasldb' /bin/sh ../libtool --tag=CC --mode=compile i686-pld-linux-gcc -DHAVE_CONFIG_H -I. -I.. -I../include -I../include -DOBSOLETE_CRAM_ATTR=1 -DKRB5_HEIMDAL -I/usr/include/mysql -I/usr/include -I/usr/include -I/usr/include -Wall -W -O2 -fwrapv -pipe -Wformat -Werror=format-security -gdwarf-4 -fno-debug-types-section -fvar-tracking-assignments -g2 -Wp,-D_FORTIFY_SOURCE=2 -fno-strict-aliasing -fstack-protector-strong --param=ssp-buffer-size=4 -fomit-frame-pointer -march=i686 -fasynchronous-unwind-tables -mtune=pentium4 -gdwarf-4 -fno-debug-types-section -fvar-tracking-assignments -g2 -MT allockey.lo -MD -MP -MF .deps/allockey.Tpo -c -o allockey.lo allockey.c libtool: compile: i686-pld-linux-gcc -DHAVE_CONFIG_H -I. -I.. -I../include -I../include -DOBSOLETE_CRAM_ATTR=1 -DKRB5_HEIMDAL -I/usr/include/mysql -I/usr/include -I/usr/include -I/usr/include -Wall -W -O2 -fwrapv -pipe -Wformat -Werror=format-security -gdwarf-4 -fno-debug-types-section -fvar-tracking-assignments -g2 -Wp,-D_FORTIFY_SOURCE=2 -fno-strict-aliasing -fstack-protector-strong --param=ssp-buffer-size=4 -fomit-frame-pointer -march=i686 -fasynchronous-unwind-tables -mtune=pentium4 -gdwarf-4 -fno-debug-types-section -fvar-tracking-assignments -g2 -MT allockey.lo -MD -MP -MF .deps/allockey.Tpo -c allockey.c -fPIC -DPIC -o .libs/allockey.o libtool: compile: i686-pld-linux-gcc -DHAVE_CONFIG_H -I. -I.. -I../include -I../include -DOBSOLETE_CRAM_ATTR=1 -DKRB5_HEIMDAL -I/usr/include/mysql -I/usr/include -I/usr/include -I/usr/include -Wall -W -O2 -fwrapv -pipe -Wformat -Werror=format-security -gdwarf-4 -fno-debug-types-section -fvar-tracking-assignments -g2 -Wp,-D_FORTIFY_SOURCE=2 -fno-strict-aliasing -fstack-protector-strong --param=ssp-buffer-size=4 -fomit-frame-pointer -march=i686 -fasynchronous-unwind-tables -mtune=pentium4 -gdwarf-4 -fno-debug-types-section -fvar-tracking-assignments -g2 -MT allockey.lo -MD -MP -MF .deps/allockey.Tpo -c allockey.c -o allockey.o >/dev/null 2>&1 mv -f .deps/allockey.Tpo .deps/allockey.Plo make[2]: Leaving directory '/tmp/B.RcC6qk/BUILD/cyrus-sasl-2.1.26/sasldb' make[2]: Entering directory '/tmp/B.RcC6qk/BUILD/cyrus-sasl-2.1.26/sasldb' /bin/sh ../libtool --tag=CC --mode=compile i686-pld-linux-gcc -DHAVE_CONFIG_H -I. -I.. -I../include -I../include -DOBSOLETE_CRAM_ATTR=1 -DKRB5_HEIMDAL -I/usr/include/mysql -I/usr/include -I/usr/include -I/usr/include -Wall -W -O2 -fwrapv -pipe -Wformat -Werror=format-security -gdwarf-4 -fno-debug-types-section -fvar-tracking-assignments -g2 -Wp,-D_FORTIFY_SOURCE=2 -fno-strict-aliasing -fstack-protector-strong --param=ssp-buffer-size=4 -fomit-frame-pointer -march=i686 -fasynchronous-unwind-tables -mtune=pentium4 -gdwarf-4 -fno-debug-types-section -fvar-tracking-assignments -g2 -MT db_berkeley.lo -MD -MP -MF .deps/db_berkeley.Tpo -c -o db_berkeley.lo db_berkeley.c libtool: compile: i686-pld-linux-gcc -DHAVE_CONFIG_H -I. -I.. -I../include -I../include -DOBSOLETE_CRAM_ATTR=1 -DKRB5_HEIMDAL -I/usr/include/mysql -I/usr/include -I/usr/include -I/usr/include -Wall -W -O2 -fwrapv -pipe -Wformat -Werror=format-security -gdwarf-4 -fno-debug-types-section -fvar-tracking-assignments -g2 -Wp,-D_FORTIFY_SOURCE=2 -fno-strict-aliasing -fstack-protector-strong --param=ssp-buffer-size=4 -fomit-frame-pointer -march=i686 -fasynchronous-unwind-tables -mtune=pentium4 -gdwarf-4 -fno-debug-types-section -fvar-tracking-assignments -g2 -MT db_berkeley.lo -MD -MP -MF .deps/db_berkeley.Tpo -c db_berkeley.c -fPIC -DPIC -o .libs/db_berkeley.o libtool: compile: i686-pld-linux-gcc -DHAVE_CONFIG_H -I. -I.. -I../include -I../include -DOBSOLETE_CRAM_ATTR=1 -DKRB5_HEIMDAL -I/usr/include/mysql -I/usr/include -I/usr/include -I/usr/include -Wall -W -O2 -fwrapv -pipe -Wformat -Werror=format-security -gdwarf-4 -fno-debug-types-section -fvar-tracking-assignments -g2 -Wp,-D_FORTIFY_SOURCE=2 -fno-strict-aliasing -fstack-protector-strong --param=ssp-buffer-size=4 -fomit-frame-pointer -march=i686 -fasynchronous-unwind-tables -mtune=pentium4 -gdwarf-4 -fno-debug-types-section -fvar-tracking-assignments -g2 -MT db_berkeley.lo -MD -MP -MF .deps/db_berkeley.Tpo -c db_berkeley.c -o db_berkeley.o >/dev/null 2>&1 mv -f .deps/db_berkeley.Tpo .deps/db_berkeley.Plo make[2]: Leaving directory '/tmp/B.RcC6qk/BUILD/cyrus-sasl-2.1.26/sasldb' make[2]: Entering directory '/tmp/B.RcC6qk/BUILD/cyrus-sasl-2.1.26/sasldb' /bin/sh ../libtool --tag=CC --mode=link i686-pld-linux-gcc -Wall -W -O2 -fwrapv -pipe -Wformat -Werror=format-security -gdwarf-4 -fno-debug-types-section -fvar-tracking-assignments -g2 -Wp,-D_FORTIFY_SOURCE=2 -fno-strict-aliasing -fstack-protector-strong --param=ssp-buffer-size=4 -fomit-frame-pointer -march=i686 -fasynchronous-unwind-tables -mtune=pentium4 -gdwarf-4 -fno-debug-types-section -fvar-tracking-assignments -g2 -lcrypt -o libsasldb.la allockey.lo db_berkeley.lo -lresolv -lpam libtool: link: ar cru .libs/libsasldb.a .libs/allockey.o .libs/db_berkeley.o libtool: link: ranlib .libs/libsasldb.a libtool: link: ( cd ".libs" && rm -f "libsasldb.la" && ln -s "../libsasldb.la" "libsasldb.la" ) make[2]: Leaving directory '/tmp/B.RcC6qk/BUILD/cyrus-sasl-2.1.26/sasldb' Making all in lib make[2]: Entering directory '/tmp/B.RcC6qk/BUILD/cyrus-sasl-2.1.26/lib' ln -s ../plugins/sasldb.c ../sasldb/db_berkeley.c ../sasldb/allockey.c ../plugins/cram.c ../plugins/digestmd5.c ../plugins/scram.c ../plugins/otp.c ../plugins/gssapi.c ../plugins/gs2.c ../plugins/plain.c ../plugins/anonymous.c ../plugins/login.c ../plugins/ntlm.c ../plugins/passdss.c ../plugins/ldapdb.c . make[2]: Leaving directory '/tmp/B.RcC6qk/BUILD/cyrus-sasl-2.1.26/lib' /usr/bin/make all-am make[3]: Entering directory '/tmp/B.RcC6qk/BUILD/cyrus-sasl-2.1.26/lib' rm -f libsasl2.a ar cru libsasl2.a ranlib libsasl2.a make[3]: Leaving directory '/tmp/B.RcC6qk/BUILD/cyrus-sasl-2.1.26/lib' make[3]: Entering directory '/tmp/B.RcC6qk/BUILD/cyrus-sasl-2.1.26/lib' /bin/sh ../libtool --tag=CC --mode=compile i686-pld-linux-gcc -DHAVE_CONFIG_H -I. -I.. -DLIBSASL_EXPORTS=1 -I../include -I../plugins -I../include -I../sasldb -DOBSOLETE_CRAM_ATTR=1 -DKRB5_HEIMDAL -I/usr/include/mysql -I/usr/include -I/usr/include -I/usr/include -Wall -W -O2 -fwrapv -pipe -Wformat -Werror=format-security -gdwarf-4 -fno-debug-types-section -fvar-tracking-assignments -g2 -Wp,-D_FORTIFY_SOURCE=2 -fno-strict-aliasing -fstack-protector-strong --param=ssp-buffer-size=4 -fomit-frame-pointer -march=i686 -fasynchronous-unwind-tables -mtune=pentium4 -gdwarf-4 -fno-debug-types-section -fvar-tracking-assignments -g2 -MT canonusr.lo -MD -MP -MF .deps/canonusr.Tpo -c -o canonusr.lo canonusr.c libtool: compile: i686-pld-linux-gcc -DHAVE_CONFIG_H -I. -I.. -DLIBSASL_EXPORTS=1 -I../include -I../plugins -I../include -I../sasldb -DOBSOLETE_CRAM_ATTR=1 -DKRB5_HEIMDAL -I/usr/include/mysql -I/usr/include -I/usr/include -I/usr/include -Wall -W -O2 -fwrapv -pipe -Wformat -Werror=format-security -gdwarf-4 -fno-debug-types-section -fvar-tracking-assignments -g2 -Wp,-D_FORTIFY_SOURCE=2 -fno-strict-aliasing -fstack-protector-strong --param=ssp-buffer-size=4 -fomit-frame-pointer -march=i686 -fasynchronous-unwind-tables -mtune=pentium4 -gdwarf-4 -fno-debug-types-section -fvar-tracking-assignments -g2 -MT canonusr.lo -MD -MP -MF .deps/canonusr.Tpo -c canonusr.c -fPIC -DPIC -o .libs/canonusr.o libtool: compile: i686-pld-linux-gcc -DHAVE_CONFIG_H -I. -I.. -DLIBSASL_EXPORTS=1 -I../include -I../plugins -I../include -I../sasldb -DOBSOLETE_CRAM_ATTR=1 -DKRB5_HEIMDAL -I/usr/include/mysql -I/usr/include -I/usr/include -I/usr/include -Wall -W -O2 -fwrapv -pipe -Wformat -Werror=format-security -gdwarf-4 -fno-debug-types-section -fvar-tracking-assignments -g2 -Wp,-D_FORTIFY_SOURCE=2 -fno-strict-aliasing -fstack-protector-strong --param=ssp-buffer-size=4 -fomit-frame-pointer -march=i686 -fasynchronous-unwind-tables -mtune=pentium4 -gdwarf-4 -fno-debug-types-section -fvar-tracking-assignments -g2 -MT canonusr.lo -MD -MP -MF .deps/canonusr.Tpo -c canonusr.c -o canonusr.o >/dev/null 2>&1 mv -f .deps/canonusr.Tpo .deps/canonusr.Plo make[3]: Leaving directory '/tmp/B.RcC6qk/BUILD/cyrus-sasl-2.1.26/lib' make[3]: Entering directory '/tmp/B.RcC6qk/BUILD/cyrus-sasl-2.1.26/lib' /bin/sh ../libtool --tag=CC --mode=compile i686-pld-linux-gcc -DHAVE_CONFIG_H -I. -I.. -DLIBSASL_EXPORTS=1 -I../include -I../plugins -I../include -I../sasldb -DOBSOLETE_CRAM_ATTR=1 -DKRB5_HEIMDAL -I/usr/include/mysql -I/usr/include -I/usr/include -I/usr/include -Wall -W -O2 -fwrapv -pipe -Wformat -Werror=format-security -gdwarf-4 -fno-debug-types-section -fvar-tracking-assignments -g2 -Wp,-D_FORTIFY_SOURCE=2 -fno-strict-aliasing -fstack-protector-strong --param=ssp-buffer-size=4 -fomit-frame-pointer -march=i686 -fasynchronous-unwind-tables -mtune=pentium4 -gdwarf-4 -fno-debug-types-section -fvar-tracking-assignments -g2 -MT external.lo -MD -MP -MF .deps/external.Tpo -c -o external.lo external.c libtool: compile: i686-pld-linux-gcc -DHAVE_CONFIG_H -I. -I.. -DLIBSASL_EXPORTS=1 -I../include -I../plugins -I../include -I../sasldb -DOBSOLETE_CRAM_ATTR=1 -DKRB5_HEIMDAL -I/usr/include/mysql -I/usr/include -I/usr/include -I/usr/include -Wall -W -O2 -fwrapv -pipe -Wformat -Werror=format-security -gdwarf-4 -fno-debug-types-section -fvar-tracking-assignments -g2 -Wp,-D_FORTIFY_SOURCE=2 -fno-strict-aliasing -fstack-protector-strong --param=ssp-buffer-size=4 -fomit-frame-pointer -march=i686 -fasynchronous-unwind-tables -mtune=pentium4 -gdwarf-4 -fno-debug-types-section -fvar-tracking-assignments -g2 -MT external.lo -MD -MP -MF .deps/external.Tpo -c external.c -fPIC -DPIC -o .libs/external.o external.c:60:19: warning: 'plugin_id' defined but not used [-Wunused-const-variable=] static const char plugin_id[] = "$Id: external.c,v 1.24 2009/03/10 16:27:52 mel Exp $"; ^~~~~~~~~ libtool: compile: i686-pld-linux-gcc -DHAVE_CONFIG_H -I. -I.. -DLIBSASL_EXPORTS=1 -I../include -I../plugins -I../include -I../sasldb -DOBSOLETE_CRAM_ATTR=1 -DKRB5_HEIMDAL -I/usr/include/mysql -I/usr/include -I/usr/include -I/usr/include -Wall -W -O2 -fwrapv -pipe -Wformat -Werror=format-security -gdwarf-4 -fno-debug-types-section -fvar-tracking-assignments -g2 -Wp,-D_FORTIFY_SOURCE=2 -fno-strict-aliasing -fstack-protector-strong --param=ssp-buffer-size=4 -fomit-frame-pointer -march=i686 -fasynchronous-unwind-tables -mtune=pentium4 -gdwarf-4 -fno-debug-types-section -fvar-tracking-assignments -g2 -MT external.lo -MD -MP -MF .deps/external.Tpo -c external.c -o external.o >/dev/null 2>&1 mv -f .deps/external.Tpo .deps/external.Plo make[3]: Leaving directory '/tmp/B.RcC6qk/BUILD/cyrus-sasl-2.1.26/lib' make[3]: Entering directory '/tmp/B.RcC6qk/BUILD/cyrus-sasl-2.1.26/lib' /bin/sh ../libtool --tag=CC --mode=compile i686-pld-linux-gcc -DHAVE_CONFIG_H -I. -I.. -DLIBSASL_EXPORTS=1 -I../include -I../plugins -I../include -I../sasldb -DOBSOLETE_CRAM_ATTR=1 -DKRB5_HEIMDAL -I/usr/include/mysql -I/usr/include -I/usr/include -I/usr/include -Wall -W -O2 -fwrapv -pipe -Wformat -Werror=format-security -gdwarf-4 -fno-debug-types-section -fvar-tracking-assignments -g2 -Wp,-D_FORTIFY_SOURCE=2 -fno-strict-aliasing -fstack-protector-strong --param=ssp-buffer-size=4 -fomit-frame-pointer -march=i686 -fasynchronous-unwind-tables -mtune=pentium4 -gdwarf-4 -fno-debug-types-section -fvar-tracking-assignments -g2 -MT config.lo -MD -MP -MF .deps/config.Tpo -c -o config.lo config.c libtool: compile: i686-pld-linux-gcc -DHAVE_CONFIG_H -I. -I.. -DLIBSASL_EXPORTS=1 -I../include -I../plugins -I../include -I../sasldb -DOBSOLETE_CRAM_ATTR=1 -DKRB5_HEIMDAL -I/usr/include/mysql -I/usr/include -I/usr/include -I/usr/include -Wall -W -O2 -fwrapv -pipe -Wformat -Werror=format-security -gdwarf-4 -fno-debug-types-section -fvar-tracking-assignments -g2 -Wp,-D_FORTIFY_SOURCE=2 -fno-strict-aliasing -fstack-protector-strong --param=ssp-buffer-size=4 -fomit-frame-pointer -march=i686 -fasynchronous-unwind-tables -mtune=pentium4 -gdwarf-4 -fno-debug-types-section -fvar-tracking-assignments -g2 -MT config.lo -MD -MP -MF .deps/config.Tpo -c config.c -fPIC -DPIC -o .libs/config.o libtool: compile: i686-pld-linux-gcc -DHAVE_CONFIG_H -I. -I.. -DLIBSASL_EXPORTS=1 -I../include -I../plugins -I../include -I../sasldb -DOBSOLETE_CRAM_ATTR=1 -DKRB5_HEIMDAL -I/usr/include/mysql -I/usr/include -I/usr/include -I/usr/include -Wall -W -O2 -fwrapv -pipe -Wformat -Werror=format-security -gdwarf-4 -fno-debug-types-section -fvar-tracking-assignments -g2 -Wp,-D_FORTIFY_SOURCE=2 -fno-strict-aliasing -fstack-protector-strong --param=ssp-buffer-size=4 -fomit-frame-pointer -march=i686 -fasynchronous-unwind-tables -mtune=pentium4 -gdwarf-4 -fno-debug-types-section -fvar-tracking-assignments -g2 -MT config.lo -MD -MP -MF .deps/config.Tpo -c config.c -o config.o >/dev/null 2>&1 mv -f .deps/config.Tpo .deps/config.Plo make[3]: Leaving directory '/tmp/B.RcC6qk/BUILD/cyrus-sasl-2.1.26/lib' make[3]: Entering directory '/tmp/B.RcC6qk/BUILD/cyrus-sasl-2.1.26/lib' /bin/sh ../libtool --tag=CC --mode=compile i686-pld-linux-gcc -DHAVE_CONFIG_H -I. -I.. -DLIBSASL_EXPORTS=1 -I../include -I../plugins -I../include -I../sasldb -DOBSOLETE_CRAM_ATTR=1 -DKRB5_HEIMDAL -I/usr/include/mysql -I/usr/include -I/usr/include -I/usr/include -Wall -W -O2 -fwrapv -pipe -Wformat -Werror=format-security -gdwarf-4 -fno-debug-types-section -fvar-tracking-assignments -g2 -Wp,-D_FORTIFY_SOURCE=2 -fno-strict-aliasing -fstack-protector-strong --param=ssp-buffer-size=4 -fomit-frame-pointer -march=i686 -fasynchronous-unwind-tables -mtune=pentium4 -gdwarf-4 -fno-debug-types-section -fvar-tracking-assignments -g2 -MT saslutil.lo -MD -MP -MF .deps/saslutil.Tpo -c -o saslutil.lo saslutil.c libtool: compile: i686-pld-linux-gcc -DHAVE_CONFIG_H -I. -I.. -DLIBSASL_EXPORTS=1 -I../include -I../plugins -I../include -I../sasldb -DOBSOLETE_CRAM_ATTR=1 -DKRB5_HEIMDAL -I/usr/include/mysql -I/usr/include -I/usr/include -I/usr/include -Wall -W -O2 -fwrapv -pipe -Wformat -Werror=format-security -gdwarf-4 -fno-debug-types-section -fvar-tracking-assignments -g2 -Wp,-D_FORTIFY_SOURCE=2 -fno-strict-aliasing -fstack-protector-strong --param=ssp-buffer-size=4 -fomit-frame-pointer -march=i686 -fasynchronous-unwind-tables -mtune=pentium4 -gdwarf-4 -fno-debug-types-section -fvar-tracking-assignments -g2 -MT saslutil.lo -MD -MP -MF .deps/saslutil.Tpo -c saslutil.c -fPIC -DPIC -o .libs/saslutil.o saslutil.c: In function 'sasl_encode64': saslutil.c:134:11: warning: variable 'blah' set but not used [-Wunused-but-set-variable] char *blah; ^~~~ saslutil.c: In function 'sasl_utf8verify': saslutil.c:312:29: warning: bitwise comparison always evaluates to true [-Wtautological-compare] if ((str[++i] & 0xC0) != 0xF0) return SASL_BADPROT; /* needed a 10 octet */ ^~ libtool: compile: i686-pld-linux-gcc -DHAVE_CONFIG_H -I. -I.. -DLIBSASL_EXPORTS=1 -I../include -I../plugins -I../include -I../sasldb -DOBSOLETE_CRAM_ATTR=1 -DKRB5_HEIMDAL -I/usr/include/mysql -I/usr/include -I/usr/include -I/usr/include -Wall -W -O2 -fwrapv -pipe -Wformat -Werror=format-security -gdwarf-4 -fno-debug-types-section -fvar-tracking-assignments -g2 -Wp,-D_FORTIFY_SOURCE=2 -fno-strict-aliasing -fstack-protector-strong --param=ssp-buffer-size=4 -fomit-frame-pointer -march=i686 -fasynchronous-unwind-tables -mtune=pentium4 -gdwarf-4 -fno-debug-types-section -fvar-tracking-assignments -g2 -MT saslutil.lo -MD -MP -MF .deps/saslutil.Tpo -c saslutil.c -o saslutil.o >/dev/null 2>&1 mv -f .deps/saslutil.Tpo .deps/saslutil.Plo make[3]: Leaving directory '/tmp/B.RcC6qk/BUILD/cyrus-sasl-2.1.26/lib' make[3]: Entering directory '/tmp/B.RcC6qk/BUILD/cyrus-sasl-2.1.26/lib' /bin/sh ../libtool --tag=CC --mode=compile i686-pld-linux-gcc -DHAVE_CONFIG_H -I. -I.. -DLIBSASL_EXPORTS=1 -I../include -I../plugins -I../include -I../sasldb -DOBSOLETE_CRAM_ATTR=1 -DKRB5_HEIMDAL -I/usr/include/mysql -I/usr/include -I/usr/include -I/usr/include -Wall -W -O2 -fwrapv -pipe -Wformat -Werror=format-security -gdwarf-4 -fno-debug-types-section -fvar-tracking-assignments -g2 -Wp,-D_FORTIFY_SOURCE=2 -fno-strict-aliasing -fstack-protector-strong --param=ssp-buffer-size=4 -fomit-frame-pointer -march=i686 -fasynchronous-unwind-tables -mtune=pentium4 -gdwarf-4 -fno-debug-types-section -fvar-tracking-assignments -g2 -MT md5.lo -MD -MP -MF .deps/md5.Tpo -c -o md5.lo md5.c libtool: compile: i686-pld-linux-gcc -DHAVE_CONFIG_H -I. -I.. -DLIBSASL_EXPORTS=1 -I../include -I../plugins -I../include -I../sasldb -DOBSOLETE_CRAM_ATTR=1 -DKRB5_HEIMDAL -I/usr/include/mysql -I/usr/include -I/usr/include -I/usr/include -Wall -W -O2 -fwrapv -pipe -Wformat -Werror=format-security -gdwarf-4 -fno-debug-types-section -fvar-tracking-assignments -g2 -Wp,-D_FORTIFY_SOURCE=2 -fno-strict-aliasing -fstack-protector-strong --param=ssp-buffer-size=4 -fomit-frame-pointer -march=i686 -fasynchronous-unwind-tables -mtune=pentium4 -gdwarf-4 -fno-debug-types-section -fvar-tracking-assignments -g2 -MT md5.lo -MD -MP -MF .deps/md5.Tpo -c md5.c -fPIC -DPIC -o .libs/md5.o libtool: compile: i686-pld-linux-gcc -DHAVE_CONFIG_H -I. -I.. -DLIBSASL_EXPORTS=1 -I../include -I../plugins -I../include -I../sasldb -DOBSOLETE_CRAM_ATTR=1 -DKRB5_HEIMDAL -I/usr/include/mysql -I/usr/include -I/usr/include -I/usr/include -Wall -W -O2 -fwrapv -pipe -Wformat -Werror=format-security -gdwarf-4 -fno-debug-types-section -fvar-tracking-assignments -g2 -Wp,-D_FORTIFY_SOURCE=2 -fno-strict-aliasing -fstack-protector-strong --param=ssp-buffer-size=4 -fomit-frame-pointer -march=i686 -fasynchronous-unwind-tables -mtune=pentium4 -gdwarf-4 -fno-debug-types-section -fvar-tracking-assignments -g2 -MT md5.lo -MD -MP -MF .deps/md5.Tpo -c md5.c -o md5.o >/dev/null 2>&1 mv -f .deps/md5.Tpo .deps/md5.Plo make[3]: Leaving directory '/tmp/B.RcC6qk/BUILD/cyrus-sasl-2.1.26/lib' make[3]: Entering directory '/tmp/B.RcC6qk/BUILD/cyrus-sasl-2.1.26/lib' /bin/sh ../libtool --tag=CC --mode=compile i686-pld-linux-gcc -DHAVE_CONFIG_H -I. -I.. -DLIBSASL_EXPORTS=1 -I../include -I../plugins -I../include -I../sasldb -DOBSOLETE_CRAM_ATTR=1 -DKRB5_HEIMDAL -I/usr/include/mysql -I/usr/include -I/usr/include -I/usr/include -Wall -W -O2 -fwrapv -pipe -Wformat -Werror=format-security -gdwarf-4 -fno-debug-types-section -fvar-tracking-assignments -g2 -Wp,-D_FORTIFY_SOURCE=2 -fno-strict-aliasing -fstack-protector-strong --param=ssp-buffer-size=4 -fomit-frame-pointer -march=i686 -fasynchronous-unwind-tables -mtune=pentium4 -gdwarf-4 -fno-debug-types-section -fvar-tracking-assignments -g2 -MT checkpw.lo -MD -MP -MF .deps/checkpw.Tpo -c -o checkpw.lo checkpw.c libtool: compile: i686-pld-linux-gcc -DHAVE_CONFIG_H -I. -I.. -DLIBSASL_EXPORTS=1 -I../include -I../plugins -I../include -I../sasldb -DOBSOLETE_CRAM_ATTR=1 -DKRB5_HEIMDAL -I/usr/include/mysql -I/usr/include -I/usr/include -I/usr/include -Wall -W -O2 -fwrapv -pipe -Wformat -Werror=format-security -gdwarf-4 -fno-debug-types-section -fvar-tracking-assignments -g2 -Wp,-D_FORTIFY_SOURCE=2 -fno-strict-aliasing -fstack-protector-strong --param=ssp-buffer-size=4 -fomit-frame-pointer -march=i686 -fasynchronous-unwind-tables -mtune=pentium4 -gdwarf-4 -fno-debug-types-section -fvar-tracking-assignments -g2 -MT checkpw.lo -MD -MP -MF .deps/checkpw.Tpo -c checkpw.c -fPIC -DPIC -o .libs/checkpw.o checkpw.c: In function '_sasl_make_plain_secret': checkpw.c:138:27: warning: pointer targets in passing argument 2 of '_sasl_MD5Update' differ in signedness [-Wpointer-sign] _sasl_MD5Update(&ctx, salt, 16); ^~~~ In file included from ../include/saslplug.h:11, from checkpw.c:53: ../include/md5.h:37:6: note: expected 'const unsigned char *' but argument is of type 'const char *' void _sasl_MD5Update (MD5_CTX *, const unsigned char *, unsigned int); ^~~~~~~~~~~~~~~ checkpw.c:139:27: warning: pointer targets in passing argument 2 of '_sasl_MD5Update' differ in signedness [-Wpointer-sign] _sasl_MD5Update(&ctx, "sasldb", 6); ^~~~~~~~ In file included from ../include/saslplug.h:11, from checkpw.c:53: ../include/md5.h:37:6: note: expected 'const unsigned char *' but argument is of type 'char *' void _sasl_MD5Update (MD5_CTX *, const unsigned char *, unsigned int); ^~~~~~~~~~~~~~~ checkpw.c:140:27: warning: pointer targets in passing argument 2 of '_sasl_MD5Update' differ in signedness [-Wpointer-sign] _sasl_MD5Update(&ctx, passwd, (unsigned int) passlen); ^~~~~~ In file included from ../include/saslplug.h:11, from checkpw.c:53: ../include/md5.h:37:6: note: expected 'const unsigned char *' but argument is of type 'const char *' void _sasl_MD5Update (MD5_CTX *, const unsigned char *, unsigned int); ^~~~~~~~~~~~~~~ checkpw.c: In function 'auxprop_verify_password': checkpw.c:180:46: warning: passing argument 3 of '_sasl_getcallback' from incompatible pointer type [-Wincompatible-pointer-types] if (_sasl_getcallback(conn, SASL_CB_GETOPT, &getopt, &context) == SASL_OK) { ^~~~~~~ In file included from checkpw.c:54: saslint.h:405:24: note: expected 'int (**)(void)' but argument is of type 'int (**)(void *, const char *, const char *, const char **, unsigned int *)' sasl_callback_ft * pproc, ~~~~~~~~~~~~~~~~~~~^~~~~ checkpw.c: In function '_sasl_auxprop_verify_apop': checkpw.c:461:27: warning: pointer targets in passing argument 2 of '_sasl_MD5Update' differ in signedness [-Wpointer-sign] _sasl_MD5Update(&ctx, challenge, strlen(challenge)); ^~~~~~~~~ In file included from ../include/saslplug.h:11, from checkpw.c:53: ../include/md5.h:37:6: note: expected 'const unsigned char *' but argument is of type 'const char *' void _sasl_MD5Update (MD5_CTX *, const unsigned char *, unsigned int); ^~~~~~~~~~~~~~~ checkpw.c:462:51: warning: pointer targets in passing argument 2 of '_sasl_MD5Update' differ in signedness [-Wpointer-sign] _sasl_MD5Update(&ctx, auxprop_values[0].values[0], ~~~~~~~~~~~~~~~~~~~~~~~~^~~ In file included from ../include/saslplug.h:11, from checkpw.c:53: ../include/md5.h:37:6: note: expected 'const unsigned char *' but argument is of type 'const char *' void _sasl_MD5Update (MD5_CTX *, const unsigned char *, unsigned int); ^~~~~~~~~~~~~~~ checkpw.c: In function 'saslauthd_verify_password': checkpw.c:750:49: warning: passing argument 3 of '_sasl_getcallback' from incompatible pointer type [-Wincompatible-pointer-types] if (_sasl_getcallback(conn, SASL_CB_GETOPT, &getopt, &context) == SASL_OK) { ^~~~~~~ In file included from checkpw.c:54: saslint.h:405:24: note: expected 'int (**)(void)' but argument is of type 'int (**)(void *, const char *, const char *, const char **, unsigned int *)' sasl_callback_ft * pproc, ~~~~~~~~~~~~~~~~~~~^~~~~ checkpw.c: In function 'authdaemon_verify_password': checkpw.c:1132:49: warning: passing argument 3 of '_sasl_getcallback' from incompatible pointer type [-Wincompatible-pointer-types] if (_sasl_getcallback(conn, SASL_CB_GETOPT, &getopt, &context) == SASL_OK) { ^~~~~~~ In file included from checkpw.c:54: saslint.h:405:24: note: expected 'int (**)(void)' but argument is of type 'int (**)(void *, const char *, const char *, const char **, unsigned int *)' sasl_callback_ft * pproc, ~~~~~~~~~~~~~~~~~~~^~~~~ checkpw.c: In function '_sasl_md5sum': checkpw.c:1230:27: warning: pointer targets in passing argument 2 of '_sasl_MD5Update' differ in signedness [-Wpointer-sign] _sasl_MD5Update(&ctx, src, strlen(src)); ^~~ In file included from ../include/saslplug.h:11, from checkpw.c:53: ../include/md5.h:37:6: note: expected 'const unsigned char *' but argument is of type 'const char *' void _sasl_MD5Update (MD5_CTX *, const unsigned char *, unsigned int); ^~~~~~~~~~~~~~~ checkpw.c:1231:20: warning: passing argument 1 of '_sasl_MD5Final' from incompatible pointer type [-Wincompatible-pointer-types] _sasl_MD5Final(&md5, &ctx); ^~~~ In file included from ../include/saslplug.h:11, from checkpw.c:53: ../include/md5.h:38:22: note: expected 'unsigned char *' but argument is of type 'char (*)[16]' void _sasl_MD5Final (unsigned char [16], MD5_CTX *); ^~~~~~~~~~~~~~~~~~ checkpw.c: In function 'write_wait': checkpw.c:525:9: warning: this statement may fall through [-Wimplicit-fallthrough=] if (errno == EINTR || errno == EAGAIN) ^ checkpw.c:527:2: note: here default: ^~~~~~~ checkpw.c: In function 'read_wait': checkpw.c:681:9: warning: this statement may fall through [-Wimplicit-fallthrough=] if (errno == EINTR || errno == EAGAIN) ^ checkpw.c:683:2: note: here default: ^~~~~~~ libtool: compile: i686-pld-linux-gcc -DHAVE_CONFIG_H -I. -I.. -DLIBSASL_EXPORTS=1 -I../include -I../plugins -I../include -I../sasldb -DOBSOLETE_CRAM_ATTR=1 -DKRB5_HEIMDAL -I/usr/include/mysql -I/usr/include -I/usr/include -I/usr/include -Wall -W -O2 -fwrapv -pipe -Wformat -Werror=format-security -gdwarf-4 -fno-debug-types-section -fvar-tracking-assignments -g2 -Wp,-D_FORTIFY_SOURCE=2 -fno-strict-aliasing -fstack-protector-strong --param=ssp-buffer-size=4 -fomit-frame-pointer -march=i686 -fasynchronous-unwind-tables -mtune=pentium4 -gdwarf-4 -fno-debug-types-section -fvar-tracking-assignments -g2 -MT checkpw.lo -MD -MP -MF .deps/checkpw.Tpo -c checkpw.c -o checkpw.o >/dev/null 2>&1 mv -f .deps/checkpw.Tpo .deps/checkpw.Plo make[3]: Leaving directory '/tmp/B.RcC6qk/BUILD/cyrus-sasl-2.1.26/lib' make[3]: Entering directory '/tmp/B.RcC6qk/BUILD/cyrus-sasl-2.1.26/lib' /bin/sh ../libtool --tag=CC --mode=compile i686-pld-linux-gcc -DHAVE_CONFIG_H -I. -I.. -DLIBSASL_EXPORTS=1 -I../include -I../plugins -I../include -I../sasldb -DOBSOLETE_CRAM_ATTR=1 -DKRB5_HEIMDAL -I/usr/include/mysql -I/usr/include -I/usr/include -I/usr/include -Wall -W -O2 -fwrapv -pipe -Wformat -Werror=format-security -gdwarf-4 -fno-debug-types-section -fvar-tracking-assignments -g2 -Wp,-D_FORTIFY_SOURCE=2 -fno-strict-aliasing -fstack-protector-strong --param=ssp-buffer-size=4 -fomit-frame-pointer -march=i686 -fasynchronous-unwind-tables -mtune=pentium4 -gdwarf-4 -fno-debug-types-section -fvar-tracking-assignments -g2 -MT seterror.lo -MD -MP -MF .deps/seterror.Tpo -c -o seterror.lo seterror.c libtool: compile: i686-pld-linux-gcc -DHAVE_CONFIG_H -I. -I.. -DLIBSASL_EXPORTS=1 -I../include -I../plugins -I../include -I../sasldb -DOBSOLETE_CRAM_ATTR=1 -DKRB5_HEIMDAL -I/usr/include/mysql -I/usr/include -I/usr/include -I/usr/include -Wall -W -O2 -fwrapv -pipe -Wformat -Werror=format-security -gdwarf-4 -fno-debug-types-section -fvar-tracking-assignments -g2 -Wp,-D_FORTIFY_SOURCE=2 -fno-strict-aliasing -fstack-protector-strong --param=ssp-buffer-size=4 -fomit-frame-pointer -march=i686 -fasynchronous-unwind-tables -mtune=pentium4 -gdwarf-4 -fno-debug-types-section -fvar-tracking-assignments -g2 -MT seterror.lo -MD -MP -MF .deps/seterror.Tpo -c seterror.c -fPIC -DPIC -o .libs/seterror.o libtool: compile: i686-pld-linux-gcc -DHAVE_CONFIG_H -I. -I.. -DLIBSASL_EXPORTS=1 -I../include -I../plugins -I../include -I../sasldb -DOBSOLETE_CRAM_ATTR=1 -DKRB5_HEIMDAL -I/usr/include/mysql -I/usr/include -I/usr/include -I/usr/include -Wall -W -O2 -fwrapv -pipe -Wformat -Werror=format-security -gdwarf-4 -fno-debug-types-section -fvar-tracking-assignments -g2 -Wp,-D_FORTIFY_SOURCE=2 -fno-strict-aliasing -fstack-protector-strong --param=ssp-buffer-size=4 -fomit-frame-pointer -march=i686 -fasynchronous-unwind-tables -mtune=pentium4 -gdwarf-4 -fno-debug-types-section -fvar-tracking-assignments -g2 -MT seterror.lo -MD -MP -MF .deps/seterror.Tpo -c seterror.c -o seterror.o >/dev/null 2>&1 mv -f .deps/seterror.Tpo .deps/seterror.Plo make[3]: Leaving directory '/tmp/B.RcC6qk/BUILD/cyrus-sasl-2.1.26/lib' make[3]: Entering directory '/tmp/B.RcC6qk/BUILD/cyrus-sasl-2.1.26/lib' /bin/sh ../libtool --tag=CC --mode=compile i686-pld-linux-gcc -DHAVE_CONFIG_H -I. -I.. -DLIBSASL_EXPORTS=1 -I../include -I../plugins -I../include -I../sasldb -DOBSOLETE_CRAM_ATTR=1 -DKRB5_HEIMDAL -I/usr/include/mysql -I/usr/include -I/usr/include -I/usr/include -Wall -W -O2 -fwrapv -pipe -Wformat -Werror=format-security -gdwarf-4 -fno-debug-types-section -fvar-tracking-assignments -g2 -Wp,-D_FORTIFY_SOURCE=2 -fno-strict-aliasing -fstack-protector-strong --param=ssp-buffer-size=4 -fomit-frame-pointer -march=i686 -fasynchronous-unwind-tables -mtune=pentium4 -gdwarf-4 -fno-debug-types-section -fvar-tracking-assignments -g2 -MT dlopen.lo -MD -MP -MF .deps/dlopen.Tpo -c -o dlopen.lo dlopen.c libtool: compile: i686-pld-linux-gcc -DHAVE_CONFIG_H -I. -I.. -DLIBSASL_EXPORTS=1 -I../include -I../plugins -I../include -I../sasldb -DOBSOLETE_CRAM_ATTR=1 -DKRB5_HEIMDAL -I/usr/include/mysql -I/usr/include -I/usr/include -I/usr/include -Wall -W -O2 -fwrapv -pipe -Wformat -Werror=format-security -gdwarf-4 -fno-debug-types-section -fvar-tracking-assignments -g2 -Wp,-D_FORTIFY_SOURCE=2 -fno-strict-aliasing -fstack-protector-strong --param=ssp-buffer-size=4 -fomit-frame-pointer -march=i686 -fasynchronous-unwind-tables -mtune=pentium4 -gdwarf-4 -fno-debug-types-section -fvar-tracking-assignments -g2 -MT dlopen.lo -MD -MP -MF .deps/dlopen.Tpo -c dlopen.c -fPIC -DPIC -o .libs/dlopen.o dlopen.c: In function '_sasl_get_plugin': dlopen.c:263:10: warning: cast between incompatible function types from 'int (* const)(void)' to 'int (*)(void *, const char *, sasl_verify_type_t)' {aka 'int (*)(void *, const char *, enum <anonymous>)'} [-Wcast-function-type] r = ((sasl_verifyfile_t *)(verifyfile_cb->proc)) ^ dlopen.c: In function '_sasl_load_plugins': dlopen.c:363:15: warning: cast between incompatible function types from 'int (* const)(void)' to 'int (*)(void *, const char **)' [-Wcast-function-type] result = ((sasl_getpath_t *)(getpath_cb->proc))(getpath_cb->context, ^ libtool: compile: i686-pld-linux-gcc -DHAVE_CONFIG_H -I. -I.. -DLIBSASL_EXPORTS=1 -I../include -I../plugins -I../include -I../sasldb -DOBSOLETE_CRAM_ATTR=1 -DKRB5_HEIMDAL -I/usr/include/mysql -I/usr/include -I/usr/include -I/usr/include -Wall -W -O2 -fwrapv -pipe -Wformat -Werror=format-security -gdwarf-4 -fno-debug-types-section -fvar-tracking-assignments -g2 -Wp,-D_FORTIFY_SOURCE=2 -fno-strict-aliasing -fstack-protector-strong --param=ssp-buffer-size=4 -fomit-frame-pointer -march=i686 -fasynchronous-unwind-tables -mtune=pentium4 -gdwarf-4 -fno-debug-types-section -fvar-tracking-assignments -g2 -MT dlopen.lo -MD -MP -MF .deps/dlopen.Tpo -c dlopen.c -o dlopen.o >/dev/null 2>&1 mv -f .deps/dlopen.Tpo .deps/dlopen.Plo make[3]: Leaving directory '/tmp/B.RcC6qk/BUILD/cyrus-sasl-2.1.26/lib' make[3]: Entering directory '/tmp/B.RcC6qk/BUILD/cyrus-sasl-2.1.26/lib' /bin/sh ../libtool --tag=CC --mode=compile i686-pld-linux-gcc -DHAVE_CONFIG_H -I. -I.. -DLIBSASL_EXPORTS=1 -I../include -I../plugins -I../include -I../sasldb -DOBSOLETE_CRAM_ATTR=1 -DKRB5_HEIMDAL -I/usr/include/mysql -I/usr/include -I/usr/include -I/usr/include -Wall -W -O2 -fwrapv -pipe -Wformat -Werror=format-security -gdwarf-4 -fno-debug-types-section -fvar-tracking-assignments -g2 -Wp,-D_FORTIFY_SOURCE=2 -fno-strict-aliasing -fstack-protector-strong --param=ssp-buffer-size=4 -fomit-frame-pointer -march=i686 -fasynchronous-unwind-tables -mtune=pentium4 -gdwarf-4 -fno-debug-types-section -fvar-tracking-assignments -g2 -MT auxprop.lo -MD -MP -MF .deps/auxprop.Tpo -c -o auxprop.lo auxprop.c libtool: compile: i686-pld-linux-gcc -DHAVE_CONFIG_H -I. -I.. -DLIBSASL_EXPORTS=1 -I../include -I../plugins -I../include -I../sasldb -DOBSOLETE_CRAM_ATTR=1 -DKRB5_HEIMDAL -I/usr/include/mysql -I/usr/include -I/usr/include -I/usr/include -Wall -W -O2 -fwrapv -pipe -Wformat -Werror=format-security -gdwarf-4 -fno-debug-types-section -fvar-tracking-assignments -g2 -Wp,-D_FORTIFY_SOURCE=2 -fno-strict-aliasing -fstack-protector-strong --param=ssp-buffer-size=4 -fomit-frame-pointer -march=i686 -fasynchronous-unwind-tables -mtune=pentium4 -gdwarf-4 -fno-debug-types-section -fvar-tracking-assignments -g2 -MT auxprop.lo -MD -MP -MF .deps/auxprop.Tpo -c auxprop.c -fPIC -DPIC -o .libs/auxprop.o libtool: compile: i686-pld-linux-gcc -DHAVE_CONFIG_H -I. -I.. -DLIBSASL_EXPORTS=1 -I../include -I../plugins -I../include -I../sasldb -DOBSOLETE_CRAM_ATTR=1 -DKRB5_HEIMDAL -I/usr/include/mysql -I/usr/include -I/usr/include -I/usr/include -Wall -W -O2 -fwrapv -pipe -Wformat -Werror=format-security -gdwarf-4 -fno-debug-types-section -fvar-tracking-assignments -g2 -Wp,-D_FORTIFY_SOURCE=2 -fno-strict-aliasing -fstack-protector-strong --param=ssp-buffer-size=4 -fomit-frame-pointer -march=i686 -fasynchronous-unwind-tables -mtune=pentium4 -gdwarf-4 -fno-debug-types-section -fvar-tracking-assignments -g2 -MT auxprop.lo -MD -MP -MF .deps/auxprop.Tpo -c auxprop.c -o auxprop.o >/dev/null 2>&1 mv -f .deps/auxprop.Tpo .deps/auxprop.Plo make[3]: Leaving directory '/tmp/B.RcC6qk/BUILD/cyrus-sasl-2.1.26/lib' make[3]: Entering directory '/tmp/B.RcC6qk/BUILD/cyrus-sasl-2.1.26/lib' /bin/sh ../libtool --tag=CC --mode=compile i686-pld-linux-gcc -DHAVE_CONFIG_H -I. -I.. -DLIBSASL_EXPORTS=1 -I../include -I../plugins -I../include -I../sasldb -DOBSOLETE_CRAM_ATTR=1 -DKRB5_HEIMDAL -I/usr/include/mysql -I/usr/include -I/usr/include -I/usr/include -Wall -W -O2 -fwrapv -pipe -Wformat -Werror=format-security -gdwarf-4 -fno-debug-types-section -fvar-tracking-assignments -g2 -Wp,-D_FORTIFY_SOURCE=2 -fno-strict-aliasing -fstack-protector-strong --param=ssp-buffer-size=4 -fomit-frame-pointer -march=i686 -fasynchronous-unwind-tables -mtune=pentium4 -gdwarf-4 -fno-debug-types-section -fvar-tracking-assignments -g2 -MT client.lo -MD -MP -MF .deps/client.Tpo -c -o client.lo client.c libtool: compile: i686-pld-linux-gcc -DHAVE_CONFIG_H -I. -I.. -DLIBSASL_EXPORTS=1 -I../include -I../plugins -I../include -I../sasldb -DOBSOLETE_CRAM_ATTR=1 -DKRB5_HEIMDAL -I/usr/include/mysql -I/usr/include -I/usr/include -I/usr/include -Wall -W -O2 -fwrapv -pipe -Wformat -Werror=format-security -gdwarf-4 -fno-debug-types-section -fvar-tracking-assignments -g2 -Wp,-D_FORTIFY_SOURCE=2 -fno-strict-aliasing -fstack-protector-strong --param=ssp-buffer-size=4 -fomit-frame-pointer -march=i686 -fasynchronous-unwind-tables -mtune=pentium4 -gdwarf-4 -fno-debug-types-section -fvar-tracking-assignments -g2 -MT client.lo -MD -MP -MF .deps/client.Tpo -c client.c -fPIC -DPIC -o .libs/client.o libtool: compile: i686-pld-linux-gcc -DHAVE_CONFIG_H -I. -I.. -DLIBSASL_EXPORTS=1 -I../include -I../plugins -I../include -I../sasldb -DOBSOLETE_CRAM_ATTR=1 -DKRB5_HEIMDAL -I/usr/include/mysql -I/usr/include -I/usr/include -I/usr/include -Wall -W -O2 -fwrapv -pipe -Wformat -Werror=format-security -gdwarf-4 -fno-debug-types-section -fvar-tracking-assignments -g2 -Wp,-D_FORTIFY_SOURCE=2 -fno-strict-aliasing -fstack-protector-strong --param=ssp-buffer-size=4 -fomit-frame-pointer -march=i686 -fasynchronous-unwind-tables -mtune=pentium4 -gdwarf-4 -fno-debug-types-section -fvar-tracking-assignments -g2 -MT client.lo -MD -MP -MF .deps/client.Tpo -c client.c -o client.o >/dev/null 2>&1 mv -f .deps/client.Tpo .deps/client.Plo make[3]: Leaving directory '/tmp/B.RcC6qk/BUILD/cyrus-sasl-2.1.26/lib' make[3]: Entering directory '/tmp/B.RcC6qk/BUILD/cyrus-sasl-2.1.26/lib' /bin/sh ../libtool --tag=CC --mode=compile i686-pld-linux-gcc -DHAVE_CONFIG_H -I. -I.. -DLIBSASL_EXPORTS=1 -I../include -I../plugins -I../include -I../sasldb -DOBSOLETE_CRAM_ATTR=1 -DKRB5_HEIMDAL -I/usr/include/mysql -I/usr/include -I/usr/include -I/usr/include -Wall -W -O2 -fwrapv -pipe -Wformat -Werror=format-security -gdwarf-4 -fno-debug-types-section -fvar-tracking-assignments -g2 -Wp,-D_FORTIFY_SOURCE=2 -fno-strict-aliasing -fstack-protector-strong --param=ssp-buffer-size=4 -fomit-frame-pointer -march=i686 -fasynchronous-unwind-tables -mtune=pentium4 -gdwarf-4 -fno-debug-types-section -fvar-tracking-assignments -g2 -MT plugin_common.lo -MD -MP -MF .deps/plugin_common.Tpo -c -o plugin_common.lo `test -f '../plugins/plugin_common.c' || echo './'`../plugins/plugin_common.c libtool: compile: i686-pld-linux-gcc -DHAVE_CONFIG_H -I. -I.. -DLIBSASL_EXPORTS=1 -I../include -I../plugins -I../include -I../sasldb -DOBSOLETE_CRAM_ATTR=1 -DKRB5_HEIMDAL -I/usr/include/mysql -I/usr/include -I/usr/include -I/usr/include -Wall -W -O2 -fwrapv -pipe -Wformat -Werror=format-security -gdwarf-4 -fno-debug-types-section -fvar-tracking-assignments -g2 -Wp,-D_FORTIFY_SOURCE=2 -fno-strict-aliasing -fstack-protector-strong --param=ssp-buffer-size=4 -fomit-frame-pointer -march=i686 -fasynchronous-unwind-tables -mtune=pentium4 -gdwarf-4 -fno-debug-types-section -fvar-tracking-assignments -g2 -MT plugin_common.lo -MD -MP -MF .deps/plugin_common.Tpo -c ../plugins/plugin_common.c -fPIC -DPIC -o .libs/plugin_common.o libtool: compile: i686-pld-linux-gcc -DHAVE_CONFIG_H -I. -I.. -DLIBSASL_EXPORTS=1 -I../include -I../plugins -I../include -I../sasldb -DOBSOLETE_CRAM_ATTR=1 -DKRB5_HEIMDAL -I/usr/include/mysql -I/usr/include -I/usr/include -I/usr/include -Wall -W -O2 -fwrapv -pipe -Wformat -Werror=format-security -gdwarf-4 -fno-debug-types-section -fvar-tracking-assignments -g2 -Wp,-D_FORTIFY_SOURCE=2 -fno-strict-aliasing -fstack-protector-strong --param=ssp-buffer-size=4 -fomit-frame-pointer -march=i686 -fasynchronous-unwind-tables -mtune=pentium4 -gdwarf-4 -fno-debug-types-section -fvar-tracking-assignments -g2 -MT plugin_common.lo -MD -MP -MF .deps/plugin_common.Tpo -c ../plugins/plugin_common.c -o plugin_common.o >/dev/null 2>&1 mv -f .deps/plugin_common.Tpo .deps/plugin_common.Plo make[3]: Leaving directory '/tmp/B.RcC6qk/BUILD/cyrus-sasl-2.1.26/lib' make[3]: Entering directory '/tmp/B.RcC6qk/BUILD/cyrus-sasl-2.1.26/lib' /bin/sh ../libtool --tag=CC --mode=compile i686-pld-linux-gcc -DHAVE_CONFIG_H -I. -I.. -DLIBSASL_EXPORTS=1 -I../include -I../plugins -I../include -I../sasldb -DOBSOLETE_CRAM_ATTR=1 -DKRB5_HEIMDAL -I/usr/include/mysql -I/usr/include -I/usr/include -I/usr/include -Wall -W -O2 -fwrapv -pipe -Wformat -Werror=format-security -gdwarf-4 -fno-debug-types-section -fvar-tracking-assignments -g2 -Wp,-D_FORTIFY_SOURCE=2 -fno-strict-aliasing -fstack-protector-strong --param=ssp-buffer-size=4 -fomit-frame-pointer -march=i686 -fasynchronous-unwind-tables -mtune=pentium4 -gdwarf-4 -fno-debug-types-section -fvar-tracking-assignments -g2 -MT common.lo -MD -MP -MF .deps/common.Tpo -c -o common.lo common.c libtool: compile: i686-pld-linux-gcc -DHAVE_CONFIG_H -I. -I.. -DLIBSASL_EXPORTS=1 -I../include -I../plugins -I../include -I../sasldb -DOBSOLETE_CRAM_ATTR=1 -DKRB5_HEIMDAL -I/usr/include/mysql -I/usr/include -I/usr/include -I/usr/include -Wall -W -O2 -fwrapv -pipe -Wformat -Werror=format-security -gdwarf-4 -fno-debug-types-section -fvar-tracking-assignments -g2 -Wp,-D_FORTIFY_SOURCE=2 -fno-strict-aliasing -fstack-protector-strong --param=ssp-buffer-size=4 -fomit-frame-pointer -march=i686 -fasynchronous-unwind-tables -mtune=pentium4 -gdwarf-4 -fno-debug-types-section -fvar-tracking-assignments -g2 -MT common.lo -MD -MP -MF .deps/common.Tpo -c common.c -fPIC -DPIC -o .libs/common.o common.c:116:22: warning: cast between incompatible function types from 'int (*)(void *, const char **)' to 'int (*)(void)' [-Wcast-function-type] SASL_CB_GETPATH, (sasl_callback_ft)&_sasl_getpath, NULL ^ common.c:119:26: warning: cast between incompatible function types from 'int (*)(void *, char **)' to 'int (*)(void)' [-Wcast-function-type] SASL_CB_GETCONFPATH, (sasl_callback_ft)&_sasl_getconfpath, NULL ^ common.c: In function 'sasl_set_path': common.c:232:39: warning: cast between incompatible function types from 'int (*)(void *, const char **)' to 'int (*)(void)' [-Wcast-function-type] default_getpath_cb.proc = (sasl_callback_ft)&_sasl_getpath_simple; ^ common.c:246:43: warning: cast between incompatible function types from 'int (*)(void *, const char **)' to 'int (*)(void)' [-Wcast-function-type] default_getconfpath_cb.proc = (sasl_callback_ft)&_sasl_getconfpath_simple; ^ common.c: In function 'sasl_getprop': common.c:1048:21: warning: assignment discards 'const' qualifier from pointer target type [-Wdiscarded-qualifiers] *(void **)pvalue = ^ common.c:1051:21: warning: assignment discards 'const' qualifier from pointer target type [-Wdiscarded-qualifiers] *(void **)pvalue = ^ common.c: In function '_sasl_global_getopt': common.c:1414:9: warning: cast between incompatible function types from 'int (* const)(void)' to 'int (*)(void *, const char *, const char *, const char **, unsigned int *)' [-Wcast-function-type] if (((sasl_getopt_t *)(callback->proc))(callback->context, ^ common.c: In function '_sasl_conn_getopt': common.c:1455:9: warning: cast between incompatible function types from 'int (* const)(void)' to 'int (*)(void *, const char *, const char *, const char **, unsigned int *)' [-Wcast-function-type] && (((sasl_getopt_t *)(callback->proc))(callback->context, ^ common.c: In function '_sasl_getsimple': common.c:1528:16: warning: variable 'conn' set but not used [-Wunused-but-set-variable] sasl_conn_t *conn; ^~~~ common.c: In function '_sasl_getcallback': common.c:1732:13: warning: cast between incompatible function types from 'int (*)(void *, const char *, const char *, const char **, unsigned int *)' to 'int (*)(void)' [-Wcast-function-type] *pproc = (sasl_callback_ft)&_sasl_conn_getopt; ^ common.c:1735:13: warning: cast between incompatible function types from 'int (*)(void *, const char *, const char *, const char **, unsigned int *)' to 'int (*)(void)' [-Wcast-function-type] *pproc = (sasl_callback_ft)&_sasl_global_getopt; ^ common.c:1780:14: warning: cast between incompatible function types from 'int (*)(void *, int, const char *)' to 'int (*)(void)' [-Wcast-function-type] *pproc = (sasl_callback_ft)&_sasl_syslog; ^ common.c:1793:14: warning: cast between incompatible function types from 'int (*)(void *, int, const char **, size_t *)' {aka 'int (*)(void *, int, const char **, unsigned int *)'} to 'int (*)(void)' [-Wcast-function-type] *pproc = (sasl_callback_ft)&_sasl_getsimple; ^ common.c:1797:14: warning: cast between incompatible function types from 'int (*)(void *, char *, int)' to 'int (*)(void)' [-Wcast-function-type] *pproc = (sasl_callback_ft)&_sasl_verifyfile; ^ common.c:1801:14: warning: cast between incompatible function types from 'int (*)(sasl_conn_t *, void *, const char *, unsigned int, const char *, unsigned int, const char *, unsigned int, struct propctx *)' {aka 'int (*)(struct sasl_conn *, void *, const char *, unsigned int, const char *, unsigned int, const char *, unsigned int, struct propctx *)'} to 'int (*)(void)' [-Wcast-function-type] *pproc = (sasl_callback_ft)&_sasl_proxy_policy; ^ common.c: In function '_sasl_find_verifyfile_callback': common.c:2157:5: warning: cast between incompatible function types from 'int (*)(void *, char *, int)' to 'int (*)(void)' [-Wcast-function-type] (sasl_callback_ft)&_sasl_verifyfile, ^ At top level: common.c:89:19: warning: 'build_ident' defined but not used [-Wunused-const-variable=] static const char build_ident[] = "$Build: libsasl " PACKAGE "-" VERSION " $"; ^~~~~~~~~~~ libtool: compile: i686-pld-linux-gcc -DHAVE_CONFIG_H -I. -I.. -DLIBSASL_EXPORTS=1 -I../include -I../plugins -I../include -I../sasldb -DOBSOLETE_CRAM_ATTR=1 -DKRB5_HEIMDAL -I/usr/include/mysql -I/usr/include -I/usr/include -I/usr/include -Wall -W -O2 -fwrapv -pipe -Wformat -Werror=format-security -gdwarf-4 -fno-debug-types-section -fvar-tracking-assignments -g2 -Wp,-D_FORTIFY_SOURCE=2 -fno-strict-aliasing -fstack-protector-strong --param=ssp-buffer-size=4 -fomit-frame-pointer -march=i686 -fasynchronous-unwind-tables -mtune=pentium4 -gdwarf-4 -fno-debug-types-section -fvar-tracking-assignments -g2 -MT common.lo -MD -MP -MF .deps/common.Tpo -c common.c -o common.o >/dev/null 2>&1 mv -f .deps/common.Tpo .deps/common.Plo make[3]: Leaving directory '/tmp/B.RcC6qk/BUILD/cyrus-sasl-2.1.26/lib' make[3]: Entering directory '/tmp/B.RcC6qk/BUILD/cyrus-sasl-2.1.26/lib' /bin/sh ../libtool --tag=CC --mode=compile i686-pld-linux-gcc -DHAVE_CONFIG_H -I. -I.. -DLIBSASL_EXPORTS=1 -I../include -I../plugins -I../include -I../sasldb -DOBSOLETE_CRAM_ATTR=1 -DKRB5_HEIMDAL -I/usr/include/mysql -I/usr/include -I/usr/include -I/usr/include -Wall -W -O2 -fwrapv -pipe -Wformat -Werror=format-security -gdwarf-4 -fno-debug-types-section -fvar-tracking-assignments -g2 -Wp,-D_FORTIFY_SOURCE=2 -fno-strict-aliasing -fstack-protector-strong --param=ssp-buffer-size=4 -fomit-frame-pointer -march=i686 -fasynchronous-unwind-tables -mtune=pentium4 -gdwarf-4 -fno-debug-types-section -fvar-tracking-assignments -g2 -MT server.lo -MD -MP -MF .deps/server.Tpo -c -o server.lo server.c libtool: compile: i686-pld-linux-gcc -DHAVE_CONFIG_H -I. -I.. -DLIBSASL_EXPORTS=1 -I../include -I../plugins -I../include -I../sasldb -DOBSOLETE_CRAM_ATTR=1 -DKRB5_HEIMDAL -I/usr/include/mysql -I/usr/include -I/usr/include -I/usr/include -Wall -W -O2 -fwrapv -pipe -Wformat -Werror=format-security -gdwarf-4 -fno-debug-types-section -fvar-tracking-assignments -g2 -Wp,-D_FORTIFY_SOURCE=2 -fno-strict-aliasing -fstack-protector-strong --param=ssp-buffer-size=4 -fomit-frame-pointer -march=i686 -fasynchronous-unwind-tables -mtune=pentium4 -gdwarf-4 -fno-debug-types-section -fvar-tracking-assignments -g2 -MT server.lo -MD -MP -MF .deps/server.Tpo -c server.c -fPIC -DPIC -o .libs/server.o server.c: In function 'load_config': server.c:619:15: warning: cast between incompatible function types from 'int (* const)(void)' to 'int (*)(void *, char **)' [-Wcast-function-type] result = ((sasl_getconfpath_t *)(getconfpath_cb->proc))(getconfpath_cb->context, ^ server.c:657:19: warning: cast between incompatible function types from 'int (* const)(void)' to 'int (*)(void *, const char *, sasl_verify_type_t)' {aka 'int (*)(void *, const char *, enum <anonymous>)'} [-Wcast-function-type] result = ((sasl_verifyfile_t *)(verifyfile_cb->proc))(verifyfile_cb->context, ^ server.c: In function 'sasl_server_init': server.c:909:9: warning: cast between incompatible function types from 'int (* const)(void)' to 'int (*)(void *, const char *, sasl_verify_type_t)' {aka 'int (*)(void *, const char *, enum <anonymous>)'} [-Wcast-function-type] ret = ((sasl_verifyfile_t *)(vf->proc))(vf->context, ^ libtool: compile: i686-pld-linux-gcc -DHAVE_CONFIG_H -I. -I.. -DLIBSASL_EXPORTS=1 -I../include -I../plugins -I../include -I../sasldb -DOBSOLETE_CRAM_ATTR=1 -DKRB5_HEIMDAL -I/usr/include/mysql -I/usr/include -I/usr/include -I/usr/include -Wall -W -O2 -fwrapv -pipe -Wformat -Werror=format-security -gdwarf-4 -fno-debug-types-section -fvar-tracking-assignments -g2 -Wp,-D_FORTIFY_SOURCE=2 -fno-strict-aliasing -fstack-protector-strong --param=ssp-buffer-size=4 -fomit-frame-pointer -march=i686 -fasynchronous-unwind-tables -mtune=pentium4 -gdwarf-4 -fno-debug-types-section -fvar-tracking-assignments -g2 -MT server.lo -MD -MP -MF .deps/server.Tpo -c server.c -o server.o >/dev/null 2>&1 mv -f .deps/server.Tpo .deps/server.Plo make[3]: Leaving directory '/tmp/B.RcC6qk/BUILD/cyrus-sasl-2.1.26/lib' make[3]: Entering directory '/tmp/B.RcC6qk/BUILD/cyrus-sasl-2.1.26/lib' /bin/sh ../libtool --tag=CC --mode=link i686-pld-linux-gcc -Wall -W -O2 -fwrapv -pipe -Wformat -Werror=format-security -gdwarf-4 -fno-debug-types-section -fvar-tracking-assignments -g2 -Wp,-D_FORTIFY_SOURCE=2 -fno-strict-aliasing -fstack-protector-strong --param=ssp-buffer-size=4 -fomit-frame-pointer -march=i686 -fasynchronous-unwind-tables -mtune=pentium4 -gdwarf-4 -fno-debug-types-section -fvar-tracking-assignments -g2 -version-info 3:0:0 -lcrypt -o libsasl2.la -rpath /usr/lib auxprop.lo canonusr.lo checkpw.lo client.lo common.lo config.lo external.lo md5.lo saslutil.lo server.lo seterror.lo dlopen.lo plugin_common.lo -ldl -lresolv -lpam libtool: link: i686-pld-linux-gcc -shared -fPIC -DPIC -O2 -gdwarf-4 -g2 -fstack-protector-strong -march=i686 -mtune=pentium4 -gdwarf-4 -g2 .libs/auxprop.o .libs/canonusr.o .libs/checkpw.o .libs/client.o .libs/common.o .libs/config.o .libs/external.o .libs/md5.o .libs/saslutil.o .libs/server.o .libs/seterror.o .libs/dlopen.o .libs/plugin_common.o -lcrypt -lresolv /usr/lib/libpam.so -L/usr/lib /usr/lib/libaudit.so /usr/lib/libcap-ng.so -ldl -Wl,-soname -Wl,libsasl2.so.3 -o .libs/libsasl2.so.3.0.0 libtool: link: (cd ".libs" && rm -f "libsasl2.so.3" && ln -s "libsasl2.so.3.0.0" "libsasl2.so.3") libtool: link: (cd ".libs" && rm -f "libsasl2.so" && ln -s "libsasl2.so.3.0.0" "libsasl2.so") libtool: link: ar cru .libs/libsasl2.a auxprop.o canonusr.o checkpw.o client.o common.o config.o external.o md5.o saslutil.o server.o seterror.o dlopen.o plugin_common.o libtool: link: ranlib .libs/libsasl2.a libtool: link: ( cd ".libs" && rm -f "libsasl2.la" && ln -s "../libsasl2.la" "libsasl2.la" ) make[3]: Leaving directory '/tmp/B.RcC6qk/BUILD/cyrus-sasl-2.1.26/lib' Making all in plugins make[2]: Entering directory '/tmp/B.RcC6qk/BUILD/cyrus-sasl-2.1.26/plugins' /bin/sh ./makeinit.sh sasldb_init.c make[2]: Leaving directory '/tmp/B.RcC6qk/BUILD/cyrus-sasl-2.1.26/plugins' make[2]: Entering directory '/tmp/B.RcC6qk/BUILD/cyrus-sasl-2.1.26/plugins' /bin/sh ./makeinit.sh crammd5_init.c make[2]: Leaving directory '/tmp/B.RcC6qk/BUILD/cyrus-sasl-2.1.26/plugins' make[2]: Entering directory '/tmp/B.RcC6qk/BUILD/cyrus-sasl-2.1.26/plugins' /bin/sh ./makeinit.sh digestmd5_init.c make[2]: Leaving directory '/tmp/B.RcC6qk/BUILD/cyrus-sasl-2.1.26/plugins' make[2]: Entering directory '/tmp/B.RcC6qk/BUILD/cyrus-sasl-2.1.26/plugins' /bin/sh ./makeinit.sh scram_init.c make[2]: Leaving directory '/tmp/B.RcC6qk/BUILD/cyrus-sasl-2.1.26/plugins' make[2]: Entering directory '/tmp/B.RcC6qk/BUILD/cyrus-sasl-2.1.26/plugins' /bin/sh ./makeinit.sh gssapiv2_init.c make[2]: Leaving directory '/tmp/B.RcC6qk/BUILD/cyrus-sasl-2.1.26/plugins' make[2]: Entering directory '/tmp/B.RcC6qk/BUILD/cyrus-sasl-2.1.26/plugins' /bin/sh ./makeinit.sh otp_init.c make[2]: Leaving directory '/tmp/B.RcC6qk/BUILD/cyrus-sasl-2.1.26/plugins' make[2]: Entering directory '/tmp/B.RcC6qk/BUILD/cyrus-sasl-2.1.26/plugins' /bin/sh ./makeinit.sh gs2_init.c make[2]: Leaving directory '/tmp/B.RcC6qk/BUILD/cyrus-sasl-2.1.26/plugins' make[2]: Entering directory '/tmp/B.RcC6qk/BUILD/cyrus-sasl-2.1.26/plugins' /bin/sh ../libtool --tag=CC --mode=compile i686-pld-linux-gcc -DHAVE_CONFIG_H -I. -I.. -I../include -I../lib -I../sasldb -I../include -DOBSOLETE_CRAM_ATTR=1 -DKRB5_HEIMDAL -I/usr/include/mysql -I/usr/include -I/usr/include -I/usr/include -Wall -W -O2 -fwrapv -pipe -Wformat -Werror=format-security -gdwarf-4 -fno-debug-types-section -fvar-tracking-assignments -g2 -Wp,-D_FORTIFY_SOURCE=2 -fno-strict-aliasing -fstack-protector-strong --param=ssp-buffer-size=4 -fomit-frame-pointer -march=i686 -fasynchronous-unwind-tables -mtune=pentium4 -gdwarf-4 -fno-debug-types-section -fvar-tracking-assignments -g2 -MT gs2_token.lo -MD -MP -MF .deps/gs2_token.Tpo -c -o gs2_token.lo gs2_token.c libtool: compile: i686-pld-linux-gcc -DHAVE_CONFIG_H -I. -I.. -I../include -I../lib -I../sasldb -I../include -DOBSOLETE_CRAM_ATTR=1 -DKRB5_HEIMDAL -I/usr/include/mysql -I/usr/include -I/usr/include -I/usr/include -Wall -W -O2 -fwrapv -pipe -Wformat -Werror=format-security -gdwarf-4 -fno-debug-types-section -fvar-tracking-assignments -g2 -Wp,-D_FORTIFY_SOURCE=2 -fno-strict-aliasing -fstack-protector-strong --param=ssp-buffer-size=4 -fomit-frame-pointer -march=i686 -fasynchronous-unwind-tables -mtune=pentium4 -gdwarf-4 -fno-debug-types-section -fvar-tracking-assignments -g2 -MT gs2_token.lo -MD -MP -MF .deps/gs2_token.Tpo -c gs2_token.c -fPIC -DPIC -o .libs/gs2_token.o libtool: compile: i686-pld-linux-gcc -DHAVE_CONFIG_H -I. -I.. -I../include -I../lib -I../sasldb -I../include -DOBSOLETE_CRAM_ATTR=1 -DKRB5_HEIMDAL -I/usr/include/mysql -I/usr/include -I/usr/include -I/usr/include -Wall -W -O2 -fwrapv -pipe -Wformat -Werror=format-security -gdwarf-4 -fno-debug-types-section -fvar-tracking-assignments -g2 -Wp,-D_FORTIFY_SOURCE=2 -fno-strict-aliasing -fstack-protector-strong --param=ssp-buffer-size=4 -fomit-frame-pointer -march=i686 -fasynchronous-unwind-tables -mtune=pentium4 -gdwarf-4 -fno-debug-types-section -fvar-tracking-assignments -g2 -MT gs2_token.lo -MD -MP -MF .deps/gs2_token.Tpo -c gs2_token.c -o gs2_token.o >/dev/null 2>&1 mv -f .deps/gs2_token.Tpo .deps/gs2_token.Plo make[2]: Leaving directory '/tmp/B.RcC6qk/BUILD/cyrus-sasl-2.1.26/plugins' make[2]: Entering directory '/tmp/B.RcC6qk/BUILD/cyrus-sasl-2.1.26/plugins' /bin/sh ../libtool --tag=CC --mode=compile i686-pld-linux-gcc -DHAVE_CONFIG_H -I. -I.. -I../include -I../lib -I../sasldb -I../include -DOBSOLETE_CRAM_ATTR=1 -DKRB5_HEIMDAL -I/usr/include/mysql -I/usr/include -I/usr/include -I/usr/include -Wall -W -O2 -fwrapv -pipe -Wformat -Werror=format-security -gdwarf-4 -fno-debug-types-section -fvar-tracking-assignments -g2 -Wp,-D_FORTIFY_SOURCE=2 -fno-strict-aliasing -fstack-protector-strong --param=ssp-buffer-size=4 -fomit-frame-pointer -march=i686 -fasynchronous-unwind-tables -mtune=pentium4 -gdwarf-4 -fno-debug-types-section -fvar-tracking-assignments -g2 -MT otp.lo -MD -MP -MF .deps/otp.Tpo -c -o otp.lo otp.c libtool: compile: i686-pld-linux-gcc -DHAVE_CONFIG_H -I. -I.. -I../include -I../lib -I../sasldb -I../include -DOBSOLETE_CRAM_ATTR=1 -DKRB5_HEIMDAL -I/usr/include/mysql -I/usr/include -I/usr/include -I/usr/include -Wall -W -O2 -fwrapv -pipe -Wformat -Werror=format-security -gdwarf-4 -fno-debug-types-section -fvar-tracking-assignments -g2 -Wp,-D_FORTIFY_SOURCE=2 -fno-strict-aliasing -fstack-protector-strong --param=ssp-buffer-size=4 -fomit-frame-pointer -march=i686 -fasynchronous-unwind-tables -mtune=pentium4 -gdwarf-4 -fno-debug-types-section -fvar-tracking-assignments -g2 -MT otp.lo -MD -MP -MF .deps/otp.Tpo -c otp.c -fPIC -DPIC -o .libs/otp.o otp.c: In function 'otp_hash': otp.c:121:16: error: storage size of 'mdctx' isn't known EVP_MD_CTX mdctx; ^~~~~ otp.c:129:29: warning: pointer targets in passing argument 2 of 'EVP_DigestFinal' differ in signedness [-Wpointer-sign] EVP_DigestFinal(&mdctx, hash, &hashlen); ^~~~ In file included from otp.c:56: /usr/include/openssl/evp.h:556:12: note: expected 'unsigned char *' but argument is of type 'char *' __owur int EVP_DigestFinal(EVP_MD_CTX *ctx, unsigned char *md, ^~~~~~~~~~~~~~~ otp.c:121:16: warning: unused variable 'mdctx' [-Wunused-variable] EVP_MD_CTX mdctx; ^~~~~ otp.c: In function 'generate_otp': otp.c:168:36: warning: pointer targets in passing argument 4 of 'otp_hash' differ in signedness [-Wpointer-sign] otp_hash(md, key, strlen(key), otp, alg->swab); ^~~ otp.c:118:13: note: expected 'unsigned char *' but argument is of type 'char *' static void otp_hash(const EVP_MD *md, char *in, size_t inlen, ^~~~~~~~ otp.c:172:35: warning: pointer targets in passing argument 4 of 'otp_hash' differ in signedness [-Wpointer-sign] otp_hash(md, otp, OTP_HASH_SIZE, otp, alg->swab); ^~~ otp.c:118:13: note: expected 'unsigned char *' but argument is of type 'char *' static void otp_hash(const EVP_MD *md, char *in, size_t inlen, ^~~~~~~~ otp.c: In function 'make_secret': otp.c:615:13: warning: pointer targets in passing argument 1 of 'bin2hex' differ in signedness [-Wpointer-sign] bin2hex(otp, OTP_HASH_SIZE, buf); ^~~ otp.c:100:6: note: expected 'unsigned char *' but argument is of type 'char *' void bin2hex(unsigned char *bin, int binlen, char *hex) ^~~~~~~ otp.c:618:13: warning: pointer targets in passing argument 1 of 'sprintf' differ in signedness [-Wpointer-sign] sprintf(data, "%s\t%04d\t%s\t%s\t%020ld", ^~~~ In file included from /usr/include/features.h:428, from /usr/include/sys/types.h:25, from ../config.h:525, from otp.c:45: /usr/include/bits/stdio2.h:34:1: note: expected 'char * restrict' but argument is of type 'unsigned char *' __NTH (sprintf (char *__restrict __s, const char *__restrict __fmt, ...)) ^~~~~ otp.c: In function 'parse_secret': otp.c:645:4: warning: pointer targets in assignment from 'char *' to 'unsigned char *' differ in signedness [-Wpointer-sign] c = secret; ^ otp.c:650:17: warning: pointer targets in passing argument 1 of 'strtoul' differ in signedness [-Wpointer-sign] *seq = strtoul(c, NULL, 10); ^ In file included from ../config.h:564, from otp.c:45: /usr/include/stdlib.h:180:26: note: expected 'const char * restrict' but argument is of type 'unsigned char *' extern unsigned long int strtoul (const char *__restrict __nptr, ^~~~~~~ otp.c: In function 'word2bin': otp.c:755:17: error: storage size of 'mdctx' isn't known EVP_MD_CTX mdctx; ^~~~~ otp.c:761:30: warning: pointer targets in passing argument 2 of 'EVP_DigestFinal' differ in signedness [-Wpointer-sign] EVP_DigestFinal(&mdctx, hash, &hashlen); ^~~~ In file included from otp.c:56: /usr/include/openssl/evp.h:556:12: note: expected 'unsigned char *' but argument is of type 'char *' __owur int EVP_DigestFinal(EVP_MD_CTX *ctx, unsigned char *md, ^~~~~~~~~~~~~~~ otp.c:761:36: warning: pointer targets in passing argument 3 of 'EVP_DigestFinal' differ in signedness [-Wpointer-sign] EVP_DigestFinal(&mdctx, hash, &hashlen); ^~~~~~~~ In file included from otp.c:56: /usr/include/openssl/evp.h:556:12: note: expected 'unsigned int *' but argument is of type 'int *' __owur int EVP_DigestFinal(EVP_MD_CTX *ctx, unsigned char *md, ^~~~~~~~~~~~~~~ otp.c:755:17: warning: unused variable 'mdctx' [-Wunused-variable] EVP_MD_CTX mdctx; ^~~~~ otp.c: In function 'verify_response': otp.c:853:15: warning: pointer targets in passing argument 2 of 'otp_hash' differ in signedness [-Wpointer-sign] otp_hash(md, cur_otp, OTP_HASH_SIZE, prev_otp, text->alg->swab); ^~~~~~~ otp.c:118:13: note: expected 'char *' but argument is of type 'unsigned char *' static void otp_hash(const EVP_MD *md, char *in, size_t inlen, ^~~~~~~~ otp.c: In function 'otp_server_mech_step1': otp.c:1059:21: warning: pointer targets in passing argument 5 of 'make_secret' differ in signedness [-Wpointer-sign] text->seed, text->otp, ~~~~^~~~~ otp.c:590:12: note: expected 'char *' but argument is of type 'unsigned char *' static int make_secret(const sasl_utils_t *utils, ^~~~~~~~~~~ otp.c:1074:10: warning: pointer targets in passing argument 3 of 'params->utils->prop_set' differ in signedness [-Wpointer-sign] sec->data, sec->len); ~~~^~~~~~ otp.c:1074:10: note: expected 'const char *' but argument is of type 'unsigned char *' otp.c: In function 'otp_server_mech_step2': otp.c:1143:21: warning: pointer targets in passing argument 5 of 'make_secret' differ in signedness [-Wpointer-sign] text->seed, text->otp, 0, &sec); ~~~~^~~~~ otp.c:590:12: note: expected 'char *' but argument is of type 'unsigned char *' static int make_secret(const sasl_utils_t *utils, ^~~~~~~~~~~ otp.c:1156:10: warning: pointer targets in passing argument 3 of 'params->utils->prop_set' differ in signedness [-Wpointer-sign] sec->data, sec->len); ~~~^~~~~~ otp.c:1156:10: note: expected 'const char *' but argument is of type 'unsigned char *' otp.c: In function 'otp_server_mech_dispose': otp.c:1232:20: warning: pointer targets in passing argument 5 of 'make_secret' differ in signedness [-Wpointer-sign] text->seed, text->otp, 0, &sec); ~~~~^~~~~ otp.c:590:12: note: expected 'char *' but argument is of type 'unsigned char *' static int make_secret(const sasl_utils_t *utils, ^~~~~~~~~~~ otp.c:1247:22: warning: pointer targets in passing argument 3 of 'utils->prop_set' differ in signedness [-Wpointer-sign] (sec ? sec->data : NULL), ~~~~~~~~~~~~~~~~~^~~~~~~ otp.c:1247:22: note: expected 'const char *' but argument is of type 'unsigned char *' otp.c: In function 'otp_setpass': otp.c:1367:27: warning: pointer targets in passing argument 3 of 'sparams->utils->prop_set' differ in signedness [-Wpointer-sign] (sec ? sec->data : NULL), ~~~~~~~~~~~~~~~~~^~~~~~~ otp.c:1367:27: note: expected 'const char *' but argument is of type 'unsigned char *' otp.c: In function 'otp_client_mech_step2': otp.c:1697:24: warning: pointer targets in passing argument 5 of 'generate_otp' differ in signedness [-Wpointer-sign] text->password->data, otp); ~~~~~~~~~~~~~~^~~~~~ otp.c:147:12: note: expected 'char *' but argument is of type 'unsigned char *' static int generate_otp(const sasl_utils_t *utils, ^~~~~~~~~~~~ otp.c:1720:31: warning: pointer targets in passing argument 5 of 'generate_otp' differ in signedness [-Wpointer-sign] new_seed, text->password->data, new_otp); ~~~~~~~~~~~~~~^~~~~~ otp.c:147:12: note: expected 'char *' but argument is of type 'unsigned char *' static int generate_otp(const sasl_utils_t *utils, ^~~~~~~~~~~~ otp.c:1725:11: warning: pointer targets in passing argument 1 of 'bin2hex' differ in signedness [-Wpointer-sign] bin2hex(otp, OTP_HASH_SIZE, ^~~ otp.c:100:6: note: expected 'unsigned char *' but argument is of type 'char *' void bin2hex(unsigned char *bin, int binlen, char *hex) ^~~~~~~ otp.c:1729:11: warning: pointer targets in passing argument 1 of 'bin2hex' differ in signedness [-Wpointer-sign] bin2hex(new_otp, OTP_HASH_SIZE, ^~~~~~~ otp.c:100:6: note: expected 'unsigned char *' but argument is of type 'char *' void bin2hex(unsigned char *bin, int binlen, char *hex) ^~~~~~~ otp.c:1741:14: warning: pointer targets in passing argument 1 of 'bin2hex' differ in signedness [-Wpointer-sign] bin2hex(otp, OTP_HASH_SIZE, text->out_buf+strlen(text->out_buf)); ^~~ otp.c:100:6: note: expected 'unsigned char *' but argument is of type 'char *' void bin2hex(unsigned char *bin, int binlen, char *hex) ^~~~~~~ At top level: otp.c:71:19: warning: 'plugin_id' defined but not used [-Wunused-const-variable=] static const char plugin_id[] = "$Id: otp.c,v 1.43 2011/09/01 14:12:18 mel Exp $"; ^~~~~~~~~ make[2]: *** [Makefile:809: otp.lo] Error 1 make[2]: Leaving directory '/tmp/B.RcC6qk/BUILD/cyrus-sasl-2.1.26/plugins' make[2]: *** Waiting for unfinished jobs.... make[2]: Entering directory '/tmp/B.RcC6qk/BUILD/cyrus-sasl-2.1.26/plugins' /bin/sh ../libtool --tag=CC --mode=compile i686-pld-linux-gcc -DHAVE_CONFIG_H -I. -I.. -I../include -I../lib -I../sasldb -I../include -DOBSOLETE_CRAM_ATTR=1 -DKRB5_HEIMDAL -I/usr/include/mysql -I/usr/include -I/usr/include -I/usr/include -Wall -W -O2 -fwrapv -pipe -Wformat -Werror=format-security -gdwarf-4 -fno-debug-types-section -fvar-tracking-assignments -g2 -Wp,-D_FORTIFY_SOURCE=2 -fno-strict-aliasing -fstack-protector-strong --param=ssp-buffer-size=4 -fomit-frame-pointer -march=i686 -fasynchronous-unwind-tables -mtune=pentium4 -gdwarf-4 -fno-debug-types-section -fvar-tracking-assignments -g2 -MT sasldb.lo -MD -MP -MF .deps/sasldb.Tpo -c -o sasldb.lo sasldb.c libtool: compile: i686-pld-linux-gcc -DHAVE_CONFIG_H -I. -I.. -I../include -I../lib -I../sasldb -I../include -DOBSOLETE_CRAM_ATTR=1 -DKRB5_HEIMDAL -I/usr/include/mysql -I/usr/include -I/usr/include -I/usr/include -Wall -W -O2 -fwrapv -pipe -Wformat -Werror=format-security -gdwarf-4 -fno-debug-types-section -fvar-tracking-assignments -g2 -Wp,-D_FORTIFY_SOURCE=2 -fno-strict-aliasing -fstack-protector-strong --param=ssp-buffer-size=4 -fomit-frame-pointer -march=i686 -fasynchronous-unwind-tables -mtune=pentium4 -gdwarf-4 -fno-debug-types-section -fvar-tracking-assignments -g2 -MT sasldb.lo -MD -MP -MF .deps/sasldb.Tpo -c sasldb.c -fPIC -DPIC -o .libs/sasldb.o sasldb.c: In function 'sasldb_auxprop_store': sasldb.c:251:17: warning: initialization discards 'const' qualifier from pointer target type [-Wdiscarded-qualifiers] char * value = (cur->values && cur->values[0]) ? cur->values[0] : NULL; ^ libtool: compile: i686-pld-linux-gcc -DHAVE_CONFIG_H -I. -I.. -I../include -I../lib -I../sasldb -I../include -DOBSOLETE_CRAM_ATTR=1 -DKRB5_HEIMDAL -I/usr/include/mysql -I/usr/include -I/usr/include -I/usr/include -Wall -W -O2 -fwrapv -pipe -Wformat -Werror=format-security -gdwarf-4 -fno-debug-types-section -fvar-tracking-assignments -g2 -Wp,-D_FORTIFY_SOURCE=2 -fno-strict-aliasing -fstack-protector-strong --param=ssp-buffer-size=4 -fomit-frame-pointer -march=i686 -fasynchronous-unwind-tables -mtune=pentium4 -gdwarf-4 -fno-debug-types-section -fvar-tracking-assignments -g2 -MT sasldb.lo -MD -MP -MF .deps/sasldb.Tpo -c sasldb.c -o sasldb.o >/dev/null 2>&1 mv -f .deps/sasldb.Tpo .deps/sasldb.Plo make[2]: Leaving directory '/tmp/B.RcC6qk/BUILD/cyrus-sasl-2.1.26/plugins' make[2]: Entering directory '/tmp/B.RcC6qk/BUILD/cyrus-sasl-2.1.26/plugins' /bin/sh ../libtool --tag=CC --mode=compile i686-pld-linux-gcc -DHAVE_CONFIG_H -I. -I.. -I../include -I../lib -I../sasldb -I../include -DOBSOLETE_CRAM_ATTR=1 -DKRB5_HEIMDAL -I/usr/include/mysql -I/usr/include -I/usr/include -I/usr/include -Wall -W -O2 -fwrapv -pipe -Wformat -Werror=format-security -gdwarf-4 -fno-debug-types-section -fvar-tracking-assignments -g2 -Wp,-D_FORTIFY_SOURCE=2 -fno-strict-aliasing -fstack-protector-strong --param=ssp-buffer-size=4 -fomit-frame-pointer -march=i686 -fasynchronous-unwind-tables -mtune=pentium4 -gdwarf-4 -fno-debug-types-section -fvar-tracking-assignments -g2 -MT cram.lo -MD -MP -MF .deps/cram.Tpo -c -o cram.lo cram.c libtool: compile: i686-pld-linux-gcc -DHAVE_CONFIG_H -I. -I.. -I../include -I../lib -I../sasldb -I../include -DOBSOLETE_CRAM_ATTR=1 -DKRB5_HEIMDAL -I/usr/include/mysql -I/usr/include -I/usr/include -I/usr/include -Wall -W -O2 -fwrapv -pipe -Wformat -Werror=format-security -gdwarf-4 -fno-debug-types-section -fvar-tracking-assignments -g2 -Wp,-D_FORTIFY_SOURCE=2 -fno-strict-aliasing -fstack-protector-strong --param=ssp-buffer-size=4 -fomit-frame-pointer -march=i686 -fasynchronous-unwind-tables -mtune=pentium4 -gdwarf-4 -fno-debug-types-section -fvar-tracking-assignments -g2 -MT cram.lo -MD -MP -MF .deps/cram.Tpo -c cram.c -fPIC -DPIC -o .libs/cram.o cram.c:68:19: warning: 'plugin_id' defined but not used [-Wunused-const-variable=] static const char plugin_id[] = "$Id: cram.c,v 1.87 2011/09/07 13:19:44 murch Exp $"; ^~~~~~~~~ libtool: compile: i686-pld-linux-gcc -DHAVE_CONFIG_H -I. -I.. -I../include -I../lib -I../sasldb -I../include -DOBSOLETE_CRAM_ATTR=1 -DKRB5_HEIMDAL -I/usr/include/mysql -I/usr/include -I/usr/include -I/usr/include -Wall -W -O2 -fwrapv -pipe -Wformat -Werror=format-security -gdwarf-4 -fno-debug-types-section -fvar-tracking-assignments -g2 -Wp,-D_FORTIFY_SOURCE=2 -fno-strict-aliasing -fstack-protector-strong --param=ssp-buffer-size=4 -fomit-frame-pointer -march=i686 -fasynchronous-unwind-tables -mtune=pentium4 -gdwarf-4 -fno-debug-types-section -fvar-tracking-assignments -g2 -MT cram.lo -MD -MP -MF .deps/cram.Tpo -c cram.c -o cram.o >/dev/null 2>&1 mv -f .deps/cram.Tpo .deps/cram.Plo make[2]: Leaving directory '/tmp/B.RcC6qk/BUILD/cyrus-sasl-2.1.26/plugins' make[2]: Entering directory '/tmp/B.RcC6qk/BUILD/cyrus-sasl-2.1.26/plugins' /bin/sh ../libtool --tag=CC --mode=compile i686-pld-linux-gcc -DHAVE_CONFIG_H -I. -I.. -I../include -I../lib -I../sasldb -I../include -DOBSOLETE_CRAM_ATTR=1 -DKRB5_HEIMDAL -I/usr/include/mysql -I/usr/include -I/usr/include -I/usr/include -Wall -W -O2 -fwrapv -pipe -Wformat -Werror=format-security -gdwarf-4 -fno-debug-types-section -fvar-tracking-assignments -g2 -Wp,-D_FORTIFY_SOURCE=2 -fno-strict-aliasing -fstack-protector-strong --param=ssp-buffer-size=4 -fomit-frame-pointer -march=i686 -fasynchronous-unwind-tables -mtune=pentium4 -gdwarf-4 -fno-debug-types-section -fvar-tracking-assignments -g2 -MT plain.lo -MD -MP -MF .deps/plain.Tpo -c -o plain.lo plain.c libtool: compile: i686-pld-linux-gcc -DHAVE_CONFIG_H -I. -I.. -I../include -I../lib -I../sasldb -I../include -DOBSOLETE_CRAM_ATTR=1 -DKRB5_HEIMDAL -I/usr/include/mysql -I/usr/include -I/usr/include -I/usr/include -Wall -W -O2 -fwrapv -pipe -Wformat -Werror=format-security -gdwarf-4 -fno-debug-types-section -fvar-tracking-assignments -g2 -Wp,-D_FORTIFY_SOURCE=2 -fno-strict-aliasing -fstack-protector-strong --param=ssp-buffer-size=4 -fomit-frame-pointer -march=i686 -fasynchronous-unwind-tables -mtune=pentium4 -gdwarf-4 -fno-debug-types-section -fvar-tracking-assignments -g2 -MT plain.lo -MD -MP -MF .deps/plain.Tpo -c plain.c -fPIC -DPIC -o .libs/plain.o plain.c:60:19: warning: 'plugin_id' defined but not used [-Wunused-const-variable=] static const char plugin_id[] = "$Id: plain.c,v 1.67 2009/06/10 16:05:19 mel Exp $"; ^~~~~~~~~ libtool: compile: i686-pld-linux-gcc -DHAVE_CONFIG_H -I. -I.. -I../include -I../lib -I../sasldb -I../include -DOBSOLETE_CRAM_ATTR=1 -DKRB5_HEIMDAL -I/usr/include/mysql -I/usr/include -I/usr/include -I/usr/include -Wall -W -O2 -fwrapv -pipe -Wformat -Werror=format-security -gdwarf-4 -fno-debug-types-section -fvar-tracking-assignments -g2 -Wp,-D_FORTIFY_SOURCE=2 -fno-strict-aliasing -fstack-protector-strong --param=ssp-buffer-size=4 -fomit-frame-pointer -march=i686 -fasynchronous-unwind-tables -mtune=pentium4 -gdwarf-4 -fno-debug-types-section -fvar-tracking-assignments -g2 -MT plain.lo -MD -MP -MF .deps/plain.Tpo -c plain.c -o plain.o >/dev/null 2>&1 mv -f .deps/plain.Tpo .deps/plain.Plo make[2]: Leaving directory '/tmp/B.RcC6qk/BUILD/cyrus-sasl-2.1.26/plugins' make[2]: Entering directory '/tmp/B.RcC6qk/BUILD/cyrus-sasl-2.1.26/plugins' /bin/sh ../libtool --tag=CC --mode=compile i686-pld-linux-gcc -DHAVE_CONFIG_H -I. -I.. -I../include -I../lib -I../sasldb -I../include -DOBSOLETE_CRAM_ATTR=1 -DKRB5_HEIMDAL -I/usr/include/mysql -I/usr/include -I/usr/include -I/usr/include -Wall -W -O2 -fwrapv -pipe -Wformat -Werror=format-security -gdwarf-4 -fno-debug-types-section -fvar-tracking-assignments -g2 -Wp,-D_FORTIFY_SOURCE=2 -fno-strict-aliasing -fstack-protector-strong --param=ssp-buffer-size=4 -fomit-frame-pointer -march=i686 -fasynchronous-unwind-tables -mtune=pentium4 -gdwarf-4 -fno-debug-types-section -fvar-tracking-assignments -g2 -MT plugin_common.lo -MD -MP -MF .deps/plugin_common.Tpo -c -o plugin_common.lo plugin_common.c libtool: compile: i686-pld-linux-gcc -DHAVE_CONFIG_H -I. -I.. -I../include -I../lib -I../sasldb -I../include -DOBSOLETE_CRAM_ATTR=1 -DKRB5_HEIMDAL -I/usr/include/mysql -I/usr/include -I/usr/include -I/usr/include -Wall -W -O2 -fwrapv -pipe -Wformat -Werror=format-security -gdwarf-4 -fno-debug-types-section -fvar-tracking-assignments -g2 -Wp,-D_FORTIFY_SOURCE=2 -fno-strict-aliasing -fstack-protector-strong --param=ssp-buffer-size=4 -fomit-frame-pointer -march=i686 -fasynchronous-unwind-tables -mtune=pentium4 -gdwarf-4 -fno-debug-types-section -fvar-tracking-assignments -g2 -MT plugin_common.lo -MD -MP -MF .deps/plugin_common.Tpo -c plugin_common.c -fPIC -DPIC -o .libs/plugin_common.o libtool: compile: i686-pld-linux-gcc -DHAVE_CONFIG_H -I. -I.. -I../include -I../lib -I../sasldb -I../include -DOBSOLETE_CRAM_ATTR=1 -DKRB5_HEIMDAL -I/usr/include/mysql -I/usr/include -I/usr/include -I/usr/include -Wall -W -O2 -fwrapv -pipe -Wformat -Werror=format-security -gdwarf-4 -fno-debug-types-section -fvar-tracking-assignments -g2 -Wp,-D_FORTIFY_SOURCE=2 -fno-strict-aliasing -fstack-protector-strong --param=ssp-buffer-size=4 -fomit-frame-pointer -march=i686 -fasynchronous-unwind-tables -mtune=pentium4 -gdwarf-4 -fno-debug-types-section -fvar-tracking-assignments -g2 -MT plugin_common.lo -MD -MP -MF .deps/plugin_common.Tpo -c plugin_common.c -o plugin_common.o >/dev/null 2>&1 mv -f .deps/plugin_common.Tpo .deps/plugin_common.Plo make[2]: Leaving directory '/tmp/B.RcC6qk/BUILD/cyrus-sasl-2.1.26/plugins' make[2]: Entering directory '/tmp/B.RcC6qk/BUILD/cyrus-sasl-2.1.26/plugins' /bin/sh ../libtool --tag=CC --mode=compile i686-pld-linux-gcc -DHAVE_CONFIG_H -I. -I.. -I../include -I../lib -I../sasldb -I../include -DOBSOLETE_CRAM_ATTR=1 -DKRB5_HEIMDAL -I/usr/include/mysql -I/usr/include -I/usr/include -I/usr/include -Wall -W -O2 -fwrapv -pipe -Wformat -Werror=format-security -gdwarf-4 -fno-debug-types-section -fvar-tracking-assignments -g2 -Wp,-D_FORTIFY_SOURCE=2 -fno-strict-aliasing -fstack-protector-strong --param=ssp-buffer-size=4 -fomit-frame-pointer -march=i686 -fasynchronous-unwind-tables -mtune=pentium4 -gdwarf-4 -fno-debug-types-section -fvar-tracking-assignments -g2 -MT gssapi.lo -MD -MP -MF .deps/gssapi.Tpo -c -o gssapi.lo gssapi.c libtool: compile: i686-pld-linux-gcc -DHAVE_CONFIG_H -I. -I.. -I../include -I../lib -I../sasldb -I../include -DOBSOLETE_CRAM_ATTR=1 -DKRB5_HEIMDAL -I/usr/include/mysql -I/usr/include -I/usr/include -I/usr/include -Wall -W -O2 -fwrapv -pipe -Wformat -Werror=format-security -gdwarf-4 -fno-debug-types-section -fvar-tracking-assignments -g2 -Wp,-D_FORTIFY_SOURCE=2 -fno-strict-aliasing -fstack-protector-strong --param=ssp-buffer-size=4 -fomit-frame-pointer -march=i686 -fasynchronous-unwind-tables -mtune=pentium4 -gdwarf-4 -fno-debug-types-section -fvar-tracking-assignments -g2 -MT gssapi.lo -MD -MP -MF .deps/gssapi.Tpo -c gssapi.c -fPIC -DPIC -o .libs/gssapi.o gssapi.c: In function 'sasl_gss_free_context_contents': gssapi.c:532:15: warning: variable 'maj_stat' set but not used [-Wunused-but-set-variable] OM_uint32 maj_stat, min_stat; ^~~~~~~~ gssapi.c: In function 'gssapi_common_mech_free': gssapi.c:611:29: warning: unused parameter 'utils' [-Wunused-parameter] const sasl_utils_t *utils) ~~~~~~~~~~~~~~~~~~~~^~~~~ At top level: gssapi.c:89:19: warning: 'plugin_id' defined but not used [-Wunused-const-variable=] static const char plugin_id[] = "$Id: gssapi.c,v 1.115 2011/11/21 15:12:35 mel Exp $"; ^~~~~~~~~ libtool: compile: i686-pld-linux-gcc -DHAVE_CONFIG_H -I. -I.. -I../include -I../lib -I../sasldb -I../include -DOBSOLETE_CRAM_ATTR=1 -DKRB5_HEIMDAL -I/usr/include/mysql -I/usr/include -I/usr/include -I/usr/include -Wall -W -O2 -fwrapv -pipe -Wformat -Werror=format-security -gdwarf-4 -fno-debug-types-section -fvar-tracking-assignments -g2 -Wp,-D_FORTIFY_SOURCE=2 -fno-strict-aliasing -fstack-protector-strong --param=ssp-buffer-size=4 -fomit-frame-pointer -march=i686 -fasynchronous-unwind-tables -mtune=pentium4 -gdwarf-4 -fno-debug-types-section -fvar-tracking-assignments -g2 -MT gssapi.lo -MD -MP -MF .deps/gssapi.Tpo -c gssapi.c -o gssapi.o >/dev/null 2>&1 mv -f .deps/gssapi.Tpo .deps/gssapi.Plo make[2]: Leaving directory '/tmp/B.RcC6qk/BUILD/cyrus-sasl-2.1.26/plugins' make[2]: Entering directory '/tmp/B.RcC6qk/BUILD/cyrus-sasl-2.1.26/plugins' /bin/sh ../libtool --tag=CC --mode=compile i686-pld-linux-gcc -DHAVE_CONFIG_H -I. -I.. -I../include -I../lib -I../sasldb -I../include -DOBSOLETE_CRAM_ATTR=1 -DKRB5_HEIMDAL -I/usr/include/mysql -I/usr/include -I/usr/include -I/usr/include -Wall -W -O2 -fwrapv -pipe -Wformat -Werror=format-security -gdwarf-4 -fno-debug-types-section -fvar-tracking-assignments -g2 -Wp,-D_FORTIFY_SOURCE=2 -fno-strict-aliasing -fstack-protector-strong --param=ssp-buffer-size=4 -fomit-frame-pointer -march=i686 -fasynchronous-unwind-tables -mtune=pentium4 -gdwarf-4 -fno-debug-types-section -fvar-tracking-assignments -g2 -MT gs2.lo -MD -MP -MF .deps/gs2.Tpo -c -o gs2.lo gs2.c libtool: compile: i686-pld-linux-gcc -DHAVE_CONFIG_H -I. -I.. -I../include -I../lib -I../sasldb -I../include -DOBSOLETE_CRAM_ATTR=1 -DKRB5_HEIMDAL -I/usr/include/mysql -I/usr/include -I/usr/include -I/usr/include -Wall -W -O2 -fwrapv -pipe -Wformat -Werror=format-security -gdwarf-4 -fno-debug-types-section -fvar-tracking-assignments -g2 -Wp,-D_FORTIFY_SOURCE=2 -fno-strict-aliasing -fstack-protector-strong --param=ssp-buffer-size=4 -fomit-frame-pointer -march=i686 -fasynchronous-unwind-tables -mtune=pentium4 -gdwarf-4 -fno-debug-types-section -fvar-tracking-assignments -g2 -MT gs2.lo -MD -MP -MF .deps/gs2.Tpo -c gs2.c -fPIC -DPIC -o .libs/gs2.o gs2.c: In function 'gs2_common_mech_free': gs2.c:278:42: warning: unused parameter 'utils' [-Wunused-parameter] const sasl_utils_t *utils) ~~~~~~~~~~~~~~~~~~~~^~~~~ libtool: compile: i686-pld-linux-gcc -DHAVE_CONFIG_H -I. -I.. -I../include -I../lib -I../sasldb -I../include -DOBSOLETE_CRAM_ATTR=1 -DKRB5_HEIMDAL -I/usr/include/mysql -I/usr/include -I/usr/include -I/usr/include -Wall -W -O2 -fwrapv -pipe -Wformat -Werror=format-security -gdwarf-4 -fno-debug-types-section -fvar-tracking-assignments -g2 -Wp,-D_FORTIFY_SOURCE=2 -fno-strict-aliasing -fstack-protector-strong --param=ssp-buffer-size=4 -fomit-frame-pointer -march=i686 -fasynchronous-unwind-tables -mtune=pentium4 -gdwarf-4 -fno-debug-types-section -fvar-tracking-assignments -g2 -MT gs2.lo -MD -MP -MF .deps/gs2.Tpo -c gs2.c -o gs2.o >/dev/null 2>&1 mv -f .deps/gs2.Tpo .deps/gs2.Plo make[2]: Leaving directory '/tmp/B.RcC6qk/BUILD/cyrus-sasl-2.1.26/plugins' make[2]: Entering directory '/tmp/B.RcC6qk/BUILD/cyrus-sasl-2.1.26/plugins' /bin/sh ../libtool --tag=CC --mode=compile i686-pld-linux-gcc -DHAVE_CONFIG_H -I. -I.. -I../include -I../lib -I../sasldb -I../include -DOBSOLETE_CRAM_ATTR=1 -DKRB5_HEIMDAL -I/usr/include/mysql -I/usr/include -I/usr/include -I/usr/include -Wall -W -O2 -fwrapv -pipe -Wformat -Werror=format-security -gdwarf-4 -fno-debug-types-section -fvar-tracking-assignments -g2 -Wp,-D_FORTIFY_SOURCE=2 -fno-strict-aliasing -fstack-protector-strong --param=ssp-buffer-size=4 -fomit-frame-pointer -march=i686 -fasynchronous-unwind-tables -mtune=pentium4 -gdwarf-4 -fno-debug-types-section -fvar-tracking-assignments -g2 -MT scram.lo -MD -MP -MF .deps/scram.Tpo -c -o scram.lo scram.c libtool: compile: i686-pld-linux-gcc -DHAVE_CONFIG_H -I. -I.. -I../include -I../lib -I../sasldb -I../include -DOBSOLETE_CRAM_ATTR=1 -DKRB5_HEIMDAL -I/usr/include/mysql -I/usr/include -I/usr/include -I/usr/include -Wall -W -O2 -fwrapv -pipe -Wformat -Werror=format-security -gdwarf-4 -fno-debug-types-section -fvar-tracking-assignments -g2 -Wp,-D_FORTIFY_SOURCE=2 -fno-strict-aliasing -fstack-protector-strong --param=ssp-buffer-size=4 -fomit-frame-pointer -march=i686 -fasynchronous-unwind-tables -mtune=pentium4 -gdwarf-4 -fno-debug-types-section -fvar-tracking-assignments -g2 -MT scram.lo -MD -MP -MF .deps/scram.Tpo -c scram.c -fPIC -DPIC -o .libs/scram.o scram.c: In function 'Hi': scram.c:302:7: warning: pointer targets in passing argument 4 of 'HMAC' differ in signedness [-Wpointer-sign] initial_key, ^~~~~~~~~~~ In file included from scram.c:68: /usr/include/openssl/hmac.h:39:16: note: expected 'const unsigned char *' but argument is of type 'char *' unsigned char *HMAC(const EVP_MD *evp_md, const void *key, int key_len, ^~~~ scram.c:318:4: warning: pointer targets in passing argument 4 of 'HMAC' differ in signedness [-Wpointer-sign] temp_result, ^~~~~~~~~~~ In file included from scram.c:68: /usr/include/openssl/hmac.h:39:16: note: expected 'const unsigned char *' but argument is of type 'char *' unsigned char *HMAC(const EVP_MD *evp_md, const void *key, int key_len, ^~~~ scram.c: In function 'scram_server_user_salt': scram.c:348:43: warning: pointer targets in passing argument 4 of 'Hi' differ in signedness [-Wpointer-sign] Hi(utils, username, strlen(username), g_salt_key, SALT_SIZE, 20 /* iterations */, result); ^~~~~~~~~~ scram.c:274:1: note: expected 'const char *' but argument is of type 'unsigned char *' Hi (const sasl_utils_t * utils, ^~ scram.c:350:12: warning: pointer targets in returning 'char *' from a function with return type 'unsigned char *' differ in signedness [-Wpointer-sign] return result; ^~~~~~ scram.c: In function 'GenerateScramSecrets': scram.c:389:5: warning: pointer targets in passing argument 2 of 'Hi' differ in signedness [-Wpointer-sign] sec->data, ~~~^~~~~~ scram.c:274:1: note: expected 'const char *' but argument is of type 'unsigned char *' Hi (const sasl_utils_t * utils, ^~ scram.c:97:33: warning: pointer targets in passing argument 4 of 'HMAC' differ in signedness [-Wpointer-sign] #define CLIENT_KEY_CONSTANT "Client Key" ^~~~~~~~~~~~ scram.c:400:7: note: in expansion of macro 'CLIENT_KEY_CONSTANT' CLIENT_KEY_CONSTANT, ^~~~~~~~~~~~~~~~~~~ In file included from scram.c:68: /usr/include/openssl/hmac.h:39:16: note: expected 'const unsigned char *' but argument is of type 'char *' unsigned char *HMAC(const EVP_MD *evp_md, const void *key, int key_len, ^~~~ scram.c:410:14: warning: pointer targets in passing argument 1 of 'SHA1' differ in signedness [-Wpointer-sign] if (SHA1(ClientKey, SCRAM_HASH_SIZE, StoredKey) == NULL) { ^~~~~~~~~ In file included from scram.c:66: /usr/include/openssl/sha.h:44:16: note: expected 'const unsigned char *' but argument is of type 'char *' unsigned char *SHA1(const unsigned char *d, size_t n, unsigned char *md); ^~~~ scram.c:410:42: warning: pointer targets in passing argument 3 of 'SHA1' differ in signedness [-Wpointer-sign] if (SHA1(ClientKey, SCRAM_HASH_SIZE, StoredKey) == NULL) { ^~~~~~~~~ In file included from scram.c:66: /usr/include/openssl/sha.h:44:16: note: expected 'unsigned char *' but argument is of type 'char *' unsigned char *SHA1(const unsigned char *d, size_t n, unsigned char *md); ^~~~ scram.c:98:33: warning: pointer targets in passing argument 4 of 'HMAC' differ in signedness [-Wpointer-sign] #define SERVER_KEY_CONSTANT "Server Key" ^~~~~~~~~~~~ scram.c:421:7: note: in expansion of macro 'SERVER_KEY_CONSTANT' SERVER_KEY_CONSTANT, ^~~~~~~~~~~~~~~~~~~ In file included from scram.c:68: /usr/include/openssl/hmac.h:39:16: note: expected 'const unsigned char *' but argument is of type 'char *' unsigned char *HMAC(const EVP_MD *evp_md, const void *key, int key_len, ^~~~ scram.c: In function 'scram_server_mech_step1': scram.c:786:13: warning: pointer targets in assignment from 'unsigned char *' to 'char *' differ in signedness [-Wpointer-sign] text->salt = scram_server_user_salt(sparams->utils, text->authentication_id, &text->salt_len); ^ scram.c:792:11: warning: passing argument 4 of 'sparams->utils->getopt' from incompatible pointer type [-Wincompatible-pointer-types] &s_iteration_count, ^~~~~~~~~~~~~~~~~~ scram.c:792:11: note: expected 'const char **' but argument is of type 'char **' scram.c:512:18: warning: unused variable 'hash_len' [-Wunused-variable] unsigned int hash_len = 0; ^~~~~~~~ scram.c: In function 'scram_server_mech_step2': scram.c:1307:11: warning: pointer targets in passing argument 4 of 'HMAC' differ in signedness [-Wpointer-sign] text->auth_message, ~~~~^~~~~~~~~~~~~~ In file included from scram.c:68: /usr/include/openssl/hmac.h:39:16: note: expected 'const unsigned char *' but argument is of type 'char *' unsigned char *HMAC(const EVP_MD *evp_md, const void *key, int key_len, ^~~~ scram.c:1339:14: warning: pointer targets in passing argument 1 of 'SHA1' differ in signedness [-Wpointer-sign] if (SHA1(ReceivedClientKey, SCRAM_HASH_SIZE, CalculatedStoredKey) == NULL) { ^~~~~~~~~~~~~~~~~ In file included from scram.c:66: /usr/include/openssl/sha.h:44:16: note: expected 'const unsigned char *' but argument is of type 'char *' unsigned char *SHA1(const unsigned char *d, size_t n, unsigned char *md); ^~~~ scram.c:1339:50: warning: pointer targets in passing argument 3 of 'SHA1' differ in signedness [-Wpointer-sign] if (SHA1(ReceivedClientKey, SCRAM_HASH_SIZE, CalculatedStoredKey) == NULL) { ^~~~~~~~~~~~~~~~~~~ In file included from scram.c:66: /usr/include/openssl/sha.h:44:16: note: expected 'unsigned char *' but argument is of type 'char *' unsigned char *SHA1(const unsigned char *d, size_t n, unsigned char *md); ^~~~ scram.c:1358:11: warning: pointer targets in passing argument 4 of 'HMAC' differ in signedness [-Wpointer-sign] text->auth_message, ~~~~^~~~~~~~~~~~~~ In file included from scram.c:68: /usr/include/openssl/hmac.h:39:16: note: expected 'const unsigned char *' but argument is of type 'char *' unsigned char *HMAC(const EVP_MD *evp_md, const void *key, int key_len, ^~~~ scram.c: In function 'scram_setpass': scram.c:1575:11: warning: passing argument 4 of 'sparams->utils->getopt' from incompatible pointer type [-Wincompatible-pointer-types] &s_iteration_count, ^~~~~~~~~~~~~~~~~~ scram.c:1575:11: note: expected 'const char **' but argument is of type 'char **' scram.c:1666:13: warning: pointer targets in passing argument 1 of 'sprintf' differ in signedness [-Wpointer-sign] sprintf(sec->data, ~~~^~~~~~ In file included from /usr/include/features.h:428, from /usr/include/sys/types.h:25, from ../config.h:525, from scram.c:45: /usr/include/bits/stdio2.h:34:1: note: expected 'char * restrict' but argument is of type 'unsigned char *' __NTH (sprintf (char *__restrict __s, const char *__restrict __fmt, ...)) ^~~~~ scram.c:1673:38: warning: pointer targets in passing argument 1 of 'strlen' differ in signedness [-Wpointer-sign] sec->len = (unsigned int) strlen(sec->data); ~~~^~~~~~ In file included from ../config.h:576, from scram.c:45: /usr/include/string.h:384:15: note: expected 'const char *' but argument is of type 'unsigned char *' extern size_t strlen (const char *__s) ^~~~~~ scram.c:1687:27: warning: pointer targets in passing argument 3 of 'sparams->utils->prop_set' differ in signedness [-Wpointer-sign] (sec ? sec->data : NULL), ~~~~~~~~~~~~~~~~~^~~~~~~ scram.c:1687:27: note: expected 'const char *' but argument is of type 'unsigned char *' scram.c: In function 'scram_client_mech_step1': scram.c:1992:7: warning: passing argument 2 of 'encode_saslname' from incompatible pointer type [-Wincompatible-pointer-types] &encoded_authorization_id, ^~~~~~~~~~~~~~~~~~~~~~~~~ scram.c:166:17: note: expected 'const char **' but argument is of type 'char **' const char **encoded_saslname, ~~~~~~~~~~~~~^~~~~~~~~~~~~~~~ scram.c:2003:10: warning: passing argument 2 of 'encode_saslname' from incompatible pointer type [-Wincompatible-pointer-types] &encoded_authcid, ^~~~~~~~~~~~~~~~ scram.c:166:17: note: expected 'const char **' but argument is of type 'char **' const char **encoded_saslname, ~~~~~~~~~~~~~^~~~~~~~~~~~~~~~ scram.c: In function 'scram_client_mech_step2': scram.c:2280:23: warning: pointer targets in assignment from 'const unsigned char * const' to 'const char *' differ in signedness [-Wpointer-sign] channel_binding_data = params->cbinding->data; ^ scram.c:2371:16: warning: pointer targets in passing argument 2 of 'Hi' differ in signedness [-Wpointer-sign] text->password->data, ~~~~~~~~~~~~~~^~~~~~ scram.c:274:1: note: expected 'const char *' but argument is of type 'unsigned char *' Hi (const sasl_utils_t * utils, ^~ scram.c:97:33: warning: pointer targets in passing argument 4 of 'HMAC' differ in signedness [-Wpointer-sign] #define CLIENT_KEY_CONSTANT "Client Key" ^~~~~~~~~~~~ scram.c:2384:7: note: in expansion of macro 'CLIENT_KEY_CONSTANT' CLIENT_KEY_CONSTANT, ^~~~~~~~~~~~~~~~~~~ In file included from scram.c:68: /usr/include/openssl/hmac.h:39:16: note: expected 'const unsigned char *' but argument is of type 'char *' unsigned char *HMAC(const EVP_MD *evp_md, const void *key, int key_len, ^~~~ scram.c:2397:14: warning: pointer targets in passing argument 1 of 'SHA1' differ in signedness [-Wpointer-sign] if (SHA1(ClientKey, SCRAM_HASH_SIZE, StoredKey) == NULL) { ^~~~~~~~~ In file included from scram.c:66: /usr/include/openssl/sha.h:44:16: note: expected 'const unsigned char *' but argument is of type 'char *' unsigned char *SHA1(const unsigned char *d, size_t n, unsigned char *md); ^~~~ scram.c:2397:42: warning: pointer targets in passing argument 3 of 'SHA1' differ in signedness [-Wpointer-sign] if (SHA1(ClientKey, SCRAM_HASH_SIZE, StoredKey) == NULL) { ^~~~~~~~~ In file included from scram.c:66: /usr/include/openssl/sha.h:44:16: note: expected 'unsigned char *' but argument is of type 'char *' unsigned char *SHA1(const unsigned char *d, size_t n, unsigned char *md); ^~~~ scram.c:2410:11: warning: pointer targets in passing argument 4 of 'HMAC' differ in signedness [-Wpointer-sign] text->auth_message, ~~~~^~~~~~~~~~~~~~ In file included from scram.c:68: /usr/include/openssl/hmac.h:39:16: note: expected 'const unsigned char *' but argument is of type 'char *' unsigned char *HMAC(const EVP_MD *evp_md, const void *key, int key_len, ^~~~ scram.c: In function 'scram_client_mech_step3': scram.c:98:33: warning: pointer targets in passing argument 4 of 'HMAC' differ in signedness [-Wpointer-sign] #define SERVER_KEY_CONSTANT "Server Key" ^~~~~~~~~~~~ scram.c:2538:7: note: in expansion of macro 'SERVER_KEY_CONSTANT' SERVER_KEY_CONSTANT, ^~~~~~~~~~~~~~~~~~~ In file included from scram.c:68: /usr/include/openssl/hmac.h:39:16: note: expected 'const unsigned char *' but argument is of type 'char *' unsigned char *HMAC(const EVP_MD *evp_md, const void *key, int key_len, ^~~~ scram.c:2552:11: warning: pointer targets in passing argument 4 of 'HMAC' differ in signedness [-Wpointer-sign] text->auth_message, ~~~~^~~~~~~~~~~~~~ In file included from scram.c:68: /usr/include/openssl/hmac.h:39:16: note: expected 'const unsigned char *' but argument is of type 'char *' unsigned char *HMAC(const EVP_MD *evp_md, const void *key, int key_len, ^~~~ At top level: scram.c:260:1: warning: 'print_hash' defined but not used [-Wunused-function] print_hash (const char * func, const char * hash) ^~~~~~~~~~ scram.c:72:19: warning: 'plugin_id' defined but not used [-Wunused-const-variable=] static const char plugin_id[] = "$Id: scram.c,v 1.26 2011/09/07 16:09:40 murch Exp $"; ^~~~~~~~~ libtool: compile: i686-pld-linux-gcc -DHAVE_CONFIG_H -I. -I.. -I../include -I../lib -I../sasldb -I../include -DOBSOLETE_CRAM_ATTR=1 -DKRB5_HEIMDAL -I/usr/include/mysql -I/usr/include -I/usr/include -I/usr/include -Wall -W -O2 -fwrapv -pipe -Wformat -Werror=format-security -gdwarf-4 -fno-debug-types-section -fvar-tracking-assignments -g2 -Wp,-D_FORTIFY_SOURCE=2 -fno-strict-aliasing -fstack-protector-strong --param=ssp-buffer-size=4 -fomit-frame-pointer -march=i686 -fasynchronous-unwind-tables -mtune=pentium4 -gdwarf-4 -fno-debug-types-section -fvar-tracking-assignments -g2 -MT scram.lo -MD -MP -MF .deps/scram.Tpo -c scram.c -o scram.o >/dev/null 2>&1 mv -f .deps/scram.Tpo .deps/scram.Plo make[2]: Leaving directory '/tmp/B.RcC6qk/BUILD/cyrus-sasl-2.1.26/plugins' make[2]: Entering directory '/tmp/B.RcC6qk/BUILD/cyrus-sasl-2.1.26/plugins' /bin/sh ../libtool --tag=CC --mode=compile i686-pld-linux-gcc -DHAVE_CONFIG_H -I. -I.. -I../include -I../lib -I../sasldb -I../include -DOBSOLETE_CRAM_ATTR=1 -DKRB5_HEIMDAL -I/usr/include/mysql -I/usr/include -I/usr/include -I/usr/include -Wall -W -O2 -fwrapv -pipe -Wformat -Werror=format-security -gdwarf-4 -fno-debug-types-section -fvar-tracking-assignments -g2 -Wp,-D_FORTIFY_SOURCE=2 -fno-strict-aliasing -fstack-protector-strong --param=ssp-buffer-size=4 -fomit-frame-pointer -march=i686 -fasynchronous-unwind-tables -mtune=pentium4 -gdwarf-4 -fno-debug-types-section -fvar-tracking-assignments -g2 -MT digestmd5.lo -MD -MP -MF .deps/digestmd5.Tpo -c -o digestmd5.lo digestmd5.c libtool: compile: i686-pld-linux-gcc -DHAVE_CONFIG_H -I. -I.. -I../include -I../lib -I../sasldb -I../include -DOBSOLETE_CRAM_ATTR=1 -DKRB5_HEIMDAL -I/usr/include/mysql -I/usr/include -I/usr/include -I/usr/include -Wall -W -O2 -fwrapv -pipe -Wformat -Werror=format-security -gdwarf-4 -fno-debug-types-section -fvar-tracking-assignments -g2 -Wp,-D_FORTIFY_SOURCE=2 -fno-strict-aliasing -fstack-protector-strong --param=ssp-buffer-size=4 -fomit-frame-pointer -march=i686 -fasynchronous-unwind-tables -mtune=pentium4 -gdwarf-4 -fno-debug-types-section -fvar-tracking-assignments -g2 -MT digestmd5.lo -MD -MP -MF .deps/digestmd5.Tpo -c digestmd5.c -fPIC -DPIC -o .libs/digestmd5.o digestmd5.c: In function 'digestmd5_server_mech_step': digestmd5.c:3051:18: warning: pointer targets in assignment from 'char *' to 'unsigned char *' differ in signedness [-Wpointer-sign] text->nonce = text->realm = NULL; ^ digestmd5.c: In function 'parse_server_challenge': digestmd5.c:3653:10: warning: variable 'IsUTF8' set but not used [-Wunused-but-set-variable] bool IsUTF8 = FALSE; ^~~~~~ digestmd5.c: In function 'digestmd5_client_mech_step': digestmd5.c:4503:5: warning: this statement may fall through [-Wimplicit-fallthrough=] if (!serverin) { ^ digestmd5.c:4531:5: note: here case 3: ^~~~ digestmd5.c:4555:16: warning: this statement may fall through [-Wimplicit-fallthrough=] ctext->cipher = NULL; ^ digestmd5.c:4557:5: note: here case 2: ^~~~ At top level: digestmd5.c:125:19: warning: 'plugin_id' defined but not used [-Wunused-const-variable=] static const char plugin_id[] = "$Id: digestmd5.c,v 1.205 2011/05/13 19:18:37 murch Exp $"; ^~~~~~~~~ libtool: compile: i686-pld-linux-gcc -DHAVE_CONFIG_H -I. -I.. -I../include -I../lib -I../sasldb -I../include -DOBSOLETE_CRAM_ATTR=1 -DKRB5_HEIMDAL -I/usr/include/mysql -I/usr/include -I/usr/include -I/usr/include -Wall -W -O2 -fwrapv -pipe -Wformat -Werror=format-security -gdwarf-4 -fno-debug-types-section -fvar-tracking-assignments -g2 -Wp,-D_FORTIFY_SOURCE=2 -fno-strict-aliasing -fstack-protector-strong --param=ssp-buffer-size=4 -fomit-frame-pointer -march=i686 -fasynchronous-unwind-tables -mtune=pentium4 -gdwarf-4 -fno-debug-types-section -fvar-tracking-assignments -g2 -MT digestmd5.lo -MD -MP -MF .deps/digestmd5.Tpo -c digestmd5.c -o digestmd5.o >/dev/null 2>&1 mv -f .deps/digestmd5.Tpo .deps/digestmd5.Plo make[2]: Leaving directory '/tmp/B.RcC6qk/BUILD/cyrus-sasl-2.1.26/plugins' make[1]: *** [Makefile:583: all-recursive] Error 1 make: *** [Makefile:492: all] Error 2 error: Bad exit status from /tmp/B.RcC6qk/BUILD/tmp/rpm-tmp.10561 (%build) RPM build errors: Bad exit status from /tmp/B.RcC6qk/BUILD/tmp/rpm-tmp.10561 (%build) ended at: Fri Sep 14 16:11:52 2018, done in 0:00:25.983392 error: No files produced. + chmod -R u+rwX /tmp/B.RcC6qk/BUILD + rm -rf /tmp/B.RcC6qk/tmp /tmp/B.RcC6qk/BUILD + rm -rf /tmp/B.RcC6qk Begin-PLD-Builder-Info Build-Time: user:32.35s sys:3.66s real:30.92s (faults io:1 non-io:1646674) End-PLD-Builder-Info
[Back to list of logs] [View rpm -qa of builder]