FailedOk

th/SRPMS[OK]
th/x32[OK]
th/i686[OK]
th/x86_64[OK]

ac/SRPMS[OK]
ac/i386[OK]
ac/i586[OK]
ac/i686[OK]
ac/alpha[OK]
ac/amd64[OK]
ac/athlon[OK]
ac/ppc[OK]
ac/sparc[OK]
ac/sparc64[OK]

Advanced Search
main()
Powered by PLD Linux
(c) 2002-2018 PLD Team
$Revision: 1.37 $
Powered by VAX.
Your IP: 54.158.199.217

devscripts ad904929-c048-4ff9-9f93-0e84d1c6dec3

Status:Failed
Source URL:ftp://buildlogs.pld-linux.org/th/i686/FAIL/devscripts,ad904929-c048-4ff9-9f93-0e84d1c6dec3.bz2
text/plain URL:View!
rpm -qa of builder:View!
Date:2018/07/09 01:16:43
Runtime:0:00:03.459094

Toc:

  • prep
  • Executing(%prep): /bin/sh -e /tmp/B.owtxLc/BUILD/tmp/rpm-tmp.99507
  • build
  • Executing(%build): /bin/sh -e /tmp/B.owtxLc/BUILD/tmp/rpm-tmp.99507
  • error 1
  • dpkg-vendor: error: vendor default doesn't exist in /etc/dpkg/origins
  • error 2
  • make[1]: *** [Makefile:50: plotchangelog.tmp] Error 2
  • error 3
  • error: Bad exit status from /tmp/B.owtxLc/BUILD/tmp/rpm-tmp.99507 (%build)
  • error 4
  • RPM build errors:
  • error 5
  • error: No files produced.

Content:

request from: baggins
checking if we should skip the build
started at: Mon Jul  9 01:16:36 2018
killing old processes on a builder
sending signal 9 to pid -1
Killed
cleaning up /tmp
fetching https://srcbuilder.pld-linux.org/th//srpms/ad904929-c048-4ff9-9f93-0e84d1c6dec3/devscripts-2.15.7-6.src.rpm
fetched 632756 bytes, 1216.6 K/s
installing srpm: devscripts-2.15.7-6.src.rpm
+ install -d /tmp/B.owtxLc/BUILD /tmp/B.owtxLc/RPMS
+ LC_ALL=en_US.UTF-8
+ rpm -qp --changelog devscripts-2.15.7-6.src.rpm
* Sun Jul 08 2018 PLD Linux Team <feedback@pld-linux.org>
- For complete changelog see: http://git.pld-linux.org/?p=packages/devscripts.git;a=log;h=master
* Sun Jul 08 2018 Jan Rękorajski <baggins@pld-linux.org> 475438a
- release 6 (by relup.sh) * Thu Jul 05 2018 Arkadiusz Miśkiewicz <arekm@maven.pl> e1dbf84
- release 5 (by relup.sh) + rpm -Uhv --nodeps --define '_topdir /tmp/B.owtxLc' --define '_specdir %{_topdir}' --define '_sourcedir %{_specdir}' --define '_rpmdir %{_topdir}/RPMS' --define '_builddir %{_topdir}/BUILD' devscripts-2.15.7-6.src.rpm Preparing... ################################################## devscripts ################################################## + rm -f devscripts-2.15.7-6.src.rpm + install -m 700 -d /tmp/B.owtxLc/BUILD/tmp + TMPDIR=/tmp/B.owtxLc/BUILD/tmp + exec nice -n 0 rpmbuild -bp --short-circuit --nodeps --define '_topdir /tmp/B.owtxLc' --define '_specdir %{_topdir}' --define '_sourcedir %{_specdir}' --define '_rpmdir %{_topdir}/RPMS' --define '_builddir %{_topdir}/BUILD' --target i686-pld-linux --define 'prep exit 0' /tmp/B.owtxLc/devscripts.spec Building target platforms: i686-pld-linux checking BuildConflict-ing packages no BuildConflicts found checking BR rpm: Building target platforms: i686-pld-linux no BR needed building RPM using: set -ex; : build-id: ad904929-c048-4ff9-9f93-0e84d1c6dec3; TMPDIR=/tmp/B.owtxLc/BUILD/tmp exec nice -n 0 rpmbuild -bb --define '_smp_mflags -j1' --define '_make_opts -Otarget' --define '_pld_builder 1' --define '_topdir /tmp/B.owtxLc' --define '_specdir %{_topdir}' --define '_sourcedir %{_specdir}' --define '_rpmdir %{_topdir}/RPMS' --define '_builddir %{_topdir}/BUILD' --target i686-pld-linux /tmp/B.owtxLc/devscripts.spec + : build-id: ad904929-c048-4ff9-9f93-0e84d1c6dec3 + TMPDIR=/tmp/B.owtxLc/BUILD/tmp + exec nice -n 0 rpmbuild -bb --define '_smp_mflags -j1' --define '_make_opts -Otarget' --define '_pld_builder 1' --define '_topdir /tmp/B.owtxLc' --define '_specdir %{_topdir}' --define '_sourcedir %{_specdir}' --define '_rpmdir %{_topdir}/RPMS' --define '_builddir %{_topdir}/BUILD' --target i686-pld-linux /tmp/B.owtxLc/devscripts.spec Building target platforms: i686-pld-linux Executing(%prep): /bin/sh -e /tmp/B.owtxLc/BUILD/tmp/rpm-tmp.99507 + umask 022 + cd /tmp/B.owtxLc/BUILD + cd /tmp/B.owtxLc/BUILD + rm -rf devscripts-2.15.7 + /usr/bin/xz -dc /tmp/B.owtxLc/devscripts_2.15.7.tar.xz + /bin/tar -xf - + STATUS=0 + '[' 0 -ne 0 ']' + cd devscripts-2.15.7 + /bin/id -u + '[' 1001 '=' 0 ']' + /bin/id -u + '[' 1001 '=' 0 ']' + /bin/chmod -Rf a+rX,u+w,g-w,o-w . + echo 'Patch #0 (devscripts_docbook.patch):' Patch #0 (devscripts_docbook.patch): + '[' -f /tmp/B.owtxLc/devscripts_docbook.patch ']' + /bin/cat /tmp/B.owtxLc/devscripts_docbook.patch + /usr/bin/patch -s -p1 + echo 'Patch #1 (devscripts_install-layout.patch):' Patch #1 (devscripts_install-layout.patch): + '[' -f /tmp/B.owtxLc/devscripts_install-layout.patch ']' + /bin/cat /tmp/B.owtxLc/devscripts_install-layout.patch + /usr/bin/patch -s -p1 + echo 'Patch #2 (devscripts_install-man.patch):' Patch #2 (devscripts_install-man.patch): + '[' -f /tmp/B.owtxLc/devscripts_install-man.patch ']' + /bin/cat /tmp/B.owtxLc/devscripts_install-man.patch + /usr/bin/patch -s -p1 + /bin/sed -i -e s/liburi-perl/perl-URI/g scripts/bts.pl scripts/build-rdeps.pl scripts/chdist.pl scripts/checkbashisms.pl scripts/cvs-debuild.pl scripts/dcontrol.pl scripts/dd-list.pl scripts/debchange.pl scripts/debcheckout.pl scripts/debcommit.pl scripts/debdiff.pl scripts/debi.pl scripts/debpkg.pl scripts/debsnap.pl scripts/debuild.pl scripts/dep3changelog.pl scripts/desktop2menu.pl scripts/dget.pl scripts/dpkg-depcheck.pl scripts/dscverify.pl scripts/grep-excuses.pl scripts/licensecheck.pl scripts/mass-bug.pl scripts/mk-build-deps.pl scripts/mk-origtargz.pl scripts/namecheck.pl scripts/origtargz.pl scripts/plotchangelog.pl scripts/rc-alert.pl scripts/rmadison.pl scripts/svnpath.pl scripts/tagpending.pl scripts/transition-check.pl scripts/uscan.pl scripts/who-permits-upload.pl + /bin/sed -i -e s/liblwp-protocol-https-perl/perl-LWP-Protocol-https/g scripts/bts.pl scripts/build-rdeps.pl scripts/chdist.pl scripts/checkbashisms.pl scripts/cvs-debuild.pl scripts/dcontrol.pl scripts/dd-list.pl scripts/debchange.pl scripts/debcheckout.pl scripts/debcommit.pl scripts/debdiff.pl scripts/debi.pl scripts/debpkg.pl scripts/debsnap.pl scripts/debuild.pl scripts/dep3changelog.pl scripts/desktop2menu.pl scripts/dget.pl scripts/dpkg-depcheck.pl scripts/dscverify.pl scripts/grep-excuses.pl scripts/licensecheck.pl scripts/mass-bug.pl scripts/mk-build-deps.pl scripts/mk-origtargz.pl scripts/namecheck.pl scripts/origtargz.pl scripts/plotchangelog.pl scripts/rc-alert.pl scripts/rmadison.pl scripts/svnpath.pl scripts/tagpending.pl scripts/transition-check.pl scripts/uscan.pl scripts/who-permits-upload.pl + /bin/sed -i -e s/libtimedate-perl/perl-TimeDate/g scripts/bts.pl scripts/build-rdeps.pl scripts/chdist.pl scripts/checkbashisms.pl scripts/cvs-debuild.pl scripts/dcontrol.pl scripts/dd-list.pl scripts/debchange.pl scripts/debcheckout.pl scripts/debcommit.pl scripts/debdiff.pl scripts/debi.pl scripts/debpkg.pl scripts/debsnap.pl scripts/debuild.pl scripts/dep3changelog.pl scripts/desktop2menu.pl scripts/dget.pl scripts/dpkg-depcheck.pl scripts/dscverify.pl scripts/grep-excuses.pl scripts/licensecheck.pl scripts/mass-bug.pl scripts/mk-build-deps.pl scripts/mk-origtargz.pl scripts/namecheck.pl scripts/origtargz.pl scripts/plotchangelog.pl scripts/rc-alert.pl scripts/rmadison.pl scripts/svnpath.pl scripts/tagpending.pl scripts/transition-check.pl scripts/uscan.pl scripts/who-permits-upload.pl + /bin/sed -i -e s/libfile-desktopentry-perl/perl-File-DesktopEntry/g scripts/bts.pl scripts/build-rdeps.pl scripts/chdist.pl scripts/checkbashisms.pl scripts/cvs-debuild.pl scripts/dcontrol.pl scripts/dd-list.pl scripts/debchange.pl scripts/debcheckout.pl scripts/debcommit.pl scripts/debdiff.pl scripts/debi.pl scripts/debpkg.pl scripts/debsnap.pl scripts/debuild.pl scripts/dep3changelog.pl scripts/desktop2menu.pl scripts/dget.pl scripts/dpkg-depcheck.pl scripts/dscverify.pl scripts/grep-excuses.pl scripts/licensecheck.pl scripts/mass-bug.pl scripts/mk-build-deps.pl scripts/mk-origtargz.pl scripts/namecheck.pl scripts/origtargz.pl scripts/plotchangelog.pl scripts/rc-alert.pl scripts/rmadison.pl scripts/svnpath.pl scripts/tagpending.pl scripts/transition-check.pl scripts/uscan.pl scripts/who-permits-upload.pl + /bin/sed -i -e s/libwww-perl/perl-libwww/g scripts/bts.pl scripts/build-rdeps.pl scripts/chdist.pl scripts/checkbashisms.pl scripts/cvs-debuild.pl scripts/dcontrol.pl scripts/dd-list.pl scripts/debchange.pl scripts/debcheckout.pl scripts/debcommit.pl scripts/debdiff.pl scripts/debi.pl scripts/debpkg.pl scripts/debsnap.pl scripts/debuild.pl scripts/dep3changelog.pl scripts/desktop2menu.pl scripts/dget.pl scripts/dpkg-depcheck.pl scripts/dscverify.pl scripts/grep-excuses.pl scripts/licensecheck.pl scripts/mass-bug.pl scripts/mk-build-deps.pl scripts/mk-origtargz.pl scripts/namecheck.pl scripts/origtargz.pl scripts/plotchangelog.pl scripts/rc-alert.pl scripts/rmadison.pl scripts/svnpath.pl scripts/tagpending.pl scripts/transition-check.pl scripts/uscan.pl scripts/who-permits-upload.pl + /bin/sed -i -e s/libdigest-md5-perl/perl-Digest-MD5/g scripts/bts.pl scripts/build-rdeps.pl scripts/chdist.pl scripts/checkbashisms.pl scripts/cvs-debuild.pl scripts/dcontrol.pl scripts/dd-list.pl scripts/debchange.pl scripts/debcheckout.pl scripts/debcommit.pl scripts/debdiff.pl scripts/debi.pl scripts/debpkg.pl scripts/debsnap.pl scripts/debuild.pl scripts/dep3changelog.pl scripts/desktop2menu.pl scripts/dget.pl scripts/dpkg-depcheck.pl scripts/dscverify.pl scripts/grep-excuses.pl scripts/licensecheck.pl scripts/mass-bug.pl scripts/mk-build-deps.pl scripts/mk-origtargz.pl scripts/namecheck.pl scripts/origtargz.pl scripts/plotchangelog.pl scripts/rc-alert.pl scripts/rmadison.pl scripts/svnpath.pl scripts/tagpending.pl scripts/transition-check.pl scripts/uscan.pl scripts/who-permits-upload.pl + /bin/sed -i -e 's#setup.py install #setup.py install --prefix=/usr --install-purelib=/usr/share/python3.7/site-packages --install-platlib=/usr/lib/python3.7/site-packages #g' scripts/Makefile + exit 0 Executing(%build): /bin/sh -e /tmp/B.owtxLc/BUILD/tmp/rpm-tmp.99507 TMP=/home/users/builder/tmp HOME=/home/users/builder PATH=/usr/local/bin:/usr/bin:/bin:/home/users/builder/bin TMPDIR=/tmp/B.owtxLc/BUILD/tmp + umask 022 + cd /tmp/B.owtxLc/BUILD + cd devscripts-2.15.7 + /usr/bin/make -Otarget -j1 'LIBDIR=/usr/lib/devscripts' 'CFLAGS=-O2 -fwrapv -pipe -Wformat -Werror=format-security -gdwarf-4 -fno-debug-types-section -fvar-tracking-assignments -g2 -Wp,-D_FORTIFY_SOURCE=2 -fstack-protector-strong --param=ssp-buffer-size=4 -fomit-frame-pointer -march=i686 -fasynchronous-unwind-tables -mtune=pentium4 ' 'LDFLAGS=' rm -f version dpkg-parsechangelog -SVersion > version /usr/bin/make -C scripts/ make[1]: Entering directory '/tmp/B.owtxLc/BUILD/devscripts-2.15.7/scripts' dpkg-vendor: error: vendor default doesn't exist in /etc/dpkg/origins make[1]: Leaving directory '/tmp/B.owtxLc/BUILD/devscripts-2.15.7/scripts' make[1]: Entering directory '/tmp/B.owtxLc/BUILD/devscripts-2.15.7/scripts' sed -e "s/###VERSION###/2.15.7/" who-permits-upload.pl > who-permits-upload.tmp perl -I ../lib -c who-permits-upload.tmp who-permits-upload.tmp syntax OK cp who-permits-upload.tmp who-permits-upload chmod +x who-permits-upload sed -e "s/###VERSION###/2.15.7/" checkbashisms.pl > checkbashisms.tmp perl -I ../lib -c checkbashisms.tmp checkbashisms.tmp syntax OK cp checkbashisms.tmp checkbashisms chmod +x checkbashisms sed -e "s/###VERSION###/2.15.7/" transition-check.pl > transition-check.tmp perl -I ../lib -c transition-check.tmp transition-check.tmp syntax OK cp transition-check.tmp transition-check chmod +x transition-check sed -e "s/###VERSION###/2.15.7/" dpkg-depcheck.pl > dpkg-depcheck.tmp perl -I ../lib -c dpkg-depcheck.tmp dpkg-depcheck.tmp syntax OK cp dpkg-depcheck.tmp dpkg-depcheck chmod +x dpkg-depcheck sed -e "s/###VERSION###/2.15.7/" mass-bug.pl > mass-bug.tmp perl -I ../lib -c mass-bug.tmp mass-bug.tmp syntax OK cp mass-bug.tmp mass-bug chmod +x mass-bug sed -e "s/###VERSION###/2.15.7/" debuild.pl > debuild.tmp perl -I ../lib -c debuild.tmp debuild.tmp syntax OK cp debuild.tmp debuild chmod +x debuild sed -e "s/###VERSION###/2.15.7/" build-rdeps.pl > build-rdeps.tmp perl -I ../lib -c build-rdeps.tmp build-rdeps.tmp syntax OK cp build-rdeps.tmp build-rdeps chmod +x build-rdeps sed -e "s/###VERSION###/2.15.7/" rmadison.pl > rmadison.tmp perl -I ../lib -c rmadison.tmp rmadison.tmp syntax OK cp rmadison.tmp rmadison chmod +x rmadison sed -e "s/###VERSION###/2.15.7/" grep-excuses.pl > grep-excuses.tmp perl -I ../lib -c grep-excuses.tmp grep-excuses.tmp syntax OK cp grep-excuses.tmp grep-excuses chmod +x grep-excuses sed -e "s/###VERSION###/2.15.7/" dget.pl > dget.tmp perl -I ../lib -c dget.tmp dget.tmp syntax OK cp dget.tmp dget chmod +x dget sed -e "s/###VERSION###/2.15.7/" dep3changelog.pl > dep3changelog.tmp perl -I ../lib -c dep3changelog.tmp dep3changelog.tmp syntax OK cp dep3changelog.tmp dep3changelog chmod +x dep3changelog sed -e "s/###VERSION###/2.15.7/" svnpath.pl > svnpath.tmp perl -I ../lib -c svnpath.tmp svnpath.tmp syntax OK cp svnpath.tmp svnpath chmod +x svnpath sed -e "s/###VERSION###/2.15.7/" cvs-debuild.pl > cvs-debuild.tmp perl -I ../lib -c cvs-debuild.tmp cvs-debuild.tmp syntax OK cp cvs-debuild.tmp cvs-debuild chmod +x cvs-debuild sed -e "s/###VERSION###/2.15.7/" debsnap.pl > debsnap.tmp perl -I ../lib -c debsnap.tmp debsnap.tmp syntax OK cp debsnap.tmp debsnap chmod +x debsnap sed -e "s/###VERSION###/2.15.7/" mk-origtargz.pl > mk-origtargz.tmp perl -I ../lib -c mk-origtargz.tmp mk-origtargz.tmp syntax OK cp mk-origtargz.tmp mk-origtargz chmod +x mk-origtargz sed -e "s/###VERSION###/2.15.7/" debi.pl > debi.tmp perl -I ../lib -c debi.tmp debi.tmp syntax OK cp debi.tmp debi chmod +x debi sed -e "s/###VERSION###/2.15.7/" dscverify.pl > dscverify.tmp perl -I ../lib -c dscverify.tmp dscverify.tmp syntax OK cp dscverify.tmp dscverify chmod +x dscverify sed -e "s/###VERSION###/2.15.7/" uscan.pl > uscan.tmp perl -I ../lib -c uscan.tmp uscan.tmp syntax OK cp uscan.tmp uscan chmod +x uscan sed -e "s/###VERSION###/2.15.7/" chdist.pl > chdist.tmp perl -I ../lib -c chdist.tmp chdist.tmp syntax OK cp chdist.tmp chdist chmod +x chdist sed -e "s/###VERSION###/2.15.7/" bts.pl > bts.tmp perl -I ../lib -c bts.tmp bts.tmp syntax OK cp bts.tmp bts chmod +x bts sed -e "s/###VERSION###/2.15.7/" debdiff.pl > debdiff.tmp perl -I ../lib -c debdiff.tmp debdiff.tmp syntax OK cp debdiff.tmp debdiff chmod +x debdiff sed -e "s/###VERSION###/2.15.7/" mk-build-deps.pl > mk-build-deps.tmp perl -I ../lib -c mk-build-deps.tmp mk-build-deps.tmp syntax OK cp mk-build-deps.tmp mk-build-deps chmod +x mk-build-deps sed -e "s/###VERSION###/2.15.7/" desktop2menu.pl > desktop2menu.tmp perl -I ../lib -c desktop2menu.tmp desktop2menu.tmp syntax OK cp desktop2menu.tmp desktop2menu chmod +x desktop2menu cp debchange.pl debchange sed -i "s/###VERSION###/2.15.7/" debchange perl -I ../lib -c debchange debchange syntax OK sed -e "s/###VERSION###/2.15.7/" dcontrol.pl > dcontrol.tmp perl -I ../lib -c dcontrol.tmp dcontrol.tmp syntax OK cp dcontrol.tmp dcontrol chmod +x dcontrol sed -e "s/###VERSION###/2.15.7/" namecheck.pl > namecheck.tmp perl -I ../lib -c namecheck.tmp namecheck.tmp syntax OK cp namecheck.tmp namecheck chmod +x namecheck sed -e "s/###VERSION###/2.15.7/" origtargz.pl > origtargz.tmp perl -I ../lib -c origtargz.tmp origtargz.tmp syntax OK cp origtargz.tmp origtargz chmod +x origtargz sed -e "s/###VERSION###/2.15.7/" licensecheck.pl > licensecheck.tmp perl -I ../lib -c licensecheck.tmp licensecheck.tmp syntax OK cp licensecheck.tmp licensecheck chmod +x licensecheck sed -e "s/###VERSION###/2.15.7/" plotchangelog.pl > plotchangelog.tmp perl -I ../lib -c plotchangelog.tmp plotchangelog.tmp: you must have the perl-TimeDate package installed to use this script BEGIN failed--compilation aborted at plotchangelog.tmp line 44. make[1]: *** [Makefile:50: plotchangelog.tmp] Error 2 rm dep3changelog.tmp debdiff.tmp checkbashisms.tmp namecheck.tmp mk-build-deps.tmp dget.tmp build-rdeps.tmp bts.tmp dscverify.tmp debi.tmp rmadison.tmp cvs-debuild.tmp debsnap.tmp plotchangelog.tmp chdist.tmp debuild.tmp mass-bug.tmp transition-check.tmp origtargz.tmp licensecheck.tmp dcontrol.tmp desktop2menu.tmp who-permits-upload.tmp uscan.tmp mk-origtargz.tmp svnpath.tmp grep-excuses.tmp dpkg-depcheck.tmp make[1]: Leaving directory '/tmp/B.owtxLc/BUILD/devscripts-2.15.7/scripts' make: *** [Makefile:53: make_scripts] Error 2 error: Bad exit status from /tmp/B.owtxLc/BUILD/tmp/rpm-tmp.99507 (%build) RPM build errors: Bad exit status from /tmp/B.owtxLc/BUILD/tmp/rpm-tmp.99507 (%build) ended at: Mon Jul 9 01:16:43 2018, done in 0:00:03.459094 error: No files produced. + chmod -R u+rwX /tmp/B.owtxLc/BUILD + rm -rf /tmp/B.owtxLc/tmp /tmp/B.owtxLc/BUILD + rm -rf /tmp/B.owtxLc Begin-PLD-Builder-Info Build-Time: user:4.79s sys:0.47s real:6.81s (faults io:0 non-io:100035) End-PLD-Builder-Info
[Back to list of logs] [View rpm -qa of builder]