FailedOk

th/SRPMS[OK]
th/x32[OK]
th/i686[OK]
th/x86_64[OK]

ac/SRPMS[OK]
ac/i386[OK]
ac/i586[OK]
ac/i686[OK]
ac/alpha[OK]
ac/amd64[OK]
ac/athlon[OK]
ac/ppc[OK]
ac/sparc[OK]
ac/sparc64[OK]

Advanced Search
main()
Powered by PLD Linux
(c) 2002-2023 PLD Team
$Revision: 1.37 $
Powered by penguin.
Your IP: 3.235.25.27

domoticz 426cc370-772d-4020-8e96-e89511700d0b

Status:Failed
Source URL:https://buildlogs.pld-linux.org/pld/th/i686/FAIL/domoticz,426cc370-772d-4020-8e96-e89511700d0b.bz2
text/plain URL:View!
full text:View!
rpm -qa of builder:View!
Date:2022/11/03 12:10:38
Runtime:0:01:20.197622

Toc:

  • error 1
  • rpm: error: Failed build dependencies:
  • error 2
  • rpm: error: Failed build dependencies:
  • error 3
  • rpm: error: Failed build dependencies:
  • prep
  • Executing(%prep): /bin/sh -e /tmp/B.kaosb__p/BUILD/tmp/rpm-tmp.HK4dHy
  • build
  • Executing(%build): /bin/sh -e /tmp/B.kaosb__p/BUILD/tmp/rpm-tmp.TVFwfu
  • error 4
  • /usr/include/c++/12.2.0/bits/stl_relops.h:86:5: error: template with C linkage
  • error 5
  • /usr/include/c++/12.2.0/bits/stl_relops.h:99:5: error: template with C linkage
  • error 6
  • /usr/include/c++/12.2.0/bits/stl_relops.h:112:5: error: template with C linkage
  • error 7
  • /usr/include/c++/12.2.0/bits/stl_relops.h:125:5: error: template with C linkage
  • error 8
  • /usr/include/c++/12.2.0/utility:90:3: error: template with C linkage
  • error 9
  • make[2]: *** [CMakeFiles/domoticz.dir/build.make:368: CMakeFiles/domoticz.dir/main/LuaTable.cpp.o] Error 1
  • error 10
  • make[1]: *** [CMakeFiles/Makefile2:88: CMakeFiles/domoticz.dir/all] Error 2
  • error 11
  • error: Bad exit status from /tmp/B.kaosb__p/BUILD/tmp/rpm-tmp.TVFwfu (%build)
  • error 12
  • RPM build errors:
  • error 13
  • error: No files produced.

Content:

checking if we should skip the build
started at: Thu Nov  3 12:08:56 2022
killing old processes on a builder
sending signal 9 to pid -1
cleaning up /tmp
fetching https://srcbuilder.pld-linux.org/th//srpms/426cc370-772d-4020-8e96-e89511700d0b/domoticz-2022.1-2.src.rpm
fetched 12740459 bytes, 10316.7 K/s
installing srpm: domoticz-2022.1-2.src.rpm
+ install -d /tmp/B.kaosb__p/BUILD /tmp/B.kaosb__p/RPMS
+ LC_ALL=en_US.UTF-8
+ rpm -qp --changelog domoticz-2022.1-2.src.rpm
* Thu Nov 03 2022 PLD Linux Team <feedback@pld-linux.org>
- For complete changelog see: http://git.pld-linux.org/?p=packages/domoticz.git;a=log;h=master
* Fri Jun 03 2022 Jan Palus <atler@pld-linux.org> 8708f6e
- boost rebuild * Mon Jan 31 2022 Jan Palus <atler@pld-linux.org> 3a1bb43
- use regular config file instead of number of cmdline options * Mon Jan 31 2022 Jan Palus <atler@pld-linux.org> cd9dc7e
- up to 2022.1 * Sat Jan 15 2022 Jan Palus <atler@pld-linux.org> f47f415
- boost rebuild * Thu Dec 30 2021 Jan Palus <atler@pld-linux.org> f3eaf22
- drop correct user/group in %postun; rel 6 * Fri Sep 24 2021 Jan Rękorajski <baggins@pld-linux.org> bb35d9a
- rebuild with openssl 3.0.0 * Fri Aug 20 2021 Krzysztof Mrozowicz <mrozowik@pld-linux.org> 501a9ce
- relup, rebuild with libfmt-8 * Mon Aug 09 2021 Jan Palus <atler@pld-linux.org> 969d4d8
- boost rebuild * Fri Apr 23 2021 Jan Palus <atler@pld-linux.org> d5409dc
- order systemd unit after time-sync.target * Tue Apr 20 2021 Jan Palus <atler@pld-linux.org> 42c6418
- rel 2 * Tue Apr 20 2021 Jan Palus <atler@pld-linux.org> 4f49453
- missing BuildRoot declaration * Tue Apr 20 2021 Jan Palus <atler@pld-linux.org> 77898df
- suggest python3-libs for python plugin (dynamically loaded libpython3*.so*) * Tue Apr 20 2021 Jan Palus <atler@pld-linux.org> 109876d
- make python patch sane * Tue Apr 20 2021 Jan Palus <atler@pld-linux.org> 449945a
- fix systemd unit ordering * Sat Apr 17 2021 Jan Palus <atler@pld-linux.org> 4056345
- updated source url * Sat Apr 17 2021 Jan Palus <atler@pld-linux.org> 9a71e0c
- up to 2021.1 * Sat Apr 10 2021 Jan Palus <atler@pld-linux.org> e7e8ea2
- disable auto updates * Sat Apr 10 2021 Jan Palus <atler@pld-linux.org> a1c25c4
- grant access to i2c group * Fri Apr 09 2021 Jan Palus <atler@pld-linux.org> e9c3240
- use distribution packaged OpenSans font * Fri Apr 09 2021 Jan Palus <atler@pld-linux.org> 2fd2c1d
- fix build with python 3.9 + rpm -Uhv --nodeps --define '_topdir /tmp/B.kaosb__p' --define '_specdir %{_topdir}' --define '_sourcedir %{_specdir}' --define '_rpmdir %{_topdir}/RPMS' --define '_builddir %{_topdir}/BUILD' domoticz-2022.1-2.src.rpm Updating / installing... domoticz-2022.1-2 ######################################## + rm -f domoticz-2022.1-2.src.rpm + install -m 700 -d /tmp/B.kaosb__p/BUILD/tmp + TMPDIR=/tmp/B.kaosb__p/BUILD/tmp + exec nice -n 0 rpmbuild -bp --short-circuit --nodeps --define '_topdir /tmp/B.kaosb__p' --define '_specdir %{_topdir}' --define '_sourcedir %{_specdir}' --define '_rpmdir %{_topdir}/RPMS' --define '_builddir %{_topdir}/BUILD' --target i686-pld-linux --define 'prep exit 0' /tmp/B.kaosb__p/domoticz.spec warning: Could not canonicalize hostname: nereid Building target platforms: i686-pld-linux Building for target i686-pld-linux RPM build warnings: Could not canonicalize hostname: nereid checking BuildConflict-ing packages rpm: warning: Could not canonicalize hostname: nereid rpm: error: Failed build dependencies: rpm: cmake >= 3.16.0 is needed by domoticz-2022.1-2.i686 rpm: Building target platforms: i686-pld-linux rpm: Building for target i686-pld-linux rpm: rpm: RPM build warnings: rpm: Could not canonicalize hostname: nereid no BuildConflicts found checking BR rpm: warning: Could not canonicalize hostname: nereid rpm: error: Failed build dependencies: rpm: cmake >= 3.16.0 is needed by domoticz-2022.1-2.i686 rpm: Building target platforms: i686-pld-linux rpm: Building for target i686-pld-linux rpm: rpm: RPM build warnings: rpm: Could not canonicalize hostname: nereid updating poldek cache... ready is up to date th is up to date th is up to date th-ready is up to date th-ready is up to date Retrieving diff::packages.ndir.2022.11.03-10.28.02.gz......................................done Loading [pndir]th-test... Applying packages.ndir.2022.11.03-10.28.02.gz... Applying packages.ndir.2022.11.03-11.04.02.gz... Writing /root/.cache/poldek/[...]/packages.ndir.gz... Loading [pndir]th-test... Applying packages.ndir.2022.11.03-10.28.02.gz... Writing /root/.cache/poldek/[...]/packages.ndir.gz... checking conflicting packages in BRed packages poldek: Loading [pndir]ready... poldek: Loading [pndir]th-test... poldek: Loading [pndir]th-test... poldek: Loading [pndir]th-ready... poldek: Loading [pndir]th-ready... poldek: Loading [pndir]th... poldek: Loading [pndir]th... poldek: 34646 packages read poldek: Removed 4318 duplicate packages from available set poldek: Processing dependencies... poldek: There are 1 package to install: poldek: A cmake-3.24.3-1 poldek: This operation will use 43.9MB of disk space. poldek: Need to get 12.1MB of archives. poldek: cmake-3.24.3-1.i686.rpm: digests OK poldek: Executing pm-command.sh --upgrade -vh --test --root / --define _check_dirname_deps 0... poldek: Verifying... ######################################## poldek: Preparing... ######################################## no conflicts found checking BR rpm: warning: Could not canonicalize hostname: nereid rpm: error: Failed build dependencies: rpm: cmake >= 3.16.0 is needed by domoticz-2022.1-2.i686 rpm: Building target platforms: i686-pld-linux rpm: Building for target i686-pld-linux rpm: rpm: RPM build warnings: rpm: Could not canonicalize hostname: nereid installing BR: cmake + poldek --noask --caplookup -Q -v '--ignore=hhvm-*' '--ignore=php4-*' '--ignore=php52-*' '--ignore=php54-*' '--ignore=php55-*' '--ignore=php56-*' '--ignore=php70-*' '--ignore=php71-*' '--ignore=php72-*' '--ignore=php73-*' '--ignore=php74-*' '--ignore=php80-*' '--ignore=php81-*' '--ignore=php82-*' --upgrade cmake Loading [pndir]ready... Loading [pndir]th-test... Loading [pndir]th-test... Loading [pndir]th-ready... Loading [pndir]th-ready... Loading [pndir]th... Loading [pndir]th... 34646 packages read Removed 4318 duplicate packages from available set Processing dependencies... There are 1 package to install: A cmake-3.24.3-1 This operation will use 43.9MB of disk space. Need to get 12.1MB of archives. cmake-3.24.3-1.i686.rpm: digests OK Executing pm-command.sh --upgrade -vh --root / --define _check_dirname_deps 0... Verifying... ######################################## Preparing... ######################################## Updating / installing... cmake-3.24.3-1 ######################################## building RPM using: set -ex; : build-id: 426cc370-772d-4020-8e96-e89511700d0b; TMPDIR=/tmp/B.kaosb__p/BUILD/tmp exec nice -n 0 rpmbuild -bb --define '__jobs 28' --define '_smp_mflags -j28' --define '_make_opts -Otarget' --define '_pld_builder 1' --define '_topdir /tmp/B.kaosb__p' --define '_specdir %{_topdir}' --define '_sourcedir %{_specdir}' --define '_rpmdir %{_topdir}/RPMS' --define '_builddir %{_topdir}/BUILD' --target i686-pld-linux /tmp/B.kaosb__p/domoticz.spec + : build-id: 426cc370-772d-4020-8e96-e89511700d0b + TMPDIR=/tmp/B.kaosb__p/BUILD/tmp + exec nice -n 0 rpmbuild -bb --define '__jobs 28' --define '_smp_mflags -j28' --define '_make_opts -Otarget' --define '_pld_builder 1' --define '_topdir /tmp/B.kaosb__p' --define '_specdir %{_topdir}' --define '_sourcedir %{_specdir}' --define '_rpmdir %{_topdir}/RPMS' --define '_builddir %{_topdir}/BUILD' --target i686-pld-linux /tmp/B.kaosb__p/domoticz.spec warning: Could not canonicalize hostname: nereid Building target platforms: i686-pld-linux Building for target i686-pld-linux Executing(%prep): /bin/sh -e /tmp/B.kaosb__p/BUILD/tmp/rpm-tmp.HK4dHy + umask 022 + cd /tmp/B.kaosb__p/BUILD + cd /tmp/B.kaosb__p/BUILD + rm -rf domoticz-2022.1 + /bin/gzip -dc /tmp/B.kaosb__p/domoticz-2022.1.tar.gz + /bin/tar -xof - + STATUS=0 + '[' 0 -ne 0 ']' + cd domoticz-2022.1 + /bin/chmod -Rf a+rX,u+w,g-w,o-w . + echo 'Patch #0 (domoticz-tinyxpath.patch):' Patch #0 (domoticz-tinyxpath.patch): + </tmp/B.kaosb__p/domoticz-tinyxpath.patch + /usr/bin/patch -s -f -p1 '--fuzz=0' + echo 'Patch #1 (domoticz-python.patch):' Patch #1 (domoticz-python.patch): + </tmp/B.kaosb__p/domoticz-python.patch + /usr/bin/patch -s -f -p1 '--fuzz=0' + echo 'Patch #2 (no-git.patch):' Patch #2 (no-git.patch): + </tmp/B.kaosb__p/no-git.patch + /usr/bin/patch -s -f -p1 '--fuzz=0' + echo 'Patch #3 (domoticz-no_updates.patch):' Patch #3 (domoticz-no_updates.patch): + </tmp/B.kaosb__p/domoticz-no_updates.patch + /usr/bin/patch -s -f -p1 '--fuzz=0' + echo 'Patch #4 (strstr.patch):' Patch #4 (strstr.patch): + </tmp/B.kaosb__p/strstr.patch + /usr/bin/patch -s -f -p1 '--fuzz=0' + echo 'Patch #5 (config.patch):' Patch #5 (config.patch): + </tmp/B.kaosb__p/config.patch + /usr/bin/patch -s -f -p1 '--fuzz=0' + APPVERSION=2022.1 + >appversion.h + echo '#define APPVERSION 1' + >>appversion.h + echo '#define APPHASH "%{snap}"' + date '--date=Thu Nov 03 2022' +%s + APPDATE=1667430000 + >>appversion.h + echo '#define APPDATE 1667430000' + /bin/rm '--interactive=never' -r extern tinyxpath + RPM_EC=0 + jobs -p + exit 0 Executing(%build): /bin/sh -e /tmp/B.kaosb__p/BUILD/tmp/rpm-tmp.TVFwfu TMP=/home/users/builder/tmp HOME=/home/users/builder PATH=/home/users/builder/GNUstep/Tools:/bin:/usr/bin:/usr/local/bin:/home/users/builder/bin TMPDIR=/tmp/B.kaosb__p/BUILD/tmp + umask 022 + cd /tmp/B.kaosb__p/BUILD + cd domoticz-2022.1 + install -d build + cd build + export 'CXXFLAGS=-O2 -fwrapv -pipe -Wformat -Werror=format-security -gdwarf-4 -fno-debug-types-section -fvar-tracking-assignments -g2 -Wp,-D_FORTIFY_SOURCE=2 -fstack-protector-strong --param=ssp-buffer-size=4 -Werror=trampolines -fomit-frame-pointer -march=i686 -fasynchronous-unwind-tables -mtune=pentium4 -gdwarf-4 -fno-debug-types-section -fvar-tracking-assignments -g2 -DPYTHON_LIBDIR=\"/usr/lib\"' + CC=i686-pld-linux-gcc CXX=i686-pld-linux-g++ CPPFLAGS='' /usr/bin/cmake '-DCMAKE_VERBOSE_MAKEFILE:BOOL=ON' '-DCMAKE_BUILD_TYPE=PLD' '-DCMAKE_INSTALL_BINDIR:PATH=/usr/bin' '-DCMAKE_INSTALL_SBINDIR:PATH=/usr/sbin' '-DCMAKE_INSTALL_LIBEXECDIR:PATH=/usr/libexec' '-DCMAKE_INSTALL_SYSCONFDIR:PATH=/etc' '-DCMAKE_INSTALL_SHAREDSTATEDIRPATH:PATH=/var/lib' '-DCMAKE_INSTALL_LOCALSTATEDIRPATH:PATH=/var' '-DCMAKE_INSTALL_LIBDIR:PATH=/usr/lib' '-DCMAKE_INSTALL_INCLUDEDIR:PATH=/usr/include' '-DCMAKE_INSTALL_OLDINCLUDEDIR:PATH=/usr/include' '-DCMAKE_INSTALL_DATAROOTDIR:PATH=/usr/share' '-DCMAKE_INSTALL_DATADIR:PATH=/usr/share' '-DCMAKE_INSTALL_INFODIR:PATH=/usr/share/info' '-DCMAKE_INSTALL_LOCALEDIR:PATH=/usr/share/locale' '-DCMAKE_INSTALL_MANDIR:PATH=/usr/share/man' '-DCMAKE_INSTALL_DOCDIR:PATH=/usr/share/doc' '-DCMAKE_INSTALL_PREFIX:PATH=/usr' '-DSYSCONF_INSTALL_DIR:PATH=/etc' '-DCMAKE_CXX_FLAGS_PLD=-O2 -fwrapv -pipe -Wformat -Werror=format-security -gdwarf-4 -fno-debug-types-section -fvar-tracking-assignments -g2 -Wp,-D_FORTIFY_SOURCE=2 -fstack-protector-strong --param=ssp-buffer-size=4 -Werror=trampolines -fomit-frame-pointer -march=i686 -fasynchronous-unwind-tables -mtune=pentium4 -gdwarf-4 -fno-debug-types-section -fvar-tracking-assignments -g2 -DPYTHON_LIBDIR=\"/usr/lib\"' '-DCMAKE_C_FLAGS_PLD=-O2 -fwrapv -pipe -Wformat -Werror=format-security -gdwarf-4 -fno-debug-types-section -fvar-tracking-assignments -g2 -Wp,-D_FORTIFY_SOURCE=2 -fstack-protector-strong --param=ssp-buffer-size=4 -Werror=trampolines -fomit-frame-pointer -march=i686 -fasynchronous-unwind-tables -mtune=pentium4 -gdwarf-4 -fno-debug-types-section -fvar-tracking-assignments -g2 -DNDEBUG -DQT_NO_DEBUG' '-DCMAKE_Fortran_FLAGS_PLD=-O2 -fwrapv -pipe -Wformat -Werror=format-security -gdwarf-4 -fno-debug-types-section -fvar-tracking-assignments -g2 -Wp,-D_FORTIFY_SOURCE=2 -fstack-protector-strong --param=ssp-buffer-size=4 -Werror=trampolines -fomit-frame-pointer -march=i686 -fasynchronous-unwind-tables -mtune=pentium4 -gdwarf-4 -fno-debug-types-section -fvar-tracking-assignments -g2 -DNDEBUG -DQT_NO_DEBUG' '-DCMAKE_EXE_LINKER_FLAGS_PLD=-Wl,--as-needed -Wl,--no-copy-dt-needed-entries -Wl,-z,relro -Wl,-z,combreloc ' '-DCMAKE_SHARED_LINKER_FLAGS_PLD=-Wl,--as-needed -Wl,--no-copy-dt-needed-entries -Wl,-z,relro -Wl,-z,combreloc ' '-DCMAKE_MODULE_LINKER_FLAGS_PLD=-Wl,--as-needed -Wl,--no-copy-dt-needed-entries -Wl,-z,relro -Wl,-z,combreloc ' '-DBUILD_SHARED_LIBS:BOOL=ON' '-DUSE_BUILTIN_JSONCPP=NO' '-DUSE_BUILTIN_MINIZIP=NO' '-DUSE_BUILTIN_MQTT=NO' '-DUSE_BUILTIN_SQLITE=NO' '-DUSE_BUILTIN_TINYXPATH=NO' '-DUSE_LUA_STATIC=NO' '-DUSE_OPENSSL_STATIC=NO' '-DUSE_STATIC_BOOST=NO' '-DUSE_STATIC_LIBSTDCXX=NO' '-DUSE_STATIC_OPENZWAVE=NO' '-DFORCE_WITH_GPIO:BOOL=TRUE' '-DCMAKE_INSTALL_PREFIX=/usr/share/domoticz' .. -- The C compiler identification is GNU 12.2.0 -- The CXX compiler identification is GNU 12.2.0 -- Detecting C compiler ABI info -- Detecting C compiler ABI info - done -- Check for working C compiler: /usr/bin/i686-pld-linux-gcc - skipped -- Detecting C compile features -- Detecting C compile features - done -- Detecting CXX compiler ABI info -- Detecting CXX compiler ABI info - done -- Check for working CXX compiler: /usr/bin/i686-pld-linux-g++ - skipped -- Detecting CXX compile features -- Detecting CXX compile features - done -- Read ProjectRevision from History.txt -- LUA library found at: /usr/lib/liblua5.3.so -- Found Python3: /usr/include/python3.10 (found suitable version "3.10.8", minimum required is "3.4") found components: Development Development.Module Development.Embed -- Python3 version 3.10.8 includes found at: /usr/include/python3.10 -- Looking for execinfo.h -- Looking for execinfo.h - found -- Looking for 3 include files sys/types.h, ..., linux/i2c.h -- Looking for 3 include files sys/types.h, ..., linux/i2c.h - found -- Building with I2C support -- Looking for include files sys/types.h, linux/spi/spidev.h -- Looking for include files sys/types.h, linux/spi/spidev.h - found -- Building with SPI support -- ########################### -- Compiling Revision #1 -- ########################### -- Found PkgConfig: /usr/bin/pkg-config (found version "0.29.2") -- Checking for module 'jsoncpp' -- Found jsoncpp, version 1.9.5 -- JSONCPP includes found at: /usr/include/jsoncpp -- MQTT includes found at: /usr/include -- Found SQLite3: /usr/include (found version "3.39.4") -- SQLite library found at: /usr/lib/libsqlite3.so -- SQLite includes found at: /usr/include -- Checking for module 'minizip' -- Found minizip, version 1.2.13 -- MINIZIP includes found at: /usr/include/minizip -- Found OpenSSL: /usr/lib/libcrypto.so (found version "3.0.7") -- OPENSSL library found at: /usr/lib/libssl.so;/usr/lib/libcrypto.so -- Linking against boost dynamic libraries -- Performing Test CMAKE_HAVE_LIBC_PTHREAD -- Performing Test CMAKE_HAVE_LIBC_PTHREAD - Success -- Found Threads: TRUE -- Found Boost: /usr/include (found version "1.79.0") found components: thread system chrono atomic -- BOOST includes found at: /usr/include -- Found ZLIB: /usr/lib/libz.so (found version "1.2.13") -- ZLIB library found at: /usr/lib/libz.so -- ZLIB includes found at: /usr/include -- Found CURL: /usr/lib/libcurl.so (found version "7.86.0") -- Curl library found at: /usr/lib/libcurl.so -- Curl includes found at: /usr/include -- CEREAL includes found at: /usr/include -- Found LIBUSB: /usr/lib/libusb.so -- LIBUSB library found at: /usr/lib/libusb.so -- TinyXML found at: tinyxml -- TinyXPath found -- Checking for module 'libopenzwave' -- Found libopenzwave, version 1.6 -- ==== OpenZWave package found! -- OpenZWavelibraryfoundat:/usr/lib/libopenzwave.so -- OpenZWave library found at: /usr/lib/libopenzwave.so -- OpenZWave includes found at: /usr/include/openzwave// -- GPIO is available -- Not found telldus-core (telldus-core.h), not adding tellstick support -- Using precompiled headers -- Using dynamic libgcc_s/libstdc++ -- Configuring done -- Generating done CMake Warning: Manually-specified variables were not used by the project: CMAKE_Fortran_FLAGS_PLD CMAKE_INSTALL_BINDIR CMAKE_INSTALL_DATADIR CMAKE_INSTALL_DATAROOTDIR CMAKE_INSTALL_DOCDIR CMAKE_INSTALL_INCLUDEDIR CMAKE_INSTALL_INFODIR CMAKE_INSTALL_LIBDIR CMAKE_INSTALL_LIBEXECDIR CMAKE_INSTALL_LOCALEDIR CMAKE_INSTALL_LOCALSTATEDIRPATH CMAKE_INSTALL_MANDIR CMAKE_INSTALL_OLDINCLUDEDIR CMAKE_INSTALL_SBINDIR CMAKE_INSTALL_SHAREDSTATEDIRPATH CMAKE_INSTALL_SYSCONFDIR SYSCONF_INSTALL_DIR -- Build files have been written to: /tmp/B.kaosb__p/BUILD/domoticz-2022.1/build + /usr/bin/make -Otarget -j28 /usr/bin/cmake -S/tmp/B.kaosb__p/BUILD/domoticz-2022.1 -B/tmp/B.kaosb__p/BUILD/domoticz-2022.1/build --check-build-system CMakeFiles/Makefile.cmake 0 /usr/bin/cmake -E cmake_progress_start /tmp/B.kaosb__p/BUILD/domoticz-2022.1/build/CMakeFiles /tmp/B.kaosb__p/BUILD/domoticz-2022.1/build//CMakeFiles/progress.marks /usr/bin/make -f CMakeFiles/Makefile2 all /usr/bin/make -f CMakeFiles/revisiontag.dir/build.make CMakeFiles/revisiontag.dir/depend make[2]: Entering directory '/tmp/B.kaosb__p/BUILD/domoticz-2022.1/build' cd /tmp/B.kaosb__p/BUILD/domoticz-2022.1/build && /usr/bin/cmake -E cmake_depends "Unix Makefiles" /tmp/B.kaosb__p/BUILD/domoticz-2022.1 /tmp/B.kaosb__p/BUILD/domoticz-2022.1 /tmp/B.kaosb__p/BUILD/domoticz-2022.1/build /tmp/B.kaosb__p/BUILD/domoticz-2022.1/build /tmp/B.kaosb__p/BUILD/domoticz-2022.1/build/CMakeFiles/revisiontag.dir/DependInfo.cmake --color= make[2]: Leaving directory '/tmp/B.kaosb__p/BUILD/domoticz-2022.1/build' /usr/bin/make -f CMakeFiles/revisiontag.dir/build.make CMakeFiles/revisiontag.dir/build make[2]: Entering directory '/tmp/B.kaosb__p/BUILD/domoticz-2022.1/build' /usr/bin/cmake -DSOURCE_DIR=/tmp/B.kaosb__p/BUILD/domoticz-2022.1 -P /tmp/B.kaosb__p/BUILD/domoticz-2022.1/getgit.cmake -- Failed to get ProjectRevision from History.txt, set it to 0 -- Failed to get ProjectHash from git, set it to 0 -- Failed to get ProjectDate from git, set it to 0 make[2]: Leaving directory '/tmp/B.kaosb__p/BUILD/domoticz-2022.1/build' make[1]: Entering directory '/tmp/B.kaosb__p/BUILD/domoticz-2022.1/build' [ 0%] Built target revisiontag make[1]: Leaving directory '/tmp/B.kaosb__p/BUILD/domoticz-2022.1/build' /usr/bin/make -f CMakeFiles/domoticz.dir/build.make CMakeFiles/domoticz.dir/depend make[2]: Entering directory '/tmp/B.kaosb__p/BUILD/domoticz-2022.1/build' cd /tmp/B.kaosb__p/BUILD/domoticz-2022.1/build && /usr/bin/cmake -E cmake_depends "Unix Makefiles" /tmp/B.kaosb__p/BUILD/domoticz-2022.1 /tmp/B.kaosb__p/BUILD/domoticz-2022.1 /tmp/B.kaosb__p/BUILD/domoticz-2022.1/build /tmp/B.kaosb__p/BUILD/domoticz-2022.1/build /tmp/B.kaosb__p/BUILD/domoticz-2022.1/build/CMakeFiles/domoticz.dir/DependInfo.cmake --color= make[2]: Leaving directory '/tmp/B.kaosb__p/BUILD/domoticz-2022.1/build' /usr/bin/make -f CMakeFiles/domoticz.dir/build.make CMakeFiles/domoticz.dir/build make[2]: Entering directory '/tmp/B.kaosb__p/BUILD/domoticz-2022.1/build' [ 0%] Building CXX object CMakeFiles/domoticz.dir/cmake_pch.hxx.gch /usr/bin/i686-pld-linux-g++ -DENABLE_PYTHON -DHAVE_EXECINFO_H -DHAVE_LINUX_I2C -DHAVE_LINUX_SPI -DWITH_EXTERNAL_TINYXPATH -DWITH_GPIO -DWITH_LIBUSB -DWITH_OPENZWAVE -DWITH_TLS -DWWW_ENABLE_SSL -D_FILE_OFFSET_BITS=64 -I/usr/include/lua5.3 -I/usr/include/python3.10 -I/tmp/B.kaosb__p/BUILD/domoticz-2022.1/main -I/usr/include/jsoncpp -I/usr/include/minizip -I/usr/include/tinyxpath -I/usr/include/openzwave -O2 -fwrapv -pipe -Wformat -Werror=format-security -gdwarf-4 -fno-debug-types-section -fvar-tracking-assignments -g2 -Wp,-D_FORTIFY_SOURCE=2 -fstack-protector-strong --param=ssp-buffer-size=4 -Werror=trampolines -fomit-frame-pointer -march=i686 -fasynchronous-unwind-tables -mtune=pentium4 -gdwarf-4 -fno-debug-types-section -fvar-tracking-assignments -g2 -DPYTHON_LIBDIR=\"/usr/lib\" -Wno-psabi -rdynamic -O2 -fwrapv -pipe -Wformat -Werror=format-security -gdwarf-4 -fno-debug-types-section -fvar-tracking-assignments -g2 -Wp,-D_FORTIFY_SOURCE=2 -fstack-protector-strong --param=ssp-buffer-size=4 -Werror=trampolines -fomit-frame-pointer -march=i686 -fasynchronous-unwind-tables -mtune=pentium4 -gdwarf-4 -fno-debug-types-section -fvar-tracking-assignments -g2 -DPYTHON_LIBDIR=\"/usr/lib\" -std=c++14 -Winvalid-pch -x c++-header -include /tmp/B.kaosb__p/BUILD/domoticz-2022.1/build/CMakeFiles/domoticz.dir/cmake_pch.hxx -MD -MT CMakeFiles/domoticz.dir/cmake_pch.hxx.gch -MF CMakeFiles/domoticz.dir/cmake_pch.hxx.gch.d -o CMakeFiles/domoticz.dir/cmake_pch.hxx.gch -c /tmp/B.kaosb__p/BUILD/domoticz-2022.1/build/CMakeFiles/domoticz.dir/cmake_pch.hxx.cxx make[2]: Leaving directory '/tmp/B.kaosb__p/BUILD/domoticz-2022.1/build' make[2]: Entering directory '/tmp/B.kaosb__p/BUILD/domoticz-2022.1/build' [ 1%] Building CXX object CMakeFiles/domoticz.dir/main/stdafx.cpp.o /usr/bin/i686-pld-linux-g++ -DENABLE_PYTHON -DHAVE_EXECINFO_H -DHAVE_LINUX_I2C -DHAVE_LINUX_SPI -DWITH_EXTERNAL_TINYXPATH -DWITH_GPIO -DWITH_LIBUSB -DWITH_OPENZWAVE -DWITH_TLS -DWWW_ENABLE_SSL -D_FILE_OFFSET_BITS=64 -I/usr/include/lua5.3 -I/usr/include/python3.10 -I/tmp/B.kaosb__p/BUILD/domoticz-2022.1/main -I/usr/include/jsoncpp -I/usr/include/minizip -I/usr/include/tinyxpath -I/usr/include/openzwave -O2 -fwrapv -pipe -Wformat -Werror=format-security -gdwarf-4 -fno-debug-types-section -fvar-tracking-assignments -g2 -Wp,-D_FORTIFY_SOURCE=2 -fstack-protector-strong --param=ssp-buffer-size=4 -Werror=trampolines -fomit-frame-pointer -march=i686 -fasynchronous-unwind-tables -mtune=pentium4 -gdwarf-4 -fno-debug-types-section -fvar-tracking-assignments -g2 -DPYTHON_LIBDIR=\"/usr/lib\" -Wno-psabi -rdynamic -O2 -fwrapv -pipe -Wformat -Werror=format-security -gdwarf-4 -fno-debug-types-section -fvar-tracking-assignments -g2 -Wp,-D_FORTIFY_SOURCE=2 -fstack-protector-strong --param=ssp-buffer-size=4 -Werror=trampolines -fomit-frame-pointer -march=i686 -fasynchronous-unwind-tables -mtune=pentium4 -gdwarf-4 -fno-debug-types-section -fvar-tracking-assignments -g2 -DPYTHON_LIBDIR=\"/usr/lib\" -std=c++14 -Winvalid-pch -include /tmp/B.kaosb__p/BUILD/domoticz-2022.1/build/CMakeFiles/domoticz.dir/cmake_pch.hxx -MD -MT CMakeFiles/domoticz.dir/main/stdafx.cpp.o -MF CMakeFiles/domoticz.dir/main/stdafx.cpp.o.d -o CMakeFiles/domoticz.dir/main/stdafx.cpp.o -c /tmp/B.kaosb__p/BUILD/domoticz-2022.1/main/stdafx.cpp make[2]: Leaving directory '/tmp/B.kaosb__p/BUILD/domoticz-2022.1/build' make[2]: Entering directory '/tmp/B.kaosb__p/BUILD/domoticz-2022.1/build' [ 9%] Building CXX object CMakeFiles/domoticz.dir/main/NotificationObserver.cpp.o /usr/bin/i686-pld-linux-g++ -DENABLE_PYTHON -DHAVE_EXECINFO_H -DHAVE_LINUX_I2C -DHAVE_LINUX_SPI -DWITH_EXTERNAL_TINYXPATH -DWITH_GPIO -DWITH_LIBUSB -DWITH_OPENZWAVE -DWITH_TLS -DWWW_ENABLE_SSL -D_FILE_OFFSET_BITS=64 -I/usr/include/lua5.3 -I/usr/include/python3.10 -I/tmp/B.kaosb__p/BUILD/domoticz-2022.1/main -I/usr/include/jsoncpp -I/usr/include/minizip -I/usr/include/tinyxpath -I/usr/include/openzwave -O2 -fwrapv -pipe -Wformat -Werror=format-security -gdwarf-4 -fno-debug-types-section -fvar-tracking-assignments -g2 -Wp,-D_FORTIFY_SOURCE=2 -fstack-protector-strong --param=ssp-buffer-size=4 -Werror=trampolines -fomit-frame-pointer -march=i686 -fasynchronous-unwind-tables -mtune=pentium4 -gdwarf-4 -fno-debug-types-section -fvar-tracking-assignments -g2 -DPYTHON_LIBDIR=\"/usr/lib\" -Wno-psabi -rdynamic -O2 -fwrapv -pipe -Wformat -Werror=format-security -gdwarf-4 -fno-debug-types-section -fvar-tracking-assignments -g2 -Wp,-D_FORTIFY_SOURCE=2 -fstack-protector-strong --param=ssp-buffer-size=4 -Werror=trampolines -fomit-frame-pointer -march=i686 -fasynchronous-unwind-tables -mtune=pentium4 -gdwarf-4 -fno-debug-types-section -fvar-tracking-assignments -g2 -DPYTHON_LIBDIR=\"/usr/lib\" -std=c++14 -Winvalid-pch -include /tmp/B.kaosb__p/BUILD/domoticz-2022.1/build/CMakeFiles/domoticz.dir/cmake_pch.hxx -MD -MT CMakeFiles/domoticz.dir/main/NotificationObserver.cpp.o -MF CMakeFiles/domoticz.dir/main/NotificationObserver.cpp.o.d -o CMakeFiles/domoticz.dir/main/NotificationObserver.cpp.o -c /tmp/B.kaosb__p/BUILD/domoticz-2022.1/main/NotificationObserver.cpp make[2]: Leaving directory '/tmp/B.kaosb__p/BUILD/domoticz-2022.1/build' make[2]: Entering directory '/tmp/B.kaosb__p/BUILD/domoticz-2022.1/build' [ 12%] Building CXX object CMakeFiles/domoticz.dir/main/TrendCalculator.cpp.o /usr/bin/i686-pld-linux-g++ -DENABLE_PYTHON -DHAVE_EXECINFO_H -DHAVE_LINUX_I2C -DHAVE_LINUX_SPI -DWITH_EXTERNAL_TINYXPATH -DWITH_GPIO -DWITH_LIBUSB -DWITH_OPENZWAVE -DWITH_TLS -DWWW_ENABLE_SSL -D_FILE_OFFSET_BITS=64 -I/usr/include/lua5.3 -I/usr/include/python3.10 -I/tmp/B.kaosb__p/BUILD/domoticz-2022.1/main -I/usr/include/jsoncpp -I/usr/include/minizip -I/usr/include/tinyxpath -I/usr/include/openzwave -O2 -fwrapv -pipe -Wformat -Werror=format-security -gdwarf-4 -fno-debug-types-section -fvar-tracking-assignments -g2 -Wp,-D_FORTIFY_SOURCE=2 -fstack-protector-strong --param=ssp-buffer-size=4 -Werror=trampolines -fomit-frame-pointer -march=i686 -fasynchronous-unwind-tables -mtune=pentium4 -gdwarf-4 -fno-debug-types-section -fvar-tracking-assignments -g2 -DPYTHON_LIBDIR=\"/usr/lib\" -Wno-psabi -rdynamic -O2 -fwrapv -pipe -Wformat -Werror=format-security -gdwarf-4 -fno-debug-types-section -fvar-tracking-assignments -g2 -Wp,-D_FORTIFY_SOURCE=2 -fstack-protector-strong --param=ssp-buffer-size=4 -Werror=trampolines -fomit-frame-pointer -march=i686 -fasynchronous-unwind-tables -mtune=pentium4 -gdwarf-4 -fno-debug-types-section -fvar-tracking-assignments -g2 -DPYTHON_LIBDIR=\"/usr/lib\" -std=c++14 -Winvalid-pch -include /tmp/B.kaosb__p/BUILD/domoticz-2022.1/build/CMakeFiles/domoticz.dir/cmake_pch.hxx -MD -MT CMakeFiles/domoticz.dir/main/TrendCalculator.cpp.o -MF CMakeFiles/domoticz.dir/main/TrendCalculator.cpp.o.d -o CMakeFiles/domoticz.dir/main/TrendCalculator.cpp.o -c /tmp/B.kaosb__p/BUILD/domoticz-2022.1/main/TrendCalculator.cpp make[2]: Leaving directory '/tmp/B.kaosb__p/BUILD/domoticz-2022.1/build' make[2]: Entering directory '/tmp/B.kaosb__p/BUILD/domoticz-2022.1/build' [ 6%] Building CXX object CMakeFiles/domoticz.dir/main/json_helper.cpp.o /usr/bin/i686-pld-linux-g++ -DENABLE_PYTHON -DHAVE_EXECINFO_H -DHAVE_LINUX_I2C -DHAVE_LINUX_SPI -DWITH_EXTERNAL_TINYXPATH -DWITH_GPIO -DWITH_LIBUSB -DWITH_OPENZWAVE -DWITH_TLS -DWWW_ENABLE_SSL -D_FILE_OFFSET_BITS=64 -I/usr/include/lua5.3 -I/usr/include/python3.10 -I/tmp/B.kaosb__p/BUILD/domoticz-2022.1/main -I/usr/include/jsoncpp -I/usr/include/minizip -I/usr/include/tinyxpath -I/usr/include/openzwave -O2 -fwrapv -pipe -Wformat -Werror=format-security -gdwarf-4 -fno-debug-types-section -fvar-tracking-assignments -g2 -Wp,-D_FORTIFY_SOURCE=2 -fstack-protector-strong --param=ssp-buffer-size=4 -Werror=trampolines -fomit-frame-pointer -march=i686 -fasynchronous-unwind-tables -mtune=pentium4 -gdwarf-4 -fno-debug-types-section -fvar-tracking-assignments -g2 -DPYTHON_LIBDIR=\"/usr/lib\" -Wno-psabi -rdynamic -O2 -fwrapv -pipe -Wformat -Werror=format-security -gdwarf-4 -fno-debug-types-section -fvar-tracking-assignments -g2 -Wp,-D_FORTIFY_SOURCE=2 -fstack-protector-strong --param=ssp-buffer-size=4 -Werror=trampolines -fomit-frame-pointer -march=i686 -fasynchronous-unwind-tables -mtune=pentium4 -gdwarf-4 -fno-debug-types-section -fvar-tracking-assignments -g2 -DPYTHON_LIBDIR=\"/usr/lib\" -std=c++14 -Winvalid-pch -include /tmp/B.kaosb__p/BUILD/domoticz-2022.1/build/CMakeFiles/domoticz.dir/cmake_pch.hxx -MD -MT CMakeFiles/domoticz.dir/main/json_helper.cpp.o -MF CMakeFiles/domoticz.dir/main/json_helper.cpp.o.d -o CMakeFiles/domoticz.dir/main/json_helper.cpp.o -c /tmp/B.kaosb__p/BUILD/domoticz-2022.1/main/json_helper.cpp make[2]: Leaving directory '/tmp/B.kaosb__p/BUILD/domoticz-2022.1/build' make[2]: Entering directory '/tmp/B.kaosb__p/BUILD/domoticz-2022.1/build' [ 8%] Building CXX object CMakeFiles/domoticz.dir/main/LuaTable.cpp.o /usr/bin/i686-pld-linux-g++ -DENABLE_PYTHON -DHAVE_EXECINFO_H -DHAVE_LINUX_I2C -DHAVE_LINUX_SPI -DWITH_EXTERNAL_TINYXPATH -DWITH_GPIO -DWITH_LIBUSB -DWITH_OPENZWAVE -DWITH_TLS -DWWW_ENABLE_SSL -D_FILE_OFFSET_BITS=64 -I/usr/include/lua5.3 -I/usr/include/python3.10 -I/tmp/B.kaosb__p/BUILD/domoticz-2022.1/main -I/usr/include/jsoncpp -I/usr/include/minizip -I/usr/include/tinyxpath -I/usr/include/openzwave -O2 -fwrapv -pipe -Wformat -Werror=format-security -gdwarf-4 -fno-debug-types-section -fvar-tracking-assignments -g2 -Wp,-D_FORTIFY_SOURCE=2 -fstack-protector-strong --param=ssp-buffer-size=4 -Werror=trampolines -fomit-frame-pointer -march=i686 -fasynchronous-unwind-tables -mtune=pentium4 -gdwarf-4 -fno-debug-types-section -fvar-tracking-assignments -g2 -DPYTHON_LIBDIR=\"/usr/lib\" -Wno-psabi -rdynamic -O2 -fwrapv -pipe -Wformat -Werror=format-security -gdwarf-4 -fno-debug-types-section -fvar-tracking-assignments -g2 -Wp,-D_FORTIFY_SOURCE=2 -fstack-protector-strong --param=ssp-buffer-size=4 -Werror=trampolines -fomit-frame-pointer -march=i686 -fasynchronous-unwind-tables -mtune=pentium4 -gdwarf-4 -fno-debug-types-section -fvar-tracking-assignments -g2 -DPYTHON_LIBDIR=\"/usr/lib\" -std=c++14 -Winvalid-pch -include /tmp/B.kaosb__p/BUILD/domoticz-2022.1/build/CMakeFiles/domoticz.dir/cmake_pch.hxx -MD -MT CMakeFiles/domoticz.dir/main/LuaTable.cpp.o -MF CMakeFiles/domoticz.dir/main/LuaTable.cpp.o.d -o CMakeFiles/domoticz.dir/main/LuaTable.cpp.o -c /tmp/B.kaosb__p/BUILD/domoticz-2022.1/main/LuaTable.cpp In file included from /usr/include/c++/12.2.0/utility:68, from /tmp/B.kaosb__p/BUILD/domoticz-2022.1/main/LuaTable.cpp:10: /usr/include/c++/12.2.0/bits/stl_relops.h:86:5: error: template with C linkage 86 | template <class _Tp> | ^~~~~~~~ /tmp/B.kaosb__p/BUILD/domoticz-2022.1/main/LuaTable.cpp:5:1: note: 'extern "C"' linkage started here 5 | extern "C" { | ^~~~~~~~~~ /usr/include/c++/12.2.0/bits/stl_relops.h:99:5: error: template with C linkage 99 | template <class _Tp> | ^~~~~~~~ /tmp/B.kaosb__p/BUILD/domoticz-2022.1/main/LuaTable.cpp:5:1: note: 'extern "C"' linkage started here 5 | extern "C" { | ^~~~~~~~~~ /usr/include/c++/12.2.0/bits/stl_relops.h:112:5: error: template with C linkage 112 | template <class _Tp> | ^~~~~~~~ /tmp/B.kaosb__p/BUILD/domoticz-2022.1/main/LuaTable.cpp:5:1: note: 'extern "C"' linkage started here 5 | extern "C" { | ^~~~~~~~~~ /usr/include/c++/12.2.0/bits/stl_relops.h:125:5: error: template with C linkage 125 | template <class _Tp> | ^~~~~~~~ /tmp/B.kaosb__p/BUILD/domoticz-2022.1/main/LuaTable.cpp:5:1: note: 'extern "C"' linkage started here 5 | extern "C" { | ^~~~~~~~~~ /usr/include/c++/12.2.0/utility:90:3: error: template with C linkage 90 | template <typename _Tp, typename _Up = _Tp> | ^~~~~~~~ /tmp/B.kaosb__p/BUILD/domoticz-2022.1/main/LuaTable.cpp:5:1: note: 'extern "C"' linkage started here 5 | extern "C" { | ^~~~~~~~~~ make[2]: *** [CMakeFiles/domoticz.dir/build.make:368: CMakeFiles/domoticz.dir/main/LuaTable.cpp.o] Error 1 make[2]: Leaving directory '/tmp/B.kaosb__p/BUILD/domoticz-2022.1/build' make[2]: *** Waiting for unfinished jobs.... make[2]: Entering directory '/tmp/B.kaosb__p/BUILD/domoticz-2022.1/build' [ 11%] Building CXX object CMakeFiles/domoticz.dir/main/SunRiseSet.cpp.o /usr/bin/i686-pld-linux-g++ -DENABLE_PYTHON -DHAVE_EXECINFO_H -DHAVE_LINUX_I2C -DHAVE_LINUX_SPI -DWITH_EXTERNAL_TINYXPATH -DWITH_GPIO -DWITH_LIBUSB -DWITH_OPENZWAVE -DWITH_TLS -DWWW_ENABLE_SSL -D_FILE_OFFSET_BITS=64 -I/usr/include/lua5.3 -I/usr/include/python3.10 -I/tmp/B.kaosb__p/BUILD/domoticz-2022.1/main -I/usr/include/jsoncpp -I/usr/include/minizip -I/usr/include/tinyxpath -I/usr/include/openzwave -O2 -fwrapv -pipe -Wformat -Werror=format-security -gdwarf-4 -fno-debug-types-section -fvar-tracking-assignments -g2 -Wp,-D_FORTIFY_SOURCE=2 -fstack-protector-strong --param=ssp-buffer-size=4 -Werror=trampolines -fomit-frame-pointer -march=i686 -fasynchronous-unwind-tables -mtune=pentium4 -gdwarf-4 -fno-debug-types-section -fvar-tracking-assignments -g2 -DPYTHON_LIBDIR=\"/usr/lib\" -Wno-psabi -rdynamic -O2 -fwrapv -pipe -Wformat -Werror=format-security -gdwarf-4 -fno-debug-types-section -fvar-tracking-assignments -g2 -Wp,-D_FORTIFY_SOURCE=2 -fstack-protector-strong --param=ssp-buffer-size=4 -Werror=trampolines -fomit-frame-pointer -march=i686 -fasynchronous-unwind-tables -mtune=pentium4 -gdwarf-4 -fno-debug-types-section -fvar-tracking-assignments -g2 -DPYTHON_LIBDIR=\"/usr/lib\" -std=c++14 -Winvalid-pch -include /tmp/B.kaosb__p/BUILD/domoticz-2022.1/build/CMakeFiles/domoticz.dir/cmake_pch.hxx -MD -MT CMakeFiles/domoticz.dir/main/SunRiseSet.cpp.o -MF CMakeFiles/domoticz.dir/main/SunRiseSet.cpp.o.d -o CMakeFiles/domoticz.dir/main/SunRiseSet.cpp.o -c /tmp/B.kaosb__p/BUILD/domoticz-2022.1/main/SunRiseSet.cpp make[2]: Leaving directory '/tmp/B.kaosb__p/BUILD/domoticz-2022.1/build' make[2]: Entering directory '/tmp/B.kaosb__p/BUILD/domoticz-2022.1/build' [ 6%] Building CXX object CMakeFiles/domoticz.dir/main/localtime_r.cpp.o /usr/bin/i686-pld-linux-g++ -DENABLE_PYTHON -DHAVE_EXECINFO_H -DHAVE_LINUX_I2C -DHAVE_LINUX_SPI -DWITH_EXTERNAL_TINYXPATH -DWITH_GPIO -DWITH_LIBUSB -DWITH_OPENZWAVE -DWITH_TLS -DWWW_ENABLE_SSL -D_FILE_OFFSET_BITS=64 -I/usr/include/lua5.3 -I/usr/include/python3.10 -I/tmp/B.kaosb__p/BUILD/domoticz-2022.1/main -I/usr/include/jsoncpp -I/usr/include/minizip -I/usr/include/tinyxpath -I/usr/include/openzwave -O2 -fwrapv -pipe -Wformat -Werror=format-security -gdwarf-4 -fno-debug-types-section -fvar-tracking-assignments -g2 -Wp,-D_FORTIFY_SOURCE=2 -fstack-protector-strong --param=ssp-buffer-size=4 -Werror=trampolines -fomit-frame-pointer -march=i686 -fasynchronous-unwind-tables -mtune=pentium4 -gdwarf-4 -fno-debug-types-section -fvar-tracking-assignments -g2 -DPYTHON_LIBDIR=\"/usr/lib\" -Wno-psabi -rdynamic -O2 -fwrapv -pipe -Wformat -Werror=format-security -gdwarf-4 -fno-debug-types-section -fvar-tracking-assignments -g2 -Wp,-D_FORTIFY_SOURCE=2 -fstack-protector-strong --param=ssp-buffer-size=4 -Werror=trampolines -fomit-frame-pointer -march=i686 -fasynchronous-unwind-tables -mtune=pentium4 -gdwarf-4 -fno-debug-types-section -fvar-tracking-assignments -g2 -DPYTHON_LIBDIR=\"/usr/lib\" -std=c++14 -Winvalid-pch -include /tmp/B.kaosb__p/BUILD/domoticz-2022.1/build/CMakeFiles/domoticz.dir/cmake_pch.hxx -MD -MT CMakeFiles/domoticz.dir/main/localtime_r.cpp.o -MF CMakeFiles/domoticz.dir/main/localtime_r.cpp.o.d -o CMakeFiles/domoticz.dir/main/localtime_r.cpp.o -c /tmp/B.kaosb__p/BUILD/domoticz-2022.1/main/localtime_r.cpp make[2]: Leaving directory '/tmp/B.kaosb__p/BUILD/domoticz-2022.1/build' make[2]: Entering directory '/tmp/B.kaosb__p/BUILD/domoticz-2022.1/build' [ 8%] Building CXX object CMakeFiles/domoticz.dir/main/mosquitto_helper.cpp.o /usr/bin/i686-pld-linux-g++ -DENABLE_PYTHON -DHAVE_EXECINFO_H -DHAVE_LINUX_I2C -DHAVE_LINUX_SPI -DWITH_EXTERNAL_TINYXPATH -DWITH_GPIO -DWITH_LIBUSB -DWITH_OPENZWAVE -DWITH_TLS -DWWW_ENABLE_SSL -D_FILE_OFFSET_BITS=64 -I/usr/include/lua5.3 -I/usr/include/python3.10 -I/tmp/B.kaosb__p/BUILD/domoticz-2022.1/main -I/usr/include/jsoncpp -I/usr/include/minizip -I/usr/include/tinyxpath -I/usr/include/openzwave -O2 -fwrapv -pipe -Wformat -Werror=format-security -gdwarf-4 -fno-debug-types-section -fvar-tracking-assignments -g2 -Wp,-D_FORTIFY_SOURCE=2 -fstack-protector-strong --param=ssp-buffer-size=4 -Werror=trampolines -fomit-frame-pointer -march=i686 -fasynchronous-unwind-tables -mtune=pentium4 -gdwarf-4 -fno-debug-types-section -fvar-tracking-assignments -g2 -DPYTHON_LIBDIR=\"/usr/lib\" -Wno-psabi -rdynamic -O2 -fwrapv -pipe -Wformat -Werror=format-security -gdwarf-4 -fno-debug-types-section -fvar-tracking-assignments -g2 -Wp,-D_FORTIFY_SOURCE=2 -fstack-protector-strong --param=ssp-buffer-size=4 -Werror=trampolines -fomit-frame-pointer -march=i686 -fasynchronous-unwind-tables -mtune=pentium4 -gdwarf-4 -fno-debug-types-section -fvar-tracking-assignments -g2 -DPYTHON_LIBDIR=\"/usr/lib\" -std=c++14 -Winvalid-pch -include /tmp/B.kaosb__p/BUILD/domoticz-2022.1/build/CMakeFiles/domoticz.dir/cmake_pch.hxx -MD -MT CMakeFiles/domoticz.dir/main/mosquitto_helper.cpp.o -MF CMakeFiles/domoticz.dir/main/mosquitto_helper.cpp.o.d -o CMakeFiles/domoticz.dir/main/mosquitto_helper.cpp.o -c /tmp/B.kaosb__p/BUILD/domoticz-2022.1/main/mosquitto_helper.cpp make[2]: Leaving directory '/tmp/B.kaosb__p/BUILD/domoticz-2022.1/build' make[2]: Entering directory '/tmp/B.kaosb__p/BUILD/domoticz-2022.1/build' [ 13%] Building CXX object CMakeFiles/domoticz.dir/main/WindCalculation.cpp.o /usr/bin/i686-pld-linux-g++ -DENABLE_PYTHON -DHAVE_EXECINFO_H -DHAVE_LINUX_I2C -DHAVE_LINUX_SPI -DWITH_EXTERNAL_TINYXPATH -DWITH_GPIO -DWITH_LIBUSB -DWITH_OPENZWAVE -DWITH_TLS -DWWW_ENABLE_SSL -D_FILE_OFFSET_BITS=64 -I/usr/include/lua5.3 -I/usr/include/python3.10 -I/tmp/B.kaosb__p/BUILD/domoticz-2022.1/main -I/usr/include/jsoncpp -I/usr/include/minizip -I/usr/include/tinyxpath -I/usr/include/openzwave -O2 -fwrapv -pipe -Wformat -Werror=format-security -gdwarf-4 -fno-debug-types-section -fvar-tracking-assignments -g2 -Wp,-D_FORTIFY_SOURCE=2 -fstack-protector-strong --param=ssp-buffer-size=4 -Werror=trampolines -fomit-frame-pointer -march=i686 -fasynchronous-unwind-tables -mtune=pentium4 -gdwarf-4 -fno-debug-types-section -fvar-tracking-assignments -g2 -DPYTHON_LIBDIR=\"/usr/lib\" -Wno-psabi -rdynamic -O2 -fwrapv -pipe -Wformat -Werror=format-security -gdwarf-4 -fno-debug-types-section -fvar-tracking-assignments -g2 -Wp,-D_FORTIFY_SOURCE=2 -fstack-protector-strong --param=ssp-buffer-size=4 -Werror=trampolines -fomit-frame-pointer -march=i686 -fasynchronous-unwind-tables -mtune=pentium4 -gdwarf-4 -fno-debug-types-section -fvar-tracking-assignments -g2 -DPYTHON_LIBDIR=\"/usr/lib\" -std=c++14 -Winvalid-pch -include /tmp/B.kaosb__p/BUILD/domoticz-2022.1/build/CMakeFiles/domoticz.dir/cmake_pch.hxx -MD -MT CMakeFiles/domoticz.dir/main/WindCalculation.cpp.o -MF CMakeFiles/domoticz.dir/main/WindCalculation.cpp.o.d -o CMakeFiles/domoticz.dir/main/WindCalculation.cpp.o -c /tmp/B.kaosb__p/BUILD/domoticz-2022.1/main/WindCalculation.cpp make[2]: Leaving directory '/tmp/B.kaosb__p/BUILD/domoticz-2022.1/build' make[2]: Entering directory '/tmp/B.kaosb__p/BUILD/domoticz-2022.1/build' [ 1%] Building CXX object CMakeFiles/domoticz.dir/main/BaroForecastCalculator.cpp.o /usr/bin/i686-pld-linux-g++ -DENABLE_PYTHON -DHAVE_EXECINFO_H -DHAVE_LINUX_I2C -DHAVE_LINUX_SPI -DWITH_EXTERNAL_TINYXPATH -DWITH_GPIO -DWITH_LIBUSB -DWITH_OPENZWAVE -DWITH_TLS -DWWW_ENABLE_SSL -D_FILE_OFFSET_BITS=64 -I/usr/include/lua5.3 -I/usr/include/python3.10 -I/tmp/B.kaosb__p/BUILD/domoticz-2022.1/main -I/usr/include/jsoncpp -I/usr/include/minizip -I/usr/include/tinyxpath -I/usr/include/openzwave -O2 -fwrapv -pipe -Wformat -Werror=format-security -gdwarf-4 -fno-debug-types-section -fvar-tracking-assignments -g2 -Wp,-D_FORTIFY_SOURCE=2 -fstack-protector-strong --param=ssp-buffer-size=4 -Werror=trampolines -fomit-frame-pointer -march=i686 -fasynchronous-unwind-tables -mtune=pentium4 -gdwarf-4 -fno-debug-types-section -fvar-tracking-assignments -g2 -DPYTHON_LIBDIR=\"/usr/lib\" -Wno-psabi -rdynamic -O2 -fwrapv -pipe -Wformat -Werror=format-security -gdwarf-4 -fno-debug-types-section -fvar-tracking-assignments -g2 -Wp,-D_FORTIFY_SOURCE=2 -fstack-protector-strong --param=ssp-buffer-size=4 -Werror=trampolines -fomit-frame-pointer -march=i686 -fasynchronous-unwind-tables -mtune=pentium4 -gdwarf-4 -fno-debug-types-section -fvar-tracking-assignments -g2 -DPYTHON_LIBDIR=\"/usr/lib\" -std=c++14 -Winvalid-pch -include /tmp/B.kaosb__p/BUILD/domoticz-2022.1/build/CMakeFiles/domoticz.dir/cmake_pch.hxx -MD -MT CMakeFiles/domoticz.dir/main/BaroForecastCalculator.cpp.o -MF CMakeFiles/domoticz.dir/main/BaroForecastCalculator.cpp.o.d -o CMakeFiles/domoticz.dir/main/BaroForecastCalculator.cpp.o -c /tmp/B.kaosb__p/BUILD/domoticz-2022.1/main/BaroForecastCalculator.cpp make[2]: Leaving directory '/tmp/B.kaosb__p/BUILD/domoticz-2022.1/build' make[2]: Entering directory '/tmp/B.kaosb__p/BUILD/domoticz-2022.1/build' [ 5%] Building CXX object CMakeFiles/domoticz.dir/main/HTMLSanitizer.cpp.o /usr/bin/i686-pld-linux-g++ -DENABLE_PYTHON -DHAVE_EXECINFO_H -DHAVE_LINUX_I2C -DHAVE_LINUX_SPI -DWITH_EXTERNAL_TINYXPATH -DWITH_GPIO -DWITH_LIBUSB -DWITH_OPENZWAVE -DWITH_TLS -DWWW_ENABLE_SSL -D_FILE_OFFSET_BITS=64 -I/usr/include/lua5.3 -I/usr/include/python3.10 -I/tmp/B.kaosb__p/BUILD/domoticz-2022.1/main -I/usr/include/jsoncpp -I/usr/include/minizip -I/usr/include/tinyxpath -I/usr/include/openzwave -O2 -fwrapv -pipe -Wformat -Werror=format-security -gdwarf-4 -fno-debug-types-section -fvar-tracking-assignments -g2 -Wp,-D_FORTIFY_SOURCE=2 -fstack-protector-strong --param=ssp-buffer-size=4 -Werror=trampolines -fomit-frame-pointer -march=i686 -fasynchronous-unwind-tables -mtune=pentium4 -gdwarf-4 -fno-debug-types-section -fvar-tracking-assignments -g2 -DPYTHON_LIBDIR=\"/usr/lib\" -Wno-psabi -rdynamic -O2 -fwrapv -pipe -Wformat -Werror=format-security -gdwarf-4 -fno-debug-types-section -fvar-tracking-assignments -g2 -Wp,-D_FORTIFY_SOURCE=2 -fstack-protector-strong --param=ssp-buffer-size=4 -Werror=trampolines -fomit-frame-pointer -march=i686 -fasynchronous-unwind-tables -mtune=pentium4 -gdwarf-4 -fno-debug-types-section -fvar-tracking-assignments -g2 -DPYTHON_LIBDIR=\"/usr/lib\" -std=c++14 -Winvalid-pch -include /tmp/B.kaosb__p/BUILD/domoticz-2022.1/build/CMakeFiles/domoticz.dir/cmake_pch.hxx -MD -MT CMakeFiles/domoticz.dir/main/HTMLSanitizer.cpp.o -MF CMakeFiles/domoticz.dir/main/HTMLSanitizer.cpp.o.d -o CMakeFiles/domoticz.dir/main/HTMLSanitizer.cpp.o -c /tmp/B.kaosb__p/BUILD/domoticz-2022.1/main/HTMLSanitizer.cpp make[2]: Leaving directory '/tmp/B.kaosb__p/BUILD/domoticz-2022.1/build' make[2]: Entering directory '/tmp/B.kaosb__p/BUILD/domoticz-2022.1/build' [ 1%] Building CXX object CMakeFiles/domoticz.dir/main/CmdLine.cpp.o /usr/bin/i686-pld-linux-g++ -DENABLE_PYTHON -DHAVE_EXECINFO_H -DHAVE_LINUX_I2C -DHAVE_LINUX_SPI -DWITH_EXTERNAL_TINYXPATH -DWITH_GPIO -DWITH_LIBUSB -DWITH_OPENZWAVE -DWITH_TLS -DWWW_ENABLE_SSL -D_FILE_OFFSET_BITS=64 -I/usr/include/lua5.3 -I/usr/include/python3.10 -I/tmp/B.kaosb__p/BUILD/domoticz-2022.1/main -I/usr/include/jsoncpp -I/usr/include/minizip -I/usr/include/tinyxpath -I/usr/include/openzwave -O2 -fwrapv -pipe -Wformat -Werror=format-security -gdwarf-4 -fno-debug-types-section -fvar-tracking-assignments -g2 -Wp,-D_FORTIFY_SOURCE=2 -fstack-protector-strong --param=ssp-buffer-size=4 -Werror=trampolines -fomit-frame-pointer -march=i686 -fasynchronous-unwind-tables -mtune=pentium4 -gdwarf-4 -fno-debug-types-section -fvar-tracking-assignments -g2 -DPYTHON_LIBDIR=\"/usr/lib\" -Wno-psabi -rdynamic -O2 -fwrapv -pipe -Wformat -Werror=format-security -gdwarf-4 -fno-debug-types-section -fvar-tracking-assignments -g2 -Wp,-D_FORTIFY_SOURCE=2 -fstack-protector-strong --param=ssp-buffer-size=4 -Werror=trampolines -fomit-frame-pointer -march=i686 -fasynchronous-unwind-tables -mtune=pentium4 -gdwarf-4 -fno-debug-types-section -fvar-tracking-assignments -g2 -DPYTHON_LIBDIR=\"/usr/lib\" -std=c++14 -Winvalid-pch -include /tmp/B.kaosb__p/BUILD/domoticz-2022.1/build/CMakeFiles/domoticz.dir/cmake_pch.hxx -MD -MT CMakeFiles/domoticz.dir/main/CmdLine.cpp.o -MF CMakeFiles/domoticz.dir/main/CmdLine.cpp.o.d -o CMakeFiles/domoticz.dir/main/CmdLine.cpp.o -c /tmp/B.kaosb__p/BUILD/domoticz-2022.1/main/CmdLine.cpp make[2]: Leaving directory '/tmp/B.kaosb__p/BUILD/domoticz-2022.1/build' make[2]: Entering directory '/tmp/B.kaosb__p/BUILD/domoticz-2022.1/build' [ 6%] Building CXX object CMakeFiles/domoticz.dir/main/IFTTT.cpp.o /usr/bin/i686-pld-linux-g++ -DENABLE_PYTHON -DHAVE_EXECINFO_H -DHAVE_LINUX_I2C -DHAVE_LINUX_SPI -DWITH_EXTERNAL_TINYXPATH -DWITH_GPIO -DWITH_LIBUSB -DWITH_OPENZWAVE -DWITH_TLS -DWWW_ENABLE_SSL -D_FILE_OFFSET_BITS=64 -I/usr/include/lua5.3 -I/usr/include/python3.10 -I/tmp/B.kaosb__p/BUILD/domoticz-2022.1/main -I/usr/include/jsoncpp -I/usr/include/minizip -I/usr/include/tinyxpath -I/usr/include/openzwave -O2 -fwrapv -pipe -Wformat -Werror=format-security -gdwarf-4 -fno-debug-types-section -fvar-tracking-assignments -g2 -Wp,-D_FORTIFY_SOURCE=2 -fstack-protector-strong --param=ssp-buffer-size=4 -Werror=trampolines -fomit-frame-pointer -march=i686 -fasynchronous-unwind-tables -mtune=pentium4 -gdwarf-4 -fno-debug-types-section -fvar-tracking-assignments -g2 -DPYTHON_LIBDIR=\"/usr/lib\" -Wno-psabi -rdynamic -O2 -fwrapv -pipe -Wformat -Werror=format-security -gdwarf-4 -fno-debug-types-section -fvar-tracking-assignments -g2 -Wp,-D_FORTIFY_SOURCE=2 -fstack-protector-strong --param=ssp-buffer-size=4 -Werror=trampolines -fomit-frame-pointer -march=i686 -fasynchronous-unwind-tables -mtune=pentium4 -gdwarf-4 -fno-debug-types-section -fvar-tracking-assignments -g2 -DPYTHON_LIBDIR=\"/usr/lib\" -std=c++14 -Winvalid-pch -include /tmp/B.kaosb__p/BUILD/domoticz-2022.1/build/CMakeFiles/domoticz.dir/cmake_pch.hxx -MD -MT CMakeFiles/domoticz.dir/main/IFTTT.cpp.o -MF CMakeFiles/domoticz.dir/main/IFTTT.cpp.o.d -o CMakeFiles/domoticz.dir/main/IFTTT.cpp.o -c /tmp/B.kaosb__p/BUILD/domoticz-2022.1/main/IFTTT.cpp make[2]: Leaving directory '/tmp/B.kaosb__p/BUILD/domoticz-2022.1/build' make[2]: Entering directory '/tmp/B.kaosb__p/BUILD/domoticz-2022.1/build' [ 5%] Building CXX object CMakeFiles/domoticz.dir/main/EventsPythonDevice.cpp.o /usr/bin/i686-pld-linux-g++ -DENABLE_PYTHON -DHAVE_EXECINFO_H -DHAVE_LINUX_I2C -DHAVE_LINUX_SPI -DWITH_EXTERNAL_TINYXPATH -DWITH_GPIO -DWITH_LIBUSB -DWITH_OPENZWAVE -DWITH_TLS -DWWW_ENABLE_SSL -D_FILE_OFFSET_BITS=64 -I/usr/include/lua5.3 -I/usr/include/python3.10 -I/tmp/B.kaosb__p/BUILD/domoticz-2022.1/main -I/usr/include/jsoncpp -I/usr/include/minizip -I/usr/include/tinyxpath -I/usr/include/openzwave -O2 -fwrapv -pipe -Wformat -Werror=format-security -gdwarf-4 -fno-debug-types-section -fvar-tracking-assignments -g2 -Wp,-D_FORTIFY_SOURCE=2 -fstack-protector-strong --param=ssp-buffer-size=4 -Werror=trampolines -fomit-frame-pointer -march=i686 -fasynchronous-unwind-tables -mtune=pentium4 -gdwarf-4 -fno-debug-types-section -fvar-tracking-assignments -g2 -DPYTHON_LIBDIR=\"/usr/lib\" -Wno-psabi -rdynamic -O2 -fwrapv -pipe -Wformat -Werror=format-security -gdwarf-4 -fno-debug-types-section -fvar-tracking-assignments -g2 -Wp,-D_FORTIFY_SOURCE=2 -fstack-protector-strong --param=ssp-buffer-size=4 -Werror=trampolines -fomit-frame-pointer -march=i686 -fasynchronous-unwind-tables -mtune=pentium4 -gdwarf-4 -fno-debug-types-section -fvar-tracking-assignments -g2 -DPYTHON_LIBDIR=\"/usr/lib\" -std=c++14 -Winvalid-pch -include /tmp/B.kaosb__p/BUILD/domoticz-2022.1/build/CMakeFiles/domoticz.dir/cmake_pch.hxx -MD -MT CMakeFiles/domoticz.dir/main/EventsPythonDevice.cpp.o -MF CMakeFiles/domoticz.dir/main/EventsPythonDevice.cpp.o.d -o CMakeFiles/domoticz.dir/main/EventsPythonDevice.cpp.o -c /tmp/B.kaosb__p/BUILD/domoticz-2022.1/main/EventsPythonDevice.cpp In file included from /tmp/B.kaosb__p/BUILD/domoticz-2022.1/main/EventsPythonDevice.h:7, from /tmp/B.kaosb__p/BUILD/domoticz-2022.1/main/EventsPythonDevice.cpp:3: /tmp/B.kaosb__p/BUILD/domoticz-2022.1/main/../hardware/plugins/DelayedLink.h:397: warning: "Py_RETURN_NONE" redefined 397 | #define Py_RETURN_NONE return Py_INCREF(Py_None), Py_None | In file included from /usr/include/python3.10/Python.h:74, from /tmp/B.kaosb__p/BUILD/domoticz-2022.1/main/../hardware/plugins/DelayedLink.h:12: /usr/include/python3.10/object.h:613: note: this is the location of the previous definition 613 | #define Py_RETURN_NONE return Py_NewRef(Py_None) | make[2]: Leaving directory '/tmp/B.kaosb__p/BUILD/domoticz-2022.1/build' make[2]: Entering directory '/tmp/B.kaosb__p/BUILD/domoticz-2022.1/build' [ 5%] Building CXX object CMakeFiles/domoticz.dir/main/Helper.cpp.o /usr/bin/i686-pld-linux-g++ -DENABLE_PYTHON -DHAVE_EXECINFO_H -DHAVE_LINUX_I2C -DHAVE_LINUX_SPI -DWITH_EXTERNAL_TINYXPATH -DWITH_GPIO -DWITH_LIBUSB -DWITH_OPENZWAVE -DWITH_TLS -DWWW_ENABLE_SSL -D_FILE_OFFSET_BITS=64 -I/usr/include/lua5.3 -I/usr/include/python3.10 -I/tmp/B.kaosb__p/BUILD/domoticz-2022.1/main -I/usr/include/jsoncpp -I/usr/include/minizip -I/usr/include/tinyxpath -I/usr/include/openzwave -O2 -fwrapv -pipe -Wformat -Werror=format-security -gdwarf-4 -fno-debug-types-section -fvar-tracking-assignments -g2 -Wp,-D_FORTIFY_SOURCE=2 -fstack-protector-strong --param=ssp-buffer-size=4 -Werror=trampolines -fomit-frame-pointer -march=i686 -fasynchronous-unwind-tables -mtune=pentium4 -gdwarf-4 -fno-debug-types-section -fvar-tracking-assignments -g2 -DPYTHON_LIBDIR=\"/usr/lib\" -Wno-psabi -rdynamic -O2 -fwrapv -pipe -Wformat -Werror=format-security -gdwarf-4 -fno-debug-types-section -fvar-tracking-assignments -g2 -Wp,-D_FORTIFY_SOURCE=2 -fstack-protector-strong --param=ssp-buffer-size=4 -Werror=trampolines -fomit-frame-pointer -march=i686 -fasynchronous-unwind-tables -mtune=pentium4 -gdwarf-4 -fno-debug-types-section -fvar-tracking-assignments -g2 -DPYTHON_LIBDIR=\"/usr/lib\" -std=c++14 -Winvalid-pch -include /tmp/B.kaosb__p/BUILD/domoticz-2022.1/build/CMakeFiles/domoticz.dir/cmake_pch.hxx -MD -MT CMakeFiles/domoticz.dir/main/Helper.cpp.o -MF CMakeFiles/domoticz.dir/main/Helper.cpp.o.d -o CMakeFiles/domoticz.dir/main/Helper.cpp.o -c /tmp/B.kaosb__p/BUILD/domoticz-2022.1/main/Helper.cpp /tmp/B.kaosb__p/BUILD/domoticz-2022.1/main/Helper.cpp: In function 'std::string GenerateMD5Hash(const std::string&, const std::string&)': /tmp/B.kaosb__p/BUILD/domoticz-2022.1/main/Helper.cpp:870:12: warning: 'unsigned char* MD5(const unsigned char*, size_t, unsigned char*)' is deprecated: Since OpenSSL 3.0 [-Wdeprecated-declarations] 870 | MD5((const unsigned char*)cstring.c_str(), cstring.size(), (unsigned char*)&digest); | ~~~^~~~~~~~~~~~~~~~~~~~~~~~~~~~~~~~~~~~~~~~~~~~~~~~~~~~~~~~~~~~~~~~~~~~~~~~~~~~~~~~ In file included from /tmp/B.kaosb__p/BUILD/domoticz-2022.1/main/Helper.cpp:21: /usr/include/openssl/md5.h:52:38: note: declared here 52 | OSSL_DEPRECATEDIN_3_0 unsigned char *MD5(const unsigned char *d, size_t n, | ^~~ make[2]: Leaving directory '/tmp/B.kaosb__p/BUILD/domoticz-2022.1/build' make[2]: Entering directory '/tmp/B.kaosb__p/BUILD/domoticz-2022.1/build' [ 11%] Building CXX object CMakeFiles/domoticz.dir/main/RFXNames.cpp.o /usr/bin/i686-pld-linux-g++ -DENABLE_PYTHON -DHAVE_EXECINFO_H -DHAVE_LINUX_I2C -DHAVE_LINUX_SPI -DWITH_EXTERNAL_TINYXPATH -DWITH_GPIO -DWITH_LIBUSB -DWITH_OPENZWAVE -DWITH_TLS -DWWW_ENABLE_SSL -D_FILE_OFFSET_BITS=64 -I/usr/include/lua5.3 -I/usr/include/python3.10 -I/tmp/B.kaosb__p/BUILD/domoticz-2022.1/main -I/usr/include/jsoncpp -I/usr/include/minizip -I/usr/include/tinyxpath -I/usr/include/openzwave -O2 -fwrapv -pipe -Wformat -Werror=format-security -gdwarf-4 -fno-debug-types-section -fvar-tracking-assignments -g2 -Wp,-D_FORTIFY_SOURCE=2 -fstack-protector-strong --param=ssp-buffer-size=4 -Werror=trampolines -fomit-frame-pointer -march=i686 -fasynchronous-unwind-tables -mtune=pentium4 -gdwarf-4 -fno-debug-types-section -fvar-tracking-assignments -g2 -DPYTHON_LIBDIR=\"/usr/lib\" -Wno-psabi -rdynamic -O2 -fwrapv -pipe -Wformat -Werror=format-security -gdwarf-4 -fno-debug-types-section -fvar-tracking-assignments -g2 -Wp,-D_FORTIFY_SOURCE=2 -fstack-protector-strong --param=ssp-buffer-size=4 -Werror=trampolines -fomit-frame-pointer -march=i686 -fasynchronous-unwind-tables -mtune=pentium4 -gdwarf-4 -fno-debug-types-section -fvar-tracking-assignments -g2 -DPYTHON_LIBDIR=\"/usr/lib\" -std=c++14 -Winvalid-pch -include /tmp/B.kaosb__p/BUILD/domoticz-2022.1/build/CMakeFiles/domoticz.dir/cmake_pch.hxx -MD -MT CMakeFiles/domoticz.dir/main/RFXNames.cpp.o -MF CMakeFiles/domoticz.dir/main/RFXNames.cpp.o.d -o CMakeFiles/domoticz.dir/main/RFXNames.cpp.o -c /tmp/B.kaosb__p/BUILD/domoticz-2022.1/main/RFXNames.cpp make[2]: Leaving directory '/tmp/B.kaosb__p/BUILD/domoticz-2022.1/build' make[2]: Entering directory '/tmp/B.kaosb__p/BUILD/domoticz-2022.1/build' [ 9%] Building CXX object CMakeFiles/domoticz.dir/main/NotificationSystem.cpp.o /usr/bin/i686-pld-linux-g++ -DENABLE_PYTHON -DHAVE_EXECINFO_H -DHAVE_LINUX_I2C -DHAVE_LINUX_SPI -DWITH_EXTERNAL_TINYXPATH -DWITH_GPIO -DWITH_LIBUSB -DWITH_OPENZWAVE -DWITH_TLS -DWWW_ENABLE_SSL -D_FILE_OFFSET_BITS=64 -I/usr/include/lua5.3 -I/usr/include/python3.10 -I/tmp/B.kaosb__p/BUILD/domoticz-2022.1/main -I/usr/include/jsoncpp -I/usr/include/minizip -I/usr/include/tinyxpath -I/usr/include/openzwave -O2 -fwrapv -pipe -Wformat -Werror=format-security -gdwarf-4 -fno-debug-types-section -fvar-tracking-assignments -g2 -Wp,-D_FORTIFY_SOURCE=2 -fstack-protector-strong --param=ssp-buffer-size=4 -Werror=trampolines -fomit-frame-pointer -march=i686 -fasynchronous-unwind-tables -mtune=pentium4 -gdwarf-4 -fno-debug-types-section -fvar-tracking-assignments -g2 -DPYTHON_LIBDIR=\"/usr/lib\" -Wno-psabi -rdynamic -O2 -fwrapv -pipe -Wformat -Werror=format-security -gdwarf-4 -fno-debug-types-section -fvar-tracking-assignments -g2 -Wp,-D_FORTIFY_SOURCE=2 -fstack-protector-strong --param=ssp-buffer-size=4 -Werror=trampolines -fomit-frame-pointer -march=i686 -fasynchronous-unwind-tables -mtune=pentium4 -gdwarf-4 -fno-debug-types-section -fvar-tracking-assignments -g2 -DPYTHON_LIBDIR=\"/usr/lib\" -std=c++14 -Winvalid-pch -include /tmp/B.kaosb__p/BUILD/domoticz-2022.1/build/CMakeFiles/domoticz.dir/cmake_pch.hxx -MD -MT CMakeFiles/domoticz.dir/main/NotificationSystem.cpp.o -MF CMakeFiles/domoticz.dir/main/NotificationSystem.cpp.o.d -o CMakeFiles/domoticz.dir/main/NotificationSystem.cpp.o -c /tmp/B.kaosb__p/BUILD/domoticz-2022.1/main/NotificationSystem.cpp make[2]: Leaving directory '/tmp/B.kaosb__p/BUILD/domoticz-2022.1/build' make[2]: Entering directory '/tmp/B.kaosb__p/BUILD/domoticz-2022.1/build' [ 8%] Building CXX object CMakeFiles/domoticz.dir/main/LuaCommon.cpp.o /usr/bin/i686-pld-linux-g++ -DENABLE_PYTHON -DHAVE_EXECINFO_H -DHAVE_LINUX_I2C -DHAVE_LINUX_SPI -DWITH_EXTERNAL_TINYXPATH -DWITH_GPIO -DWITH_LIBUSB -DWITH_OPENZWAVE -DWITH_TLS -DWWW_ENABLE_SSL -D_FILE_OFFSET_BITS=64 -I/usr/include/lua5.3 -I/usr/include/python3.10 -I/tmp/B.kaosb__p/BUILD/domoticz-2022.1/main -I/usr/include/jsoncpp -I/usr/include/minizip -I/usr/include/tinyxpath -I/usr/include/openzwave -O2 -fwrapv -pipe -Wformat -Werror=format-security -gdwarf-4 -fno-debug-types-section -fvar-tracking-assignments -g2 -Wp,-D_FORTIFY_SOURCE=2 -fstack-protector-strong --param=ssp-buffer-size=4 -Werror=trampolines -fomit-frame-pointer -march=i686 -fasynchronous-unwind-tables -mtune=pentium4 -gdwarf-4 -fno-debug-types-section -fvar-tracking-assignments -g2 -DPYTHON_LIBDIR=\"/usr/lib\" -Wno-psabi -rdynamic -O2 -fwrapv -pipe -Wformat -Werror=format-security -gdwarf-4 -fno-debug-types-section -fvar-tracking-assignments -g2 -Wp,-D_FORTIFY_SOURCE=2 -fstack-protector-strong --param=ssp-buffer-size=4 -Werror=trampolines -fomit-frame-pointer -march=i686 -fasynchronous-unwind-tables -mtune=pentium4 -gdwarf-4 -fno-debug-types-section -fvar-tracking-assignments -g2 -DPYTHON_LIBDIR=\"/usr/lib\" -std=c++14 -Winvalid-pch -include /tmp/B.kaosb__p/BUILD/domoticz-2022.1/build/CMakeFiles/domoticz.dir/cmake_pch.hxx -MD -MT CMakeFiles/domoticz.dir/main/LuaCommon.cpp.o -MF CMakeFiles/domoticz.dir/main/LuaCommon.cpp.o.d -o CMakeFiles/domoticz.dir/main/LuaCommon.cpp.o -c /tmp/B.kaosb__p/BUILD/domoticz-2022.1/main/LuaCommon.cpp make[2]: Leaving directory '/tmp/B.kaosb__p/BUILD/domoticz-2022.1/build' make[2]: Entering directory '/tmp/B.kaosb__p/BUILD/domoticz-2022.1/build' [ 11%] Building CXX object CMakeFiles/domoticz.dir/main/SignalHandler.cpp.o /usr/bin/i686-pld-linux-g++ -DENABLE_PYTHON -DHAVE_EXECINFO_H -DHAVE_LINUX_I2C -DHAVE_LINUX_SPI -DWITH_EXTERNAL_TINYXPATH -DWITH_GPIO -DWITH_LIBUSB -DWITH_OPENZWAVE -DWITH_TLS -DWWW_ENABLE_SSL -D_FILE_OFFSET_BITS=64 -I/usr/include/lua5.3 -I/usr/include/python3.10 -I/tmp/B.kaosb__p/BUILD/domoticz-2022.1/main -I/usr/include/jsoncpp -I/usr/include/minizip -I/usr/include/tinyxpath -I/usr/include/openzwave -O2 -fwrapv -pipe -Wformat -Werror=format-security -gdwarf-4 -fno-debug-types-section -fvar-tracking-assignments -g2 -Wp,-D_FORTIFY_SOURCE=2 -fstack-protector-strong --param=ssp-buffer-size=4 -Werror=trampolines -fomit-frame-pointer -march=i686 -fasynchronous-unwind-tables -mtune=pentium4 -gdwarf-4 -fno-debug-types-section -fvar-tracking-assignments -g2 -DPYTHON_LIBDIR=\"/usr/lib\" -Wno-psabi -rdynamic -O2 -fwrapv -pipe -Wformat -Werror=format-security -gdwarf-4 -fno-debug-types-section -fvar-tracking-assignments -g2 -Wp,-D_FORTIFY_SOURCE=2 -fstack-protector-strong --param=ssp-buffer-size=4 -Werror=trampolines -fomit-frame-pointer -march=i686 -fasynchronous-unwind-tables -mtune=pentium4 -gdwarf-4 -fno-debug-types-section -fvar-tracking-assignments -g2 -DPYTHON_LIBDIR=\"/usr/lib\" -std=c++14 -Winvalid-pch -include /tmp/B.kaosb__p/BUILD/domoticz-2022.1/build/CMakeFiles/domoticz.dir/cmake_pch.hxx -MD -MT CMakeFiles/domoticz.dir/main/SignalHandler.cpp.o -MF CMakeFiles/domoticz.dir/main/SignalHandler.cpp.o.d -o CMakeFiles/domoticz.dir/main/SignalHandler.cpp.o -c /tmp/B.kaosb__p/BUILD/domoticz-2022.1/main/SignalHandler.cpp make[2]: Leaving directory '/tmp/B.kaosb__p/BUILD/domoticz-2022.1/build' make[2]: Entering directory '/tmp/B.kaosb__p/BUILD/domoticz-2022.1/build' [ 3%] Building CXX object CMakeFiles/domoticz.dir/main/EventsPythonModule.cpp.o /usr/bin/i686-pld-linux-g++ -DENABLE_PYTHON -DHAVE_EXECINFO_H -DHAVE_LINUX_I2C -DHAVE_LINUX_SPI -DWITH_EXTERNAL_TINYXPATH -DWITH_GPIO -DWITH_LIBUSB -DWITH_OPENZWAVE -DWITH_TLS -DWWW_ENABLE_SSL -D_FILE_OFFSET_BITS=64 -I/usr/include/lua5.3 -I/usr/include/python3.10 -I/tmp/B.kaosb__p/BUILD/domoticz-2022.1/main -I/usr/include/jsoncpp -I/usr/include/minizip -I/usr/include/tinyxpath -I/usr/include/openzwave -O2 -fwrapv -pipe -Wformat -Werror=format-security -gdwarf-4 -fno-debug-types-section -fvar-tracking-assignments -g2 -Wp,-D_FORTIFY_SOURCE=2 -fstack-protector-strong --param=ssp-buffer-size=4 -Werror=trampolines -fomit-frame-pointer -march=i686 -fasynchronous-unwind-tables -mtune=pentium4 -gdwarf-4 -fno-debug-types-section -fvar-tracking-assignments -g2 -DPYTHON_LIBDIR=\"/usr/lib\" -Wno-psabi -rdynamic -O2 -fwrapv -pipe -Wformat -Werror=format-security -gdwarf-4 -fno-debug-types-section -fvar-tracking-assignments -g2 -Wp,-D_FORTIFY_SOURCE=2 -fstack-protector-strong --param=ssp-buffer-size=4 -Werror=trampolines -fomit-frame-pointer -march=i686 -fasynchronous-unwind-tables -mtune=pentium4 -gdwarf-4 -fno-debug-types-section -fvar-tracking-assignments -g2 -DPYTHON_LIBDIR=\"/usr/lib\" -std=c++14 -Winvalid-pch -include /tmp/B.kaosb__p/BUILD/domoticz-2022.1/build/CMakeFiles/domoticz.dir/cmake_pch.hxx -MD -MT CMakeFiles/domoticz.dir/main/EventsPythonModule.cpp.o -MF CMakeFiles/domoticz.dir/main/EventsPythonModule.cpp.o.d -o CMakeFiles/domoticz.dir/main/EventsPythonModule.cpp.o -c /tmp/B.kaosb__p/BUILD/domoticz-2022.1/main/EventsPythonModule.cpp In file included from /tmp/B.kaosb__p/BUILD/domoticz-2022.1/main/EventsPythonModule.h:8, from /tmp/B.kaosb__p/BUILD/domoticz-2022.1/main/EventsPythonModule.cpp:4: /tmp/B.kaosb__p/BUILD/domoticz-2022.1/main/../hardware/plugins/DelayedLink.h:397: warning: "Py_RETURN_NONE" redefined 397 | #define Py_RETURN_NONE return Py_INCREF(Py_None), Py_None | In file included from /usr/include/python3.10/Python.h:74, from /tmp/B.kaosb__p/BUILD/domoticz-2022.1/main/../hardware/plugins/DelayedLink.h:12: /usr/include/python3.10/object.h:613: note: this is the location of the previous definition 613 | #define Py_RETURN_NONE return Py_NewRef(Py_None) | make[2]: Leaving directory '/tmp/B.kaosb__p/BUILD/domoticz-2022.1/build' make[2]: Entering directory '/tmp/B.kaosb__p/BUILD/domoticz-2022.1/build' [ 11%] Building CXX object CMakeFiles/domoticz.dir/main/Logger.cpp.o /usr/bin/i686-pld-linux-g++ -DENABLE_PYTHON -DHAVE_EXECINFO_H -DHAVE_LINUX_I2C -DHAVE_LINUX_SPI -DWITH_EXTERNAL_TINYXPATH -DWITH_GPIO -DWITH_LIBUSB -DWITH_OPENZWAVE -DWITH_TLS -DWWW_ENABLE_SSL -D_FILE_OFFSET_BITS=64 -I/usr/include/lua5.3 -I/usr/include/python3.10 -I/tmp/B.kaosb__p/BUILD/domoticz-2022.1/main -I/usr/include/jsoncpp -I/usr/include/minizip -I/usr/include/tinyxpath -I/usr/include/openzwave -O2 -fwrapv -pipe -Wformat -Werror=format-security -gdwarf-4 -fno-debug-types-section -fvar-tracking-assignments -g2 -Wp,-D_FORTIFY_SOURCE=2 -fstack-protector-strong --param=ssp-buffer-size=4 -Werror=trampolines -fomit-frame-pointer -march=i686 -fasynchronous-unwind-tables -mtune=pentium4 -gdwarf-4 -fno-debug-types-section -fvar-tracking-assignments -g2 -DPYTHON_LIBDIR=\"/usr/lib\" -Wno-psabi -rdynamic -O2 -fwrapv -pipe -Wformat -Werror=format-security -gdwarf-4 -fno-debug-types-section -fvar-tracking-assignments -g2 -Wp,-D_FORTIFY_SOURCE=2 -fstack-protector-strong --param=ssp-buffer-size=4 -Werror=trampolines -fomit-frame-pointer -march=i686 -fasynchronous-unwind-tables -mtune=pentium4 -gdwarf-4 -fno-debug-types-section -fvar-tracking-assignments -g2 -DPYTHON_LIBDIR=\"/usr/lib\" -std=c++14 -Winvalid-pch -include /tmp/B.kaosb__p/BUILD/domoticz-2022.1/build/CMakeFiles/domoticz.dir/cmake_pch.hxx -MD -MT CMakeFiles/domoticz.dir/main/Logger.cpp.o -MF CMakeFiles/domoticz.dir/main/Logger.cpp.o.d -o CMakeFiles/domoticz.dir/main/Logger.cpp.o -c /tmp/B.kaosb__p/BUILD/domoticz-2022.1/main/Logger.cpp make[2]: Leaving directory '/tmp/B.kaosb__p/BUILD/domoticz-2022.1/build' make[2]: Entering directory '/tmp/B.kaosb__p/BUILD/domoticz-2022.1/build' [ 8%] Building CXX object CMakeFiles/domoticz.dir/main/LuaHandler.cpp.o /usr/bin/i686-pld-linux-g++ -DENABLE_PYTHON -DHAVE_EXECINFO_H -DHAVE_LINUX_I2C -DHAVE_LINUX_SPI -DWITH_EXTERNAL_TINYXPATH -DWITH_GPIO -DWITH_LIBUSB -DWITH_OPENZWAVE -DWITH_TLS -DWWW_ENABLE_SSL -D_FILE_OFFSET_BITS=64 -I/usr/include/lua5.3 -I/usr/include/python3.10 -I/tmp/B.kaosb__p/BUILD/domoticz-2022.1/main -I/usr/include/jsoncpp -I/usr/include/minizip -I/usr/include/tinyxpath -I/usr/include/openzwave -O2 -fwrapv -pipe -Wformat -Werror=format-security -gdwarf-4 -fno-debug-types-section -fvar-tracking-assignments -g2 -Wp,-D_FORTIFY_SOURCE=2 -fstack-protector-strong --param=ssp-buffer-size=4 -Werror=trampolines -fomit-frame-pointer -march=i686 -fasynchronous-unwind-tables -mtune=pentium4 -gdwarf-4 -fno-debug-types-section -fvar-tracking-assignments -g2 -DPYTHON_LIBDIR=\"/usr/lib\" -Wno-psabi -rdynamic -O2 -fwrapv -pipe -Wformat -Werror=format-security -gdwarf-4 -fno-debug-types-section -fvar-tracking-assignments -g2 -Wp,-D_FORTIFY_SOURCE=2 -fstack-protector-strong --param=ssp-buffer-size=4 -Werror=trampolines -fomit-frame-pointer -march=i686 -fasynchronous-unwind-tables -mtune=pentium4 -gdwarf-4 -fno-debug-types-section -fvar-tracking-assignments -g2 -DPYTHON_LIBDIR=\"/usr/lib\" -std=c++14 -Winvalid-pch -include /tmp/B.kaosb__p/BUILD/domoticz-2022.1/build/CMakeFiles/domoticz.dir/cmake_pch.hxx -MD -MT CMakeFiles/domoticz.dir/main/LuaHandler.cpp.o -MF CMakeFiles/domoticz.dir/main/LuaHandler.cpp.o.d -o CMakeFiles/domoticz.dir/main/LuaHandler.cpp.o -c /tmp/B.kaosb__p/BUILD/domoticz-2022.1/main/LuaHandler.cpp make[2]: Leaving directory '/tmp/B.kaosb__p/BUILD/domoticz-2022.1/build' make[2]: Entering directory '/tmp/B.kaosb__p/BUILD/domoticz-2022.1/build' [ 13%] Building CXX object CMakeFiles/domoticz.dir/push/BasePush.cpp.o /usr/bin/i686-pld-linux-g++ -DENABLE_PYTHON -DHAVE_EXECINFO_H -DHAVE_LINUX_I2C -DHAVE_LINUX_SPI -DWITH_EXTERNAL_TINYXPATH -DWITH_GPIO -DWITH_LIBUSB -DWITH_OPENZWAVE -DWITH_TLS -DWWW_ENABLE_SSL -D_FILE_OFFSET_BITS=64 -I/usr/include/lua5.3 -I/usr/include/python3.10 -I/tmp/B.kaosb__p/BUILD/domoticz-2022.1/main -I/usr/include/jsoncpp -I/usr/include/minizip -I/usr/include/tinyxpath -I/usr/include/openzwave -O2 -fwrapv -pipe -Wformat -Werror=format-security -gdwarf-4 -fno-debug-types-section -fvar-tracking-assignments -g2 -Wp,-D_FORTIFY_SOURCE=2 -fstack-protector-strong --param=ssp-buffer-size=4 -Werror=trampolines -fomit-frame-pointer -march=i686 -fasynchronous-unwind-tables -mtune=pentium4 -gdwarf-4 -fno-debug-types-section -fvar-tracking-assignments -g2 -DPYTHON_LIBDIR=\"/usr/lib\" -Wno-psabi -rdynamic -O2 -fwrapv -pipe -Wformat -Werror=format-security -gdwarf-4 -fno-debug-types-section -fvar-tracking-assignments -g2 -Wp,-D_FORTIFY_SOURCE=2 -fstack-protector-strong --param=ssp-buffer-size=4 -Werror=trampolines -fomit-frame-pointer -march=i686 -fasynchronous-unwind-tables -mtune=pentium4 -gdwarf-4 -fno-debug-types-section -fvar-tracking-assignments -g2 -DPYTHON_LIBDIR=\"/usr/lib\" -std=c++14 -Winvalid-pch -include /tmp/B.kaosb__p/BUILD/domoticz-2022.1/build/CMakeFiles/domoticz.dir/cmake_pch.hxx -MD -MT CMakeFiles/domoticz.dir/push/BasePush.cpp.o -MF CMakeFiles/domoticz.dir/push/BasePush.cpp.o.d -o CMakeFiles/domoticz.dir/push/BasePush.cpp.o -c /tmp/B.kaosb__p/BUILD/domoticz-2022.1/push/BasePush.cpp make[2]: Leaving directory '/tmp/B.kaosb__p/BUILD/domoticz-2022.1/build' make[2]: Entering directory '/tmp/B.kaosb__p/BUILD/domoticz-2022.1/build' [ 2%] Building CXX object CMakeFiles/domoticz.dir/main/Camera.cpp.o /usr/bin/i686-pld-linux-g++ -DENABLE_PYTHON -DHAVE_EXECINFO_H -DHAVE_LINUX_I2C -DHAVE_LINUX_SPI -DWITH_EXTERNAL_TINYXPATH -DWITH_GPIO -DWITH_LIBUSB -DWITH_OPENZWAVE -DWITH_TLS -DWWW_ENABLE_SSL -D_FILE_OFFSET_BITS=64 -I/usr/include/lua5.3 -I/usr/include/python3.10 -I/tmp/B.kaosb__p/BUILD/domoticz-2022.1/main -I/usr/include/jsoncpp -I/usr/include/minizip -I/usr/include/tinyxpath -I/usr/include/openzwave -O2 -fwrapv -pipe -Wformat -Werror=format-security -gdwarf-4 -fno-debug-types-section -fvar-tracking-assignments -g2 -Wp,-D_FORTIFY_SOURCE=2 -fstack-protector-strong --param=ssp-buffer-size=4 -Werror=trampolines -fomit-frame-pointer -march=i686 -fasynchronous-unwind-tables -mtune=pentium4 -gdwarf-4 -fno-debug-types-section -fvar-tracking-assignments -g2 -DPYTHON_LIBDIR=\"/usr/lib\" -Wno-psabi -rdynamic -O2 -fwrapv -pipe -Wformat -Werror=format-security -gdwarf-4 -fno-debug-types-section -fvar-tracking-assignments -g2 -Wp,-D_FORTIFY_SOURCE=2 -fstack-protector-strong --param=ssp-buffer-size=4 -Werror=trampolines -fomit-frame-pointer -march=i686 -fasynchronous-unwind-tables -mtune=pentium4 -gdwarf-4 -fno-debug-types-section -fvar-tracking-assignments -g2 -DPYTHON_LIBDIR=\"/usr/lib\" -std=c++14 -Winvalid-pch -include /tmp/B.kaosb__p/BUILD/domoticz-2022.1/build/CMakeFiles/domoticz.dir/cmake_pch.hxx -MD -MT CMakeFiles/domoticz.dir/main/Camera.cpp.o -MF CMakeFiles/domoticz.dir/main/Camera.cpp.o.d -o CMakeFiles/domoticz.dir/main/Camera.cpp.o -c /tmp/B.kaosb__p/BUILD/domoticz-2022.1/main/Camera.cpp make[2]: Leaving directory '/tmp/B.kaosb__p/BUILD/domoticz-2022.1/build' make[2]: Entering directory '/tmp/B.kaosb__p/BUILD/domoticz-2022.1/build' [ 12%] Building CXX object CMakeFiles/domoticz.dir/main/Scheduler.cpp.o /usr/bin/i686-pld-linux-g++ -DENABLE_PYTHON -DHAVE_EXECINFO_H -DHAVE_LINUX_I2C -DHAVE_LINUX_SPI -DWITH_EXTERNAL_TINYXPATH -DWITH_GPIO -DWITH_LIBUSB -DWITH_OPENZWAVE -DWITH_TLS -DWWW_ENABLE_SSL -D_FILE_OFFSET_BITS=64 -I/usr/include/lua5.3 -I/usr/include/python3.10 -I/tmp/B.kaosb__p/BUILD/domoticz-2022.1/main -I/usr/include/jsoncpp -I/usr/include/minizip -I/usr/include/tinyxpath -I/usr/include/openzwave -O2 -fwrapv -pipe -Wformat -Werror=format-security -gdwarf-4 -fno-debug-types-section -fvar-tracking-assignments -g2 -Wp,-D_FORTIFY_SOURCE=2 -fstack-protector-strong --param=ssp-buffer-size=4 -Werror=trampolines -fomit-frame-pointer -march=i686 -fasynchronous-unwind-tables -mtune=pentium4 -gdwarf-4 -fno-debug-types-section -fvar-tracking-assignments -g2 -DPYTHON_LIBDIR=\"/usr/lib\" -Wno-psabi -rdynamic -O2 -fwrapv -pipe -Wformat -Werror=format-security -gdwarf-4 -fno-debug-types-section -fvar-tracking-assignments -g2 -Wp,-D_FORTIFY_SOURCE=2 -fstack-protector-strong --param=ssp-buffer-size=4 -Werror=trampolines -fomit-frame-pointer -march=i686 -fasynchronous-unwind-tables -mtune=pentium4 -gdwarf-4 -fno-debug-types-section -fvar-tracking-assignments -g2 -DPYTHON_LIBDIR=\"/usr/lib\" -std=c++14 -Winvalid-pch -include /tmp/B.kaosb__p/BUILD/domoticz-2022.1/build/CMakeFiles/domoticz.dir/cmake_pch.hxx -MD -MT CMakeFiles/domoticz.dir/main/Scheduler.cpp.o -MF CMakeFiles/domoticz.dir/main/Scheduler.cpp.o.d -o CMakeFiles/domoticz.dir/main/Scheduler.cpp.o -c /tmp/B.kaosb__p/BUILD/domoticz-2022.1/main/Scheduler.cpp make[2]: Leaving directory '/tmp/B.kaosb__p/BUILD/domoticz-2022.1/build' make[2]: Entering directory '/tmp/B.kaosb__p/BUILD/domoticz-2022.1/build' [ 3%] Building CXX object CMakeFiles/domoticz.dir/main/domoticz.cpp.o /usr/bin/i686-pld-linux-g++ -DENABLE_PYTHON -DHAVE_EXECINFO_H -DHAVE_LINUX_I2C -DHAVE_LINUX_SPI -DWITH_EXTERNAL_TINYXPATH -DWITH_GPIO -DWITH_LIBUSB -DWITH_OPENZWAVE -DWITH_TLS -DWWW_ENABLE_SSL -D_FILE_OFFSET_BITS=64 -I/usr/include/lua5.3 -I/usr/include/python3.10 -I/tmp/B.kaosb__p/BUILD/domoticz-2022.1/main -I/usr/include/jsoncpp -I/usr/include/minizip -I/usr/include/tinyxpath -I/usr/include/openzwave -O2 -fwrapv -pipe -Wformat -Werror=format-security -gdwarf-4 -fno-debug-types-section -fvar-tracking-assignments -g2 -Wp,-D_FORTIFY_SOURCE=2 -fstack-protector-strong --param=ssp-buffer-size=4 -Werror=trampolines -fomit-frame-pointer -march=i686 -fasynchronous-unwind-tables -mtune=pentium4 -gdwarf-4 -fno-debug-types-section -fvar-tracking-assignments -g2 -DPYTHON_LIBDIR=\"/usr/lib\" -Wno-psabi -rdynamic -O2 -fwrapv -pipe -Wformat -Werror=format-security -gdwarf-4 -fno-debug-types-section -fvar-tracking-assignments -g2 -Wp,-D_FORTIFY_SOURCE=2 -fstack-protector-strong --param=ssp-buffer-size=4 -Werror=trampolines -fomit-frame-pointer -march=i686 -fasynchronous-unwind-tables -mtune=pentium4 -gdwarf-4 -fno-debug-types-section -fvar-tracking-assignments -g2 -DPYTHON_LIBDIR=\"/usr/lib\" -std=c++14 -Winvalid-pch -include /tmp/B.kaosb__p/BUILD/domoticz-2022.1/build/CMakeFiles/domoticz.dir/cmake_pch.hxx -MD -MT CMakeFiles/domoticz.dir/main/domoticz.cpp.o -MF CMakeFiles/domoticz.dir/main/domoticz.cpp.o.d -o CMakeFiles/domoticz.dir/main/domoticz.cpp.o -c /tmp/B.kaosb__p/BUILD/domoticz-2022.1/main/domoticz.cpp make[2]: Leaving directory '/tmp/B.kaosb__p/BUILD/domoticz-2022.1/build' make[2]: Entering directory '/tmp/B.kaosb__p/BUILD/domoticz-2022.1/build' [ 12%] Building CXX object CMakeFiles/domoticz.dir/main/WebServerHelper.cpp.o /usr/bin/i686-pld-linux-g++ -DENABLE_PYTHON -DHAVE_EXECINFO_H -DHAVE_LINUX_I2C -DHAVE_LINUX_SPI -DWITH_EXTERNAL_TINYXPATH -DWITH_GPIO -DWITH_LIBUSB -DWITH_OPENZWAVE -DWITH_TLS -DWWW_ENABLE_SSL -D_FILE_OFFSET_BITS=64 -I/usr/include/lua5.3 -I/usr/include/python3.10 -I/tmp/B.kaosb__p/BUILD/domoticz-2022.1/main -I/usr/include/jsoncpp -I/usr/include/minizip -I/usr/include/tinyxpath -I/usr/include/openzwave -O2 -fwrapv -pipe -Wformat -Werror=format-security -gdwarf-4 -fno-debug-types-section -fvar-tracking-assignments -g2 -Wp,-D_FORTIFY_SOURCE=2 -fstack-protector-strong --param=ssp-buffer-size=4 -Werror=trampolines -fomit-frame-pointer -march=i686 -fasynchronous-unwind-tables -mtune=pentium4 -gdwarf-4 -fno-debug-types-section -fvar-tracking-assignments -g2 -DPYTHON_LIBDIR=\"/usr/lib\" -Wno-psabi -rdynamic -O2 -fwrapv -pipe -Wformat -Werror=format-security -gdwarf-4 -fno-debug-types-section -fvar-tracking-assignments -g2 -Wp,-D_FORTIFY_SOURCE=2 -fstack-protector-strong --param=ssp-buffer-size=4 -Werror=trampolines -fomit-frame-pointer -march=i686 -fasynchronous-unwind-tables -mtune=pentium4 -gdwarf-4 -fno-debug-types-section -fvar-tracking-assignments -g2 -DPYTHON_LIBDIR=\"/usr/lib\" -std=c++14 -Winvalid-pch -include /tmp/B.kaosb__p/BUILD/domoticz-2022.1/build/CMakeFiles/domoticz.dir/cmake_pch.hxx -MD -MT CMakeFiles/domoticz.dir/main/WebServerHelper.cpp.o -MF CMakeFiles/domoticz.dir/main/WebServerHelper.cpp.o.d -o CMakeFiles/domoticz.dir/main/WebServerHelper.cpp.o -c /tmp/B.kaosb__p/BUILD/domoticz-2022.1/main/WebServerHelper.cpp make[2]: Leaving directory '/tmp/B.kaosb__p/BUILD/domoticz-2022.1/build' make[2]: Entering directory '/tmp/B.kaosb__p/BUILD/domoticz-2022.1/build' [ 2%] Building CXX object CMakeFiles/domoticz.dir/main/dzVents.cpp.o /usr/bin/i686-pld-linux-g++ -DENABLE_PYTHON -DHAVE_EXECINFO_H -DHAVE_LINUX_I2C -DHAVE_LINUX_SPI -DWITH_EXTERNAL_TINYXPATH -DWITH_GPIO -DWITH_LIBUSB -DWITH_OPENZWAVE -DWITH_TLS -DWWW_ENABLE_SSL -D_FILE_OFFSET_BITS=64 -I/usr/include/lua5.3 -I/usr/include/python3.10 -I/tmp/B.kaosb__p/BUILD/domoticz-2022.1/main -I/usr/include/jsoncpp -I/usr/include/minizip -I/usr/include/tinyxpath -I/usr/include/openzwave -O2 -fwrapv -pipe -Wformat -Werror=format-security -gdwarf-4 -fno-debug-types-section -fvar-tracking-assignments -g2 -Wp,-D_FORTIFY_SOURCE=2 -fstack-protector-strong --param=ssp-buffer-size=4 -Werror=trampolines -fomit-frame-pointer -march=i686 -fasynchronous-unwind-tables -mtune=pentium4 -gdwarf-4 -fno-debug-types-section -fvar-tracking-assignments -g2 -DPYTHON_LIBDIR=\"/usr/lib\" -Wno-psabi -rdynamic -O2 -fwrapv -pipe -Wformat -Werror=format-security -gdwarf-4 -fno-debug-types-section -fvar-tracking-assignments -g2 -Wp,-D_FORTIFY_SOURCE=2 -fstack-protector-strong --param=ssp-buffer-size=4 -Werror=trampolines -fomit-frame-pointer -march=i686 -fasynchronous-unwind-tables -mtune=pentium4 -gdwarf-4 -fno-debug-types-section -fvar-tracking-assignments -g2 -DPYTHON_LIBDIR=\"/usr/lib\" -std=c++14 -Winvalid-pch -include /tmp/B.kaosb__p/BUILD/domoticz-2022.1/build/CMakeFiles/domoticz.dir/cmake_pch.hxx -MD -MT CMakeFiles/domoticz.dir/main/dzVents.cpp.o -MF CMakeFiles/domoticz.dir/main/dzVents.cpp.o.d -o CMakeFiles/domoticz.dir/main/dzVents.cpp.o -c /tmp/B.kaosb__p/BUILD/domoticz-2022.1/main/dzVents.cpp make[2]: Leaving directory '/tmp/B.kaosb__p/BUILD/domoticz-2022.1/build' make[2]: Entering directory '/tmp/B.kaosb__p/BUILD/domoticz-2022.1/build' [ 3%] Building CXX object CMakeFiles/domoticz.dir/main/EventSystem.cpp.o /usr/bin/i686-pld-linux-g++ -DENABLE_PYTHON -DHAVE_EXECINFO_H -DHAVE_LINUX_I2C -DHAVE_LINUX_SPI -DWITH_EXTERNAL_TINYXPATH -DWITH_GPIO -DWITH_LIBUSB -DWITH_OPENZWAVE -DWITH_TLS -DWWW_ENABLE_SSL -D_FILE_OFFSET_BITS=64 -I/usr/include/lua5.3 -I/usr/include/python3.10 -I/tmp/B.kaosb__p/BUILD/domoticz-2022.1/main -I/usr/include/jsoncpp -I/usr/include/minizip -I/usr/include/tinyxpath -I/usr/include/openzwave -O2 -fwrapv -pipe -Wformat -Werror=format-security -gdwarf-4 -fno-debug-types-section -fvar-tracking-assignments -g2 -Wp,-D_FORTIFY_SOURCE=2 -fstack-protector-strong --param=ssp-buffer-size=4 -Werror=trampolines -fomit-frame-pointer -march=i686 -fasynchronous-unwind-tables -mtune=pentium4 -gdwarf-4 -fno-debug-types-section -fvar-tracking-assignments -g2 -DPYTHON_LIBDIR=\"/usr/lib\" -Wno-psabi -rdynamic -O2 -fwrapv -pipe -Wformat -Werror=format-security -gdwarf-4 -fno-debug-types-section -fvar-tracking-assignments -g2 -Wp,-D_FORTIFY_SOURCE=2 -fstack-protector-strong --param=ssp-buffer-size=4 -Werror=trampolines -fomit-frame-pointer -march=i686 -fasynchronous-unwind-tables -mtune=pentium4 -gdwarf-4 -fno-debug-types-section -fvar-tracking-assignments -g2 -DPYTHON_LIBDIR=\"/usr/lib\" -std=c++14 -Winvalid-pch -include /tmp/B.kaosb__p/BUILD/domoticz-2022.1/build/CMakeFiles/domoticz.dir/cmake_pch.hxx -MD -MT CMakeFiles/domoticz.dir/main/EventSystem.cpp.o -MF CMakeFiles/domoticz.dir/main/EventSystem.cpp.o.d -o CMakeFiles/domoticz.dir/main/EventSystem.cpp.o -c /tmp/B.kaosb__p/BUILD/domoticz-2022.1/main/EventSystem.cpp In file included from /tmp/B.kaosb__p/BUILD/domoticz-2022.1/main/../hardware/plugins/PythonObjects.h:4, from /tmp/B.kaosb__p/BUILD/domoticz-2022.1/main/../hardware/plugins/Plugins.h:6, from /tmp/B.kaosb__p/BUILD/domoticz-2022.1/main/EventSystem.cpp:41: /tmp/B.kaosb__p/BUILD/domoticz-2022.1/main/../hardware/plugins/DelayedLink.h:397: warning: "Py_RETURN_NONE" redefined 397 | #define Py_RETURN_NONE return Py_INCREF(Py_None), Py_None | In file included from /usr/include/python3.10/Python.h:74, from /tmp/B.kaosb__p/BUILD/domoticz-2022.1/main/../hardware/plugins/DelayedLink.h:12: /usr/include/python3.10/object.h:613: note: this is the location of the previous definition 613 | #define Py_RETURN_NONE return Py_NewRef(Py_None) | make[2]: Leaving directory '/tmp/B.kaosb__p/BUILD/domoticz-2022.1/build' make[2]: Entering directory '/tmp/B.kaosb__p/BUILD/domoticz-2022.1/build' [ 7%] Building CXX object CMakeFiles/domoticz.dir/main/mainworker.cpp.o /usr/bin/i686-pld-linux-g++ -DENABLE_PYTHON -DHAVE_EXECINFO_H -DHAVE_LINUX_I2C -DHAVE_LINUX_SPI -DWITH_EXTERNAL_TINYXPATH -DWITH_GPIO -DWITH_LIBUSB -DWITH_OPENZWAVE -DWITH_TLS -DWWW_ENABLE_SSL -D_FILE_OFFSET_BITS=64 -I/usr/include/lua5.3 -I/usr/include/python3.10 -I/tmp/B.kaosb__p/BUILD/domoticz-2022.1/main -I/usr/include/jsoncpp -I/usr/include/minizip -I/usr/include/tinyxpath -I/usr/include/openzwave -O2 -fwrapv -pipe -Wformat -Werror=format-security -gdwarf-4 -fno-debug-types-section -fvar-tracking-assignments -g2 -Wp,-D_FORTIFY_SOURCE=2 -fstack-protector-strong --param=ssp-buffer-size=4 -Werror=trampolines -fomit-frame-pointer -march=i686 -fasynchronous-unwind-tables -mtune=pentium4 -gdwarf-4 -fno-debug-types-section -fvar-tracking-assignments -g2 -DPYTHON_LIBDIR=\"/usr/lib\" -Wno-psabi -rdynamic -O2 -fwrapv -pipe -Wformat -Werror=format-security -gdwarf-4 -fno-debug-types-section -fvar-tracking-assignments -g2 -Wp,-D_FORTIFY_SOURCE=2 -fstack-protector-strong --param=ssp-buffer-size=4 -Werror=trampolines -fomit-frame-pointer -march=i686 -fasynchronous-unwind-tables -mtune=pentium4 -gdwarf-4 -fno-debug-types-section -fvar-tracking-assignments -g2 -DPYTHON_LIBDIR=\"/usr/lib\" -std=c++14 -Winvalid-pch -include /tmp/B.kaosb__p/BUILD/domoticz-2022.1/build/CMakeFiles/domoticz.dir/cmake_pch.hxx -MD -MT CMakeFiles/domoticz.dir/main/mainworker.cpp.o -MF CMakeFiles/domoticz.dir/main/mainworker.cpp.o.d -o CMakeFiles/domoticz.dir/main/mainworker.cpp.o -c /tmp/B.kaosb__p/BUILD/domoticz-2022.1/main/mainworker.cpp In file included from /tmp/B.kaosb__p/BUILD/domoticz-2022.1/main/../hardware/plugins/PythonObjects.h:4, from /tmp/B.kaosb__p/BUILD/domoticz-2022.1/main/../hardware/plugins/Plugins.h:6, from /tmp/B.kaosb__p/BUILD/domoticz-2022.1/main/mainworker.cpp:132: /tmp/B.kaosb__p/BUILD/domoticz-2022.1/main/../hardware/plugins/DelayedLink.h:397: warning: "Py_RETURN_NONE" redefined 397 | #define Py_RETURN_NONE return Py_INCREF(Py_None), Py_None | In file included from /usr/include/python3.10/Python.h:74, from /tmp/B.kaosb__p/BUILD/domoticz-2022.1/main/../hardware/plugins/DelayedLink.h:12: /usr/include/python3.10/object.h:613: note: this is the location of the previous definition 613 | #define Py_RETURN_NONE return Py_NewRef(Py_None) | make[2]: Leaving directory '/tmp/B.kaosb__p/BUILD/domoticz-2022.1/build' make[2]: Entering directory '/tmp/B.kaosb__p/BUILD/domoticz-2022.1/build' [ 11%] Building CXX object CMakeFiles/domoticz.dir/main/SQLHelper.cpp.o /usr/bin/i686-pld-linux-g++ -DENABLE_PYTHON -DHAVE_EXECINFO_H -DHAVE_LINUX_I2C -DHAVE_LINUX_SPI -DWITH_EXTERNAL_TINYXPATH -DWITH_GPIO -DWITH_LIBUSB -DWITH_OPENZWAVE -DWITH_TLS -DWWW_ENABLE_SSL -D_FILE_OFFSET_BITS=64 -I/usr/include/lua5.3 -I/usr/include/python3.10 -I/tmp/B.kaosb__p/BUILD/domoticz-2022.1/main -I/usr/include/jsoncpp -I/usr/include/minizip -I/usr/include/tinyxpath -I/usr/include/openzwave -O2 -fwrapv -pipe -Wformat -Werror=format-security -gdwarf-4 -fno-debug-types-section -fvar-tracking-assignments -g2 -Wp,-D_FORTIFY_SOURCE=2 -fstack-protector-strong --param=ssp-buffer-size=4 -Werror=trampolines -fomit-frame-pointer -march=i686 -fasynchronous-unwind-tables -mtune=pentium4 -gdwarf-4 -fno-debug-types-section -fvar-tracking-assignments -g2 -DPYTHON_LIBDIR=\"/usr/lib\" -Wno-psabi -rdynamic -O2 -fwrapv -pipe -Wformat -Werror=format-security -gdwarf-4 -fno-debug-types-section -fvar-tracking-assignments -g2 -Wp,-D_FORTIFY_SOURCE=2 -fstack-protector-strong --param=ssp-buffer-size=4 -Werror=trampolines -fomit-frame-pointer -march=i686 -fasynchronous-unwind-tables -mtune=pentium4 -gdwarf-4 -fno-debug-types-section -fvar-tracking-assignments -g2 -DPYTHON_LIBDIR=\"/usr/lib\" -std=c++14 -Winvalid-pch -include /tmp/B.kaosb__p/BUILD/domoticz-2022.1/build/CMakeFiles/domoticz.dir/cmake_pch.hxx -MD -MT CMakeFiles/domoticz.dir/main/SQLHelper.cpp.o -MF CMakeFiles/domoticz.dir/main/SQLHelper.cpp.o.d -o CMakeFiles/domoticz.dir/main/SQLHelper.cpp.o -c /tmp/B.kaosb__p/BUILD/domoticz-2022.1/main/SQLHelper.cpp In file included from /tmp/B.kaosb__p/BUILD/domoticz-2022.1/main/../hardware/plugins/PythonObjects.h:4, from /tmp/B.kaosb__p/BUILD/domoticz-2022.1/main/../hardware/plugins/Plugins.h:6, from /tmp/B.kaosb__p/BUILD/domoticz-2022.1/main/SQLHelper.cpp:27: /tmp/B.kaosb__p/BUILD/domoticz-2022.1/main/../hardware/plugins/DelayedLink.h:397: warning: "Py_RETURN_NONE" redefined 397 | #define Py_RETURN_NONE return Py_INCREF(Py_None), Py_None | In file included from /usr/include/python3.10/Python.h:74, from /tmp/B.kaosb__p/BUILD/domoticz-2022.1/main/../hardware/plugins/DelayedLink.h:12: /usr/include/python3.10/object.h:613: note: this is the location of the previous definition 613 | #define Py_RETURN_NONE return Py_NewRef(Py_None) | make[2]: Leaving directory '/tmp/B.kaosb__p/BUILD/domoticz-2022.1/build' make[2]: Entering directory '/tmp/B.kaosb__p/BUILD/domoticz-2022.1/build' [ 12%] Building CXX object CMakeFiles/domoticz.dir/main/WebServer.cpp.o /usr/bin/i686-pld-linux-g++ -DENABLE_PYTHON -DHAVE_EXECINFO_H -DHAVE_LINUX_I2C -DHAVE_LINUX_SPI -DWITH_EXTERNAL_TINYXPATH -DWITH_GPIO -DWITH_LIBUSB -DWITH_OPENZWAVE -DWITH_TLS -DWWW_ENABLE_SSL -D_FILE_OFFSET_BITS=64 -I/usr/include/lua5.3 -I/usr/include/python3.10 -I/tmp/B.kaosb__p/BUILD/domoticz-2022.1/main -I/usr/include/jsoncpp -I/usr/include/minizip -I/usr/include/tinyxpath -I/usr/include/openzwave -O2 -fwrapv -pipe -Wformat -Werror=format-security -gdwarf-4 -fno-debug-types-section -fvar-tracking-assignments -g2 -Wp,-D_FORTIFY_SOURCE=2 -fstack-protector-strong --param=ssp-buffer-size=4 -Werror=trampolines -fomit-frame-pointer -march=i686 -fasynchronous-unwind-tables -mtune=pentium4 -gdwarf-4 -fno-debug-types-section -fvar-tracking-assignments -g2 -DPYTHON_LIBDIR=\"/usr/lib\" -Wno-psabi -rdynamic -O2 -fwrapv -pipe -Wformat -Werror=format-security -gdwarf-4 -fno-debug-types-section -fvar-tracking-assignments -g2 -Wp,-D_FORTIFY_SOURCE=2 -fstack-protector-strong --param=ssp-buffer-size=4 -Werror=trampolines -fomit-frame-pointer -march=i686 -fasynchronous-unwind-tables -mtune=pentium4 -gdwarf-4 -fno-debug-types-section -fvar-tracking-assignments -g2 -DPYTHON_LIBDIR=\"/usr/lib\" -std=c++14 -Winvalid-pch -include /tmp/B.kaosb__p/BUILD/domoticz-2022.1/build/CMakeFiles/domoticz.dir/cmake_pch.hxx -MD -MT CMakeFiles/domoticz.dir/main/WebServer.cpp.o -MF CMakeFiles/domoticz.dir/main/WebServer.cpp.o.d -o CMakeFiles/domoticz.dir/main/WebServer.cpp.o -c /tmp/B.kaosb__p/BUILD/domoticz-2022.1/main/WebServer.cpp In file included from /tmp/B.kaosb__p/BUILD/domoticz-2022.1/main/../hardware/plugins/PythonObjects.h:4, from /tmp/B.kaosb__p/BUILD/domoticz-2022.1/main/../hardware/plugins/Plugins.h:6, from /tmp/B.kaosb__p/BUILD/domoticz-2022.1/main/WebServer.cpp:55: /tmp/B.kaosb__p/BUILD/domoticz-2022.1/main/../hardware/plugins/DelayedLink.h:397: warning: "Py_RETURN_NONE" redefined 397 | #define Py_RETURN_NONE return Py_INCREF(Py_None), Py_None | In file included from /usr/include/python3.10/Python.h:74, from /tmp/B.kaosb__p/BUILD/domoticz-2022.1/main/../hardware/plugins/DelayedLink.h:12: /usr/include/python3.10/object.h:613: note: this is the location of the previous definition 613 | #define Py_RETURN_NONE return Py_NewRef(Py_None) | make[2]: Leaving directory '/tmp/B.kaosb__p/BUILD/domoticz-2022.1/build' make[1]: *** [CMakeFiles/Makefile2:88: CMakeFiles/domoticz.dir/all] Error 2 make: *** [Makefile:159: all] Error 2 error: Bad exit status from /tmp/B.kaosb__p/BUILD/tmp/rpm-tmp.TVFwfu (%build) RPM build warnings: Could not canonicalize hostname: nereid RPM build errors: Bad exit status from /tmp/B.kaosb__p/BUILD/tmp/rpm-tmp.TVFwfu (%build) ended at: Thu Nov 3 12:10:38 2022, done in 0:01:20.197622 error: No files produced. + chmod -R u+rwX /tmp/B.kaosb__p/BUILD + rm -rf /tmp/B.kaosb__p/tmp /tmp/B.kaosb__p/BUILD + rm -rf /tmp/B.kaosb__p Begin-PLD-Builder-Info Build-Time: user:371.71s sys:26.17s real:102.09s (faults io:53 non-io:3529983) End-PLD-Builder-Info
[Back to list of logs] [View rpm -qa of builder]