FailedOk

th/SRPMS[OK]
th/x32[OK]
th/i686[OK]
th/x86_64[OK]

ac/SRPMS[OK]
ac/i386[OK]
ac/i586[OK]
ac/i686[OK]
ac/alpha[OK]
ac/amd64[OK]
ac/athlon[OK]
ac/ppc[OK]
ac/sparc[OK]
ac/sparc64[OK]

Advanced Search
main()
Powered by PLD Linux
(c) 2002-2017 PLD Team
$Revision: 1.37 $
Powered by PDP-11.
Your IP: 54.234.255.29

dotnet-gnome-sharp e8c9c952-8168-44e5-b566-17f0d0611f3a

Status:Failed
Source URL:ftp://buildlogs.pld-linux.org/th/i686/FAIL/dotnet-gnome-sharp,e8c9c952-8168-44e5-b566-17f0d0611f3a.bz2
text/plain URL:View!
full text:View!
rpm -qa of builder:View!
Date:2017/11/29 21:16:24
Runtime:0:00:14.231188

Toc:

  • error 1
  • generated/CanvasPathDef.custom(24,67): error CS1502: The best overloaded method match for `Gnome.CanvasPathDef.gnome_canvas_path_def_new_from_bpath(System.IntPtr)' has some invalid arguments
  • error 2
  • generated/CanvasPathDef.custom(24,109): error CS1615: Argument `#1' does not require `ref' modifier. Consider removing `ref' modifier
  • error 3
  • error: Bad exit status from /tmp/B.Q4f9gZ/BUILD/tmp/rpm-tmp.57078 (%build)
  • error 4
  • RPM build errors:
  • error 5
  • error: No files produced.

Content:

Defaulting VolumeOpCallback param to 'call' scope in method Volume.Eject

Generation Summary:
  Enums: 28  Structs: 5  Boxed: 0  Opaques: 12  Interfaces: 0  Objects: 5  Callbacks: 11
  Properties: 0  Signals: 9  Methods: 276  Constructors: 7  Throttled: 21
Total Nodes: 374

cp ../gtk-sharp.snk .
cp ../AssemblyInfo.cs .
/usr/bin/mcs -define:GTK_SHARP_2_6 -define:GTK_SHARP_2_8 -define:GNOME_SHARP_2_16 -define:GNOME_SHARP_2_20 -define:GNOME_SHARP_2_24 -nowarn:0169,0612,0618 -unsafe -out:gnome-vfs-sharp.dll -target:library -r:/usr/lib/pkgconfig/../../lib/mono/gtk-sharp-2.0/pango-sharp.dll -r:/usr/lib/pkgconfig/../../lib/mono/gtk-sharp-2.0/atk-sharp.dll -r:/usr/lib/pkgconfig/../../lib/mono/gtk-sharp-2.0/gdk-sharp.dll -r:/usr/lib/pkgconfig/../../lib/mono/gtk-sharp-2.0/gtk-sharp.dll -r:/usr/lib/pkgconfig/../../lib/mono/gtk-sharp-2.0/glib-sharp.dll  -r:Mono.Cairo generated/*.cs  ./Async.cs  ./AsyncCallback.cs  ./AsyncCallbackNative.cs  ./AsyncDirectoryLoadCallback.cs  ./AsyncDirectoryLoadCallbackNative.cs  ./AsyncReadCallback.cs  ./AsyncReadCallbackNative.cs  ./AsyncWriteCallback.cs  ./AsyncWriteCallbackNative.cs  ./Directory.cs  ./FileInfo.cs  ./MimeType.cs  ./ModuleCallback.cs  ./ModuleCallbackAuthentication.cs  ./ModuleCallbackFillAuthentication.cs  ./ModuleCallbackFullAuthentication.cs  ./ModuleCallbackSaveAuthentication.cs  ./ModuleCallbackStatusMessage.cs  ./Monitor.cs  ./Sync.cs  ./Vfs.cs  ./VfsException.cs  ./VfsStream.cs  ./VfsStreamAsyncResult.cs  ./Xfer.cs  ./XferProgressCallback.cs  ./XferProgressCallbackNative.cs AssemblyInfo.cs
AssemblyInfo.cs(6,11): warning CS1699: Use compiler option `keyfile' or appropriate project settings instead of `AssemblyKeyFile' attribute
./VfsStream.cs(33,18): warning CS0649: Field `Gnome.Vfs.VfsStreamAsync.state' is never assigned to, and will always have its default value `null'
./VfsStream.cs(118,20): warning CS0414: The private field `Gnome.Vfs.VfsStream.mode' is assigned but its value is never used
Compilation succeeded - 3 warning(s)
sed -e "s/@ASSEMBLY_NAME@/gnome-vfs-sharp/" -e "s/@POLICY@/2.4/" ../policy.config > policy.2.4.config
/usr/bin/al -link:policy.2.4.config -out:policy.2.4.gnome-vfs-sharp.dll -keyfile:gtk-sharp.snk
ALINK: warning A99999: Path 'policy.2.4.config' in the resource name is not supported. Using just file name 'policy.2.4.config'
sed -e "s/@ASSEMBLY_NAME@/gnome-vfs-sharp/" -e "s/@POLICY@/2.6/" ../policy.config > policy.2.6.config
/usr/bin/al -link:policy.2.6.config -out:policy.2.6.gnome-vfs-sharp.dll -keyfile:gtk-sharp.snk
ALINK: warning A99999: Path 'policy.2.6.config' in the resource name is not supported. Using just file name 'policy.2.6.config'
sed -e "s/@ASSEMBLY_NAME@/gnome-vfs-sharp/" -e "s/@POLICY@/2.8/" ../policy.config > policy.2.8.config
/usr/bin/al -link:policy.2.8.config -out:policy.2.8.gnome-vfs-sharp.dll -keyfile:gtk-sharp.snk
ALINK: warning A99999: Path 'policy.2.8.config' in the resource name is not supported. Using just file name 'policy.2.8.config'
sed -e "s/@ASSEMBLY_NAME@/gnome-vfs-sharp/" -e "s/@POLICY@/2.16/" ../policy.config > policy.2.16.config
/usr/bin/al -link:policy.2.16.config -out:policy.2.16.gnome-vfs-sharp.dll -keyfile:gtk-sharp.snk
ALINK: warning A99999: Path 'policy.2.16.config' in the resource name is not supported. Using just file name 'policy.2.16.config'
sed -e "s/@ASSEMBLY_NAME@/gnome-vfs-sharp/" -e "s/@POLICY@/2.20/" ../policy.config > policy.2.20.config
/usr/bin/al -link:policy.2.20.config -out:policy.2.20.gnome-vfs-sharp.dll -keyfile:gtk-sharp.snk
ALINK: warning A99999: Path 'policy.2.20.config' in the resource name is not supported. Using just file name 'policy.2.20.config'
make[3]: Leaving directory '/tmp/B.Q4f9gZ/BUILD/gnome-sharp-2.24.5/gnomevfs'
make[2]: Leaving directory '/tmp/B.Q4f9gZ/BUILD/gnome-sharp-2.24.5/gnomevfs'
Making all in gnome
make[2]: Entering directory '/tmp/B.Q4f9gZ/BUILD/gnome-sharp-2.24.5/gnome'
Making all in .
make[3]: Entering directory '/tmp/B.Q4f9gZ/BUILD/gnome-sharp-2.24.5/gnome'
cp ./gnome-api.raw gnome-api.xml
chmod u+w gnome-api.xml
/usr/bin/gapi2-fixup --api=gnome-api.xml --metadata=./Gnome.metadata 
rm -f generated/* &&	\
/usr/bin/gapi2-codegen --generate gnome-api.xml \
-I:/usr/lib/pkgconfig/../../share/gapi-2.0/pango-api.xml -I:/usr/lib/pkgconfig/../../share/gapi-2.0/atk-api.xml -I:/usr/lib/pkgconfig/../../share/gapi-2.0/gdk-api.xml -I:/usr/lib/pkgconfig/../../share/gapi-2.0/gtk-api.xml -I:/usr/lib/pkgconfig/../../share/gapi-2.0/glib-api.xml  -I:../art/art-api.xml  -I:../gnomevfs/gnome-vfs-api.xml	\
--outdir=generated --customdir=. --assembly-name=gnome-sharp	\
--gluelib-name=gnomesharpglue-2 --glue-filename=glue/generated.c		\
--glue-includes=gnome.h						\
&& touch generated-stamp
Simple type element art_u8 has no specified default value
Simple type element art_u32 has no specified default value
rettype: GOptionGroup*rettype: GOptionGroup* in callback GnomeModuleGetGOptionGroupFunc
rettype: poptContext in method Preinit in type Gnome.Program
Ellipsis parameter in gnome_program_init  in method Init in type Gnome.Program
Name: parms Type: GParameter* in gnome_program_init_paramv  in method InitParamv in type Gnome.Program
Name: pclass Type: GnomeProgramClass* in gnome_program_install_property  in method InstallProperty in type Gnome.Program
Name: Pass Type: /* in gnome_score_log  in method Log in type Gnome.Score
Ellipsis parameter in gnome_triggers_add_trigger  in method AddTrigger in type Gnome.Triggers
Ellipsis parameter in gnome_triggers_do  in method Do in type Gnome.Triggers
Ellipsis parameter in gnome_canvas_item_set  in method Set in type Gnome.CanvasItem
Nameless signal in type Gnome.CanvasRichText
Property has unknown Type value_array in type Gnome.About
Property has unknown Type value_array in type Gnome.About
Name: behavior Type: BonoboDockItemBehavior in gnome_app_add_docked  in method AddDocked in type Gnome.App
Name: item Type: BonoboDockItem* in gnome_app_add_dock_item  in method AddDockItem in type Gnome.App
Name: behavior Type: BonoboDockItemBehavior in gnome_app_add_toolbar  in method AddToolbar in type Gnome.App
rettype: BonoboDockItem* in method GetDockItemByName in type Gnome.App
Name: dock_item Type: BonoboDockItem* in gnome_app_setup_toolbar  in method SetupToolbar in type Gnome.App
rettype: BonoboDock* in method GetDock in type Gnome.App
Ellipsis parameter in gnome_client_add_static_arg  in method AddStaticArg in type Gnome.Client
Name: pid Type: pid_t in gnome_client_set_process_id  in method SetProcessId in type Gnome.Client
rettype: GtkVisibility in method IconIsVisible in type Gnome.IconList
Name: Name Type: /* in gnome_scores_display  in method Display in type Gnome.Scores
Name: options Type: poptOption* in gnome_init_with_popt_table  in method InitWithPoptTable in type Gnome.Global
Defaulting CallbackMarshal param to 'call' scope in method App.CreateToolbarInterp
Defaulting DestroyNotify param to 'call' scope in method App.CreateToolbarInterp
Defaulting CallbackMarshal param to 'call' scope in method App.CreateMenusInterp
Defaulting DestroyNotify param to 'call' scope in method App.CreateMenusInterp
Defaulting CallbackMarshal param to 'call' scope in method App.InsertMenusInterp
Defaulting DestroyNotify param to 'call' scope in method App.InsertMenusInterp
Defaulting CallbackMarshal param to 'call' scope in method Client.RequestInteractionInterp
Defaulting DestroyNotify param to 'call' scope in method Client.RequestInteractionInterp
Defaulting InteractFunction param to 'call' scope in method Client.RequestInteraction
Defaulting ThemeFileLineFunc param to 'call' scope in method ThemeFile.ForeachKey
Defaulting ThemeFileSectionFunc param to 'call' scope in method ThemeFile.ForeachSection
Defaulting GdkPixbufLoadCallback param to 'call' scope in method GdkHelper.PixbufNewFromUriAsync
Defaulting GdkPixbufDoneCallback param to 'call' scope in method GdkHelper.PixbufNewFromUriAsync
Defaulting MenuPositionFunc param to 'call' scope in method Popup.MenuDoPopup
Defaulting MenuPositionFunc param to 'call' scope in method Popup.MenuDoPopupModal

Generation Summary:
  Enums: 23  Structs: 7  Boxed: 0  Opaques: 9  Interfaces: 0  Objects: 39  Callbacks: 10
  Properties: 210  Signals: 46  Methods: 447  Constructors: 27  Throttled: 19
Total Nodes: 837

cp ../gtk-sharp.snk .
cp ../AssemblyInfo.cs .
/usr/bin/mcs -define:GTK_SHARP_2_6 -define:GTK_SHARP_2_8 -define:GNOME_SHARP_2_16 -define:GNOME_SHARP_2_20 -define:GNOME_SHARP_2_24 -nowarn:0169,0612,0618 -unsafe -out:gnome-sharp.dll -target:library -r:/usr/lib/pkgconfig/../../lib/mono/gtk-sharp-2.0/pango-sharp.dll -r:/usr/lib/pkgconfig/../../lib/mono/gtk-sharp-2.0/atk-sharp.dll -r:/usr/lib/pkgconfig/../../lib/mono/gtk-sharp-2.0/gdk-sharp.dll -r:/usr/lib/pkgconfig/../../lib/mono/gtk-sharp-2.0/gtk-sharp.dll -r:/usr/lib/pkgconfig/../../lib/mono/gtk-sharp-2.0/glib-sharp.dll  /r:../art/art-sharp.dll  /r:../gnomevfs/gnome-vfs-sharp.dll -r:Mono.Cairo generated/*.cs  ./BonoboUIVerb.cs  ./IconTheme.cs  ./Modules.cs AssemblyInfo.cs
AssemblyInfo.cs(6,11): warning CS1699: Use compiler option `keyfile' or appropriate project settings instead of `AssemblyKeyFile' attribute
generated/App.cs(124,17): warning CS0108: `Gnome.App.Name' hides inherited member `Gtk.Widget.Name'. Use the new keyword if hiding was intended
/usr/lib/pkgconfig/../../lib/mono/gtk-sharp-2.0/gtk-sharp.dll (Location of the symbol related to previous warning)
generated/ThemeFile.cs(56,26): warning CS0809: Obsolete member `Gnome.ThemeFile.ToString()' overrides non-obsolete member `object.ToString()'
/usr/lib/mono/4.5/mscorlib.dll (Location of the symbol related to previous warning)
generated/CanvasPathDef.custom(24,67): error CS1502: The best overloaded method match for `Gnome.CanvasPathDef.gnome_canvas_path_def_new_from_bpath(System.IntPtr)' has some invalid arguments
generated/CanvasPathDef.cs(263,24): (Location of the symbol related to previous error)
generated/CanvasPathDef.custom(24,109): error CS1615: Argument `#1' does not require `ref' modifier. Consider removing `ref' modifier
Compilation failed: 2 error(s), 3 warnings
make[3]: *** [Makefile:845: gnome-sharp.dll] Error 1
make[3]: Leaving directory '/tmp/B.Q4f9gZ/BUILD/gnome-sharp-2.24.5/gnome'
make[2]: *** [Makefile:539: all-recursive] Error 1
make[2]: Leaving directory '/tmp/B.Q4f9gZ/BUILD/gnome-sharp-2.24.5/gnome'
make[1]: *** [Makefile:452: all-recursive] Error 1
make[1]: Leaving directory '/tmp/B.Q4f9gZ/BUILD/gnome-sharp-2.24.5'
make: *** [Makefile:380: all] Error 2
error: Bad exit status from /tmp/B.Q4f9gZ/BUILD/tmp/rpm-tmp.57078 (%build)


RPM build errors:
    Bad exit status from /tmp/B.Q4f9gZ/BUILD/tmp/rpm-tmp.57078 (%build)
ended at: Wed Nov 29 21:16:24 2017, done in 0:00:14.231188
error: No files produced.
+ chmod -R u+rwX /tmp/B.Q4f9gZ/BUILD
+ rm -rf /tmp/B.Q4f9gZ/tmp /tmp/B.Q4f9gZ/BUILD
+ rm -rf /tmp/B.Q4f9gZ
Begin-PLD-Builder-Info
Build-Time: user:11.22s sys:0.99s real:18.25s (faults io:2 non-io:596536)

End-PLD-Builder-Info
[Back to list of logs] [View rpm -qa of builder]