FailedOk

th/SRPMS[OK]
th/x32[OK]
th/i686[OK]
th/x86_64[OK]

ac/SRPMS[OK]
ac/i386[OK]
ac/i586[OK]
ac/i686[OK]
ac/alpha[OK]
ac/amd64[OK]
ac/athlon[OK]
ac/ppc[OK]
ac/sparc[OK]
ac/sparc64[OK]

Advanced Search
main()
Powered by PLD Linux
(c) 2002-2021 PLD Team
$Revision: 1.37 $
Powered by overclock.
Your IP: 3.232.133.141

dovecot C5D416B4-0B6A-4770-A164-9685CC79200A

Status:Failed
Source URL:https://buildlogs.pld-linux.org/pld/th/i686/FAIL/dovecot,C5D416B4-0B6A-4770-A164-9685CC79200A.bz2
text/plain URL:View!
full text:View!
rpm -qa of builder:View!
Date:2021/01/05 12:34:41
Runtime:0:03:18.776537

Toc:

  • error 1
  • Error: Raw backtrace: ./test-lib() [0x808fd7b] -> ./test-lib() [0x808fed2] -> ./test-lib() [0x809ba9a] -> ./test-lib() [0x809badc] -> ./test-lib() [0x804db4f] -> ./test-lib() [0x8055516] -> ./test-lib() [0x808a600] -> ./test-lib() [0x808daca] -> ./test-lib() [0x808e6e6] -> ./test-lib() [0x8055dc6] -> /lib/libc.so.6(__libc_start_main+0x129) [0xf7d40fae] -> ./test-lib() [0x8055f56]
  • error 2
  • make[4]: *** [Makefile:3537: check-local] Error 1
  • error 3
  • make[3]: *** [Makefile:2893: check-am] Error 2
  • error 4
  • make[2]: *** [Makefile:2895: check] Error 2
  • error 5
  • make[1]: *** [Makefile:564: check-recursive] Error 1
  • error 6
  • error: Bad exit status from /tmp/B.yU4y4E/BUILD/tmp/rpm-tmp.99543 (%build)
  • error 7
  • RPM build errors:
  • error 8
  • error: No files produced.

Content:

mempool overflow - uint32max_array_t ................................. : ok
mempool overflow - char .............................................. : ok
mempool overflow - uint32_t .......................................... : ok
mempool_alloconly .................................................... : ok
mempool_allocfree .................................................... : ok
net_is_in_network() .................................................. : ok
net_ip2addr() ........................................................ : ok
net_str2hostport() ................................................... : ok
net_*_unix() - long paths ............................................ : ok
numpack (good) ....................................................... : ok
numpack (bad) ........................................................ : ok
ostream buffer pwrite random ......................................... : ok
ostream buffer size/available ........................................ : ok
ostream failure at ................................................... : ok
ostream pwrite random ................................................ : ok
ostream file send istream file ....................................... : ok
ostream file send istream sendfile() ................................. : ok
ostream multiplex (simple) ........................................... : ok
ostream multiplex (stream) ........................................... : ok
ostream multiplex (corking) .......................................... : ok
ostream multiplex hang ............................................... : ok
ostream multiplex flush callback ..................................... : ok
test multiplex (stream) .............................................. : ok
test_path_util ....................................................... : ok
pkcs5_pbkdf2 ......................................................... : ok
primes_closest() ..................................................... : ok
printf_format_fix(safe) .............................................. : ok
printf_format_fix(rewrites) .......................................... : ok
priorityq ............................................................ : ok
priorityq randomized ................................................. : ok
test_random (median & average) ....................................... : ok
random limits ........................................................ : ok
seq_range_array_add() merging ........................................ : ok
seq_range_array_merge_n() ............................................ : ok
seq_range_array_remove_nth() ......................................... : ok
seq_range_array_remove_range() ....................................... : ok
seq_range_array_invert() ............................................. : ok
seq_range_array_invert() edges ....................................... : ok
seq_range_array_have_common() ........................................ : ok
seq_range_array random ............................................... : ok
stats_dists 0 ........................................................ : ok
stats_dists 1 ........................................................ : ok
stats_dists 2 ........................................................ : ok
stats_dists large .................................................... : ok
stats_dists_get_variance ............................................. : ok
str_append_*() ....................................................... : ok
str_c() .............................................................. : ok
str_insert() ......................................................... : ok
str_delete() ......................................................... : ok
str_append_max() ..................................................... : ok
str_truncate() ....................................................... : ok
str_truncate_utf8() .................................................. : ok
str_escape ........................................................... : ok
str_nescape .......................................................... : ok
str_unescape ......................................................... : ok
str_unescape_next .................................................... : ok
str_tabescape ........................................................ : ok
string tabescaping ................................................... : ok
*_strsplit_tabescaped() .............................................. : ok
*_strsplit_tabescaped_inplace() ...................................... : ok
p_strdup() ........................................................... : ok
p_strdup_empty() ..................................................... : ok
p_strdup_until() ..................................................... : ok
p_strarray_dup ....................................................... : ok
t_strsplit ........................................................... : ok
t_strsplit_spaces .................................................... : ok
t_str_replace ........................................................ : ok
t_str_oneline ........................................................ : ok
t_str_trim ........................................................... : ok
t_str_ltrim .......................................................... : ok
t_str_rtrim .......................................................... : ok
t_strarray_join() .................................................... : ok
p_array_const_string_join() .......................................... : ok
mem_equals_timing_safe() ............................................. : ok
str_equals_timing_almost_safe() ...................................... : ok
dec2str_buf() ........................................................ : ok
str_match ............................................................ : ok
str_begins ........................................................... : ok
str_to_uintmax in range .............................................. : ok
str_to_uintmax overflow corner case .................................. : ok
str_to_uintmax_hex in range .......................................... : ok
str_to_uintmax_hex overflow corner case .............................. : ok
str_to_uintmax_oct in range .......................................... : ok
str_to_uintmax_oct overflow corner case .............................. : ok
str_to_uint64 ........................................................ : ok
str_to_uint32 ........................................................ : ok
str_to_llong ......................................................... : ok
str_to_int ........................................................... : ok
str_is_float accepts integer ......................................... : ok
str_is_float accepts float ........................................... : ok
str_is_float refuses invalid values .................................. : ok
str_find() ........................................................... : ok
str_sanitize ......................................................... : ok
str_sanitize_append .................................................. : ok
str_sanitize_utf8 .................................................... : ok
str_sanitize_append_utf8 ............................................. : ok
str_table ............................................................ : ok
timeval_cmp() ........................................................ : ok
Panic: file time-util.c: line 65 (timeval_cmp_margin): assertion failed: (usecs_diff >= 0)
Error: Raw backtrace: ./test-lib() [0x808fd7b] -> ./test-lib() [0x808fed2] -> ./test-lib() [0x809ba9a] -> ./test-lib() [0x809badc] -> ./test-lib() [0x804db4f] -> ./test-lib() [0x8055516] -> ./test-lib() [0x808a600] -> ./test-lib() [0x808daca] -> ./test-lib() [0x808e6e6] -> ./test-lib() [0x8055dc6] -> /lib/libc.so.6(__libc_start_main+0x129) [0xf7d40fae] -> ./test-lib() [0x8055f56]
Aborted 
make[4]: *** [Makefile:3537: check-local] Error 1
make[4]: Leaving directory '/tmp/B.yU4y4E/BUILD/dovecot-2.3.13/src/lib'
make[3]: *** [Makefile:2893: check-am] Error 2
make[2]: *** [Makefile:2895: check] Error 2
make[1]: *** [Makefile:564: check-recursive] Error 1
make: *** [Makefile:685: check-recursive] Error 1
error: Bad exit status from /tmp/B.yU4y4E/BUILD/tmp/rpm-tmp.99543 (%build)


RPM build errors:
    Bad exit status from /tmp/B.yU4y4E/BUILD/tmp/rpm-tmp.99543 (%build)
ended at: Tue Jan  5 12:34:39 2021, done in 0:03:18.776537
error: No files produced.
+ chmod -R u+rwX /tmp/B.yU4y4E/BUILD
+ rm -rf /tmp/B.yU4y4E/tmp /tmp/B.yU4y4E/BUILD
+ rm -rf /tmp/B.yU4y4E
Begin-PLD-Builder-Info
Build-Time: user:459.93s sys:121.86s real:203.87s (faults io:1334 non-io:24964272)

End-PLD-Builder-Info
[Back to list of logs] [View rpm -qa of builder]