FailedOk

th/SRPMS[OK]
th/x32[OK]
th/i686[OK]
th/x86_64[OK]

ac/SRPMS[OK]
ac/i386[OK]
ac/i586[OK]
ac/i686[OK]
ac/alpha[OK]
ac/amd64[OK]
ac/athlon[OK]
ac/ppc[OK]
ac/sparc[OK]
ac/sparc64[OK]

Advanced Search
main()
Powered by PLD Linux
(c) 2002-2018 PLD Team
$Revision: 1.37 $
Powered by Ken.
Your IP: 54.92.211.239

firefox 0ec64e02-fae6-4dd7-9c11-af61392f70d2

Status:Failed
Source URL:ftp://buildlogs.pld-linux.org/th/i686/FAIL/firefox,0ec64e02-fae6-4dd7-9c11-af61392f70d2.bz2
text/plain URL:View!
full text:View!
rpm -qa of builder:View!
Date:2018/07/07 20:23:18
Runtime:0:31:15.714317

Toc:

  • error 1
  • 30:15.25 clang-6.0: error: linker command failed with exit code 1 (use -v to see invocation)
  • error 2
  • 30:15.25 gmake[4]: *** [/tmp/B.1eDew_/BUILD/firefox-61.0.1/config/rules.mk:681: libxul.so] Error 1
  • error 3
  • 30:15.25 gmake[3]: *** [/tmp/B.1eDew_/BUILD/firefox-61.0.1/config/recurse.mk:73: toolkit/library/target] Error 2
  • error 4
  • 30:43.25 gmake[2]: *** [/tmp/B.1eDew_/BUILD/firefox-61.0.1/config/recurse.mk:33: compile] Error 2
  • error 5
  • 30:43.25 gmake[1]: *** [/tmp/B.1eDew_/BUILD/firefox-61.0.1/config/rules.mk:418: default] Error 2
  • error 6
  • error: Bad exit status from /tmp/B.1eDew_/BUILD/tmp/rpm-tmp.2864 (%build)
  • error 7
  • RPM build errors:
  • error 8
  • error: No files produced.

Content:

27:19.11    Compiling unicode-normalization v0.1.5
27:20.69    Compiling version_check v0.1.3
27:22.51 libmozavcodec.so
27:22.64    Compiling semver-parser v0.7.0
27:22.65 security/sandbox/linux/launch
27:24.97    Compiling build_const v0.2.0
27:25.68    Compiling bitflags v1.0.1
27:25.93    Compiling libc v0.2.39
27:26.27 gfx/angle/targets/translator
27:27.52    Compiling typeable v0.1.2
27:27.76    Compiling percent-encoding v1.0.0
27:28.63    Compiling podio v0.1.5
27:29.01    Compiling unicode-width v0.1.4
27:29.21    Compiling regex-syntax v0.4.1
27:29.32    Compiling adler32 v1.0.2
27:29.89 dom/ipc
27:35.09    Compiling cc v1.0.9
27:41.36    Compiling matches v0.1.6
27:43.49    Compiling httparse v1.2.3
27:43.51 security/sandbox/linux/glue
27:44.64    Compiling num-traits v0.2.0
27:46.60    Compiling utf8-ranges v1.0.0
27:47.14    Compiling geckodriver v0.20.1 (file:///tmp/B.1eDew_/BUILD/firefox-61.0.1/testing/geckodriver)
27:47.45    Compiling strsim v0.6.0
27:48.38    Compiling lazy_static v1.0.0
27:50.14    Compiling rustc-serialize v0.3.24
27:51.74    Compiling safemem v0.2.0
27:52.05    Compiling cfg-if v0.1.2
27:52.16    Compiling unreachable v1.0.0
27:52.29    Compiling unicase v1.4.2
27:52.72    Compiling semver v0.6.0
27:53.64    Compiling crc v1.7.0
27:53.92    Compiling rand v0.3.18
27:56.68    Compiling term_size v0.3.0
27:59.14    Compiling time v0.1.38
28:01.03    Compiling memchr v1.0.2
28:01.62    Compiling num_cpus v1.7.0
28:02.48    Compiling miniz_oxide v0.1.2
28:02.52    Compiling unicode-bidi v0.3.4
28:03.10    Compiling miniz_oxide_c_api v0.1.2
28:04.34    Compiling bzip2-sys v0.1.6
28:05.43    Compiling num-traits v0.1.43
28:05.44    Compiling base64 v0.6.0
28:05.68    Compiling log v0.4.1
28:07.64    Compiling thread_local v0.3.5
28:07.94    Compiling textwrap v0.9.0
28:10.09    Compiling tempdir v0.3.5
28:10.93    Compiling aho-corasick v0.6.3
28:10.95    Compiling uuid v0.1.18
28:11.91    Compiling cookie v0.10.1
28:11.91    Compiling msdos_time v0.1.5
28:15.90    Compiling num-integer v0.1.35
28:16.39    Compiling rust-ini v0.10.2
28:17.54    Compiling log v0.3.9
28:17.54    Compiling idna v0.1.4
28:18.43    Compiling clap v2.29.0
28:19.26    Compiling mozprofile v0.3.0 (file:///tmp/B.1eDew_/BUILD/firefox-61.0.1/testing/mozbase/rust/mozprofile)
28:19.37    Compiling regex v0.2.2
28:20.47    Compiling num-iter v0.1.34
28:21.09    Compiling mime v0.2.6
28:33.09    Compiling num v0.1.40
28:35.34    Compiling bzip2 v0.3.2
28:36.42    Compiling url v1.7.0
28:44.71    Compiling mozrunner v0.6.1 (file:///tmp/B.1eDew_/BUILD/firefox-61.0.1/testing/mozbase/rust/mozrunner)
28:44.71    Compiling flate2 v1.0.1
28:44.71    Compiling chrono v0.2.25
28:49.87    Compiling hyper v0.10.13
28:50.91    Compiling zip v0.3.1
28:51.07                                         if ( ! yyg->yy_did_buffer_switch_on_eof )
28:51.07                                                ^~~
28:51.17                                         if ( ! yyg->yy_did_buffer_switch_on_eof )
28:51.17                                                ^~~
28:51.70 /tmp/B.1eDew_/BUILD/firefox-61.0.1/gfx/angle/checkout/src/compiler/translator/glslang_tab.cpp:5043:6: warning: code will never be executed [-Wunreachable-code]
28:51.70      goto yyerrorlab;
28:51.70      ^~~~~~~~~~~~~~~
28:51.70 /tmp/B.1eDew_/BUILD/firefox-61.0.1/gfx/angle/checkout/src/compiler/translator/glslang_tab.cpp:5042:21: note: silence by adding parentheses to mark code as explicitly dead
28:51.70   if (/*CONSTCOND*/ 0)
28:51.70                     ^
28:51.70                     /* DISABLES CODE */ ( )
28:51.70 /tmp/B.1eDew_/BUILD/firefox-61.0.1/gfx/angle/checkout/src/compiler/translator/glslang_tab.cpp:2381:15: warning: code will never be executed [-Wunreachable-code]
28:51.70       yyssp = yyss + yysize - 1;
28:51.70               ^~~~
28:52.50    Compiling mozversion v0.1.3 (file:///tmp/B.1eDew_/BUILD/firefox-61.0.1/testing/mozbase/rust/mozversion)
28:52.80 2 warnings generated.
28:52.96 2 warnings generated.
28:53.08 dom/canvas
29:23.38    Compiling webdriver v0.35.0 (file:///tmp/B.1eDew_/BUILD/firefox-61.0.1/testing/webdriver)
29:24.87 warning: variant is never constructed: `Quit`
29:24.87   --> testing/webdriver/src/server.rs:23:5
29:24.87    |
29:24.87 23 |     Quit
29:24.87    |     ^^^^
29:24.87    |
29:24.87    = note: #[warn(dead_code)] on by default
29:35.43     Finished release [optimized] target(s) in 1665.82 secs
29:35.47 symverscript
29:35.48 toolkit/library
29:35.77 libxul.so
30:14.95 /usr/bin/ld: final link failed: Memory exhausted
30:15.25 clang-6.0: error: linker command failed with exit code 1 (use -v to see invocation)
30:15.25 gmake[4]: *** [/tmp/B.1eDew_/BUILD/firefox-61.0.1/config/rules.mk:681: libxul.so] Error 1
30:15.25 gmake[3]: *** [/tmp/B.1eDew_/BUILD/firefox-61.0.1/config/recurse.mk:73: toolkit/library/target] Error 2
30:15.25 gmake[3]: *** Waiting for unfinished jobs....
30:43.23     Finished release [optimized] target(s) in 212.9 secs
30:43.25 gmake[2]: *** [/tmp/B.1eDew_/BUILD/firefox-61.0.1/config/recurse.mk:33: compile] Error 2
30:43.25 gmake[1]: *** [/tmp/B.1eDew_/BUILD/firefox-61.0.1/config/rules.mk:418: default] Error 2
30:43.25 gmake: *** [client.mk:172: build] Error 2
30:43.28 157 compiler warnings present.
30:43.36 /usr/bin/notify-send --app-name=Mozilla Build System Mozilla Build System Build failed
error: Bad exit status from /tmp/B.1eDew_/BUILD/tmp/rpm-tmp.2864 (%build)


RPM build errors:
    Bad exit status from /tmp/B.1eDew_/BUILD/tmp/rpm-tmp.2864 (%build)
ended at: Sat Jul  7 20:23:02 2018, done in 0:31:15.714317
error: No files produced.
+ chmod -R u+rwX /tmp/B.1eDew_/BUILD
+ rm -rf /tmp/B.1eDew_/tmp /tmp/B.1eDew_/BUILD
+ rm -rf /tmp/B.1eDew_
Begin-PLD-Builder-Info
Build-Time: user:11886.94s sys:295.29s real:1951.37s (faults io:4 non-io:51592002)

End-PLD-Builder-Info
[Back to list of logs] [View rpm -qa of builder]