FailedOk

th/SRPMS[OK]
th/x32[OK]
th/i686[OK]
th/x86_64[OK]

ac/SRPMS[OK]
ac/i386[OK]
ac/i586[OK]
ac/i686[OK]
ac/alpha[OK]
ac/amd64[OK]
ac/athlon[OK]
ac/ppc[OK]
ac/sparc[OK]
ac/sparc64[OK]

Advanced Search
main()
Powered by PLD Linux
(c) 2002-2018 PLD Team
$Revision: 1.37 $
Powered by Parallel thinking.
Your IP: 54.81.254.212

firefox 180538b4-edab-48f3-9666-9aa1de5a621b

Status:Failed
Source URL:ftp://buildlogs.pld-linux.org/th/i686/FAIL/firefox,180538b4-edab-48f3-9666-9aa1de5a621b.bz2
text/plain URL:View!
full text:View!
rpm -qa of builder:View!
Date:2018/07/08 01:36:51
Runtime:0:32:29.912551

Toc:

  • error 1
  • 31:54.33 clang-6.0: error: linker command failed with exit code 1 (use -v to see invocation)
  • error 2
  • 31:54.33 gmake[4]: *** [/tmp/B.dHGDTA/BUILD/firefox-61.0.1/config/rules.mk:681: libxul.so] Error 1
  • error 3
  • 31:54.33 gmake[3]: *** [/tmp/B.dHGDTA/BUILD/firefox-61.0.1/config/recurse.mk:73: toolkit/library/target] Error 2
  • error 4
  • 31:54.33 gmake[2]: *** [/tmp/B.dHGDTA/BUILD/firefox-61.0.1/config/recurse.mk:33: compile] Error 2
  • error 5
  • 31:54.33 gmake[1]: *** [/tmp/B.dHGDTA/BUILD/firefox-61.0.1/config/rules.mk:418: default] Error 2
  • error 6
  • error: Bad exit status from /tmp/B.dHGDTA/BUILD/tmp/rpm-tmp.33815 (%build)
  • error 7
  • RPM build errors:
  • error 8
  • error: No files produced.

Content:

28:06.13    Compiling rustc-serialize v0.3.24
28:06.49    Compiling semver-parser v0.7.0
28:09.94 libmozavcodec.so
28:10.05 security/sandbox/linux/launch
28:12.14    Compiling byteorder v1.2.1
28:13.02 gfx/angle/targets/translator
28:13.37 brotli
28:14.77    Compiling libc v0.2.39
28:16.26    Compiling utf8-ranges v1.0.0
28:16.29    Compiling version_check v0.1.3
28:16.29    Compiling lazy_static v1.0.0
28:18.16    Compiling adler32 v1.0.2
28:18.49    Compiling regex-syntax v0.4.1
28:22.74    Compiling safemem v0.2.0
28:24.55    Compiling traitobject v0.1.0
28:28.17    Compiling podio v0.1.5
28:28.54    Compiling geckodriver v0.20.1 (file:///tmp/B.dHGDTA/BUILD/firefox-61.0.1/testing/geckodriver)
28:29.69    Compiling unicode-normalization v0.1.5
28:31.10    Compiling httparse v1.2.3
28:31.10    Compiling num-traits v0.2.0
28:31.10    Compiling cc v1.0.9
28:31.10    Compiling cfg-if v0.1.2
28:35.24    Compiling bitflags v1.0.1
28:35.49    Compiling unicode-width v0.1.4
28:40.58    Compiling language-tags v0.2.2
28:41.92    Compiling matches v0.1.6
28:42.17    Compiling build_const v0.2.0
28:46.72    Compiling unreachable v1.0.0
28:46.86    Compiling semver v0.6.0
28:48.67    Compiling term_size v0.3.0
28:49.02    Compiling rand v0.3.18
28:51.23    Compiling time v0.1.38
28:52.63    Compiling num_cpus v1.7.0
28:52.63    Compiling memchr v1.0.2
28:53.25    Compiling unicase v1.4.2
28:54.60    Compiling miniz_oxide v0.1.2
28:56.52    Compiling base64 v0.6.0
28:58.76    Compiling log v0.4.1
28:59.64    Compiling num-traits v0.1.43
28:59.88    Compiling miniz_oxide_c_api v0.1.2
29:00.20    Compiling bzip2-sys v0.1.6
29:00.26    Compiling unicode-bidi v0.3.4
29:01.11    Compiling crc v1.7.0
29:01.27    Compiling thread_local v0.3.5
29:01.69    Compiling textwrap v0.9.0
29:01.90                                         if ( ! yyg->yy_did_buffer_switch_on_eof )
29:01.90                                                ^~~
29:01.92    Compiling tempdir v0.3.5
29:01.99                                         if ( ! yyg->yy_did_buffer_switch_on_eof )
29:01.99                                                ^~~
29:02.13    Compiling uuid v0.1.18
29:03.28    Compiling aho-corasick v0.6.3
29:03.40 /tmp/B.dHGDTA/BUILD/firefox-61.0.1/gfx/angle/checkout/src/compiler/translator/glslang_tab.cpp:5043:6: warning: code will never be executed [-Wunreachable-code]
29:03.40      goto yyerrorlab;
29:03.40      ^~~~~~~~~~~~~~~
29:03.40 /tmp/B.dHGDTA/BUILD/firefox-61.0.1/gfx/angle/checkout/src/compiler/translator/glslang_tab.cpp:5042:21: note: silence by adding parentheses to mark code as explicitly dead
29:03.40   if (/*CONSTCOND*/ 0)
29:03.40                     ^
29:03.40                     /* DISABLES CODE */ ( )
29:03.40 /tmp/B.dHGDTA/BUILD/firefox-61.0.1/gfx/angle/checkout/src/compiler/translator/glslang_tab.cpp:2381:15: warning: code will never be executed [-Wunreachable-code]
29:03.40       yyssp = yyss + yysize - 1;
29:03.40               ^~~~
29:03.57 2 warnings generated.
29:03.61    Compiling msdos_time v0.1.5
29:03.82    Compiling cookie v0.10.1
29:03.95    Compiling log v0.3.9
29:04.28    Compiling rust-ini v0.10.2
29:04.31    Compiling num-integer v0.1.35
29:04.72    Compiling mozprofile v0.3.0 (file:///tmp/B.dHGDTA/BUILD/firefox-61.0.1/testing/mozbase/rust/mozprofile)
29:04.80 2 warnings generated.
29:04.81 dom/canvas
29:07.16    Compiling clap v2.29.0
29:07.38    Compiling regex v0.2.2
29:22.43    Compiling idna v0.1.4
29:25.54    Compiling num-iter v0.1.34
29:25.86    Compiling mime v0.2.6
29:27.65    Compiling mozrunner v0.6.1 (file:///tmp/B.dHGDTA/BUILD/firefox-61.0.1/testing/mozbase/rust/mozrunner)
29:29.58    Compiling num v0.1.40
29:29.84    Compiling url v1.7.0
29:31.10    Compiling bzip2 v0.3.2
29:31.25    Compiling flate2 v1.0.1
29:31.77    Compiling chrono v0.2.25
29:33.28    Compiling zip v0.3.1
29:37.21    Compiling mozversion v0.1.3 (file:///tmp/B.dHGDTA/BUILD/firefox-61.0.1/testing/mozbase/rust/mozversion)
29:38.59    Compiling hyper v0.10.13
30:09.45    Compiling webdriver v0.35.0 (file:///tmp/B.dHGDTA/BUILD/firefox-61.0.1/testing/webdriver)
30:10.81 warning: variant is never constructed: `Quit`
30:10.81   --> testing/webdriver/src/server.rs:23:5
30:10.81    |
30:10.81 23 |     Quit
30:10.81    |     ^^^^
30:10.81    |
30:10.81    = note: #[warn(dead_code)] on by default
31:10.97     Finished release [optimized] target(s) in 1756.82 secs
31:11.01 symverscript
31:11.01 toolkit/library
31:11.31 libxul.so
31:28.56     Finished release [optimized] target(s) in 206.42 secs
31:50.08 /usr/bin/ld: final link failed: Memory exhausted
31:54.33 clang-6.0: error: linker command failed with exit code 1 (use -v to see invocation)
31:54.33 gmake[4]: *** [/tmp/B.dHGDTA/BUILD/firefox-61.0.1/config/rules.mk:681: libxul.so] Error 1
31:54.33 gmake[3]: *** [/tmp/B.dHGDTA/BUILD/firefox-61.0.1/config/recurse.mk:73: toolkit/library/target] Error 2
31:54.33 gmake[2]: *** [/tmp/B.dHGDTA/BUILD/firefox-61.0.1/config/recurse.mk:33: compile] Error 2
31:54.33 gmake[1]: *** [/tmp/B.dHGDTA/BUILD/firefox-61.0.1/config/rules.mk:418: default] Error 2
31:54.33 gmake: *** [client.mk:172: build] Error 2
31:54.38 158 compiler warnings present.
31:54.46 /usr/bin/notify-send --app-name=Mozilla Build System Mozilla Build System Build failed
error: Bad exit status from /tmp/B.dHGDTA/BUILD/tmp/rpm-tmp.33815 (%build)


RPM build errors:
    Bad exit status from /tmp/B.dHGDTA/BUILD/tmp/rpm-tmp.33815 (%build)
ended at: Sun Jul  8 01:36:36 2018, done in 0:32:29.912551
error: No files produced.
+ chmod -R u+rwX /tmp/B.dHGDTA/BUILD
+ rm -rf /tmp/B.dHGDTA/tmp /tmp/B.dHGDTA/BUILD
+ rm -rf /tmp/B.dHGDTA
Begin-PLD-Builder-Info
Build-Time: user:11840.02s sys:296.65s real:1995.21s (faults io:0 non-io:51604890)

End-PLD-Builder-Info
[Back to list of logs] [View rpm -qa of builder]