FailedOk

th/SRPMS[OK]
th/x32[OK]
th/i686[OK]
th/x86_64[OK]

ac/SRPMS[OK]
ac/i386[OK]
ac/i586[OK]
ac/i686[OK]
ac/alpha[OK]
ac/amd64[OK]
ac/athlon[OK]
ac/ppc[OK]
ac/sparc[OK]
ac/sparc64[OK]

Advanced Search
main()
Powered by PLD Linux
(c) 2002-2018 PLD Team
$Revision: 1.37 $
Powered by GNU antilope.
Your IP: 54.198.111.185

firefox 4b30466e-d545-4a4a-bf99-cf8025950f36

Status:Failed
Source URL:ftp://buildlogs.pld-linux.org/th/i686/FAIL/firefox,4b30466e-d545-4a4a-bf99-cf8025950f36.bz2
text/plain URL:View!
full text:View!
rpm -qa of builder:View!
Date:2018/03/31 11:23:16
Runtime:0:15:23.730274

Toc:

  • error 1
  • 9:19.38 /tmp/B.fZaDP7/BUILD/mozilla-release-239e434d6d2b8e1e2b697c3416d1e96d48fe98e5/gfx/2d/ScaledFontFontconfig.cpp:400:29: error: no matching function for call to 'cairo_ft_font_face_create_for_pattern'
  • error 2
  • 9:19.51 gmake[4]: *** [/tmp/B.fZaDP7/BUILD/mozilla-release-239e434d6d2b8e1e2b697c3416d1e96d48fe98e5/config/rules.mk:1049: ScaledFontFontconfig.o] Error 1
  • error 3
  • 9:19.51 gmake[3]: *** [/tmp/B.fZaDP7/BUILD/mozilla-release-239e434d6d2b8e1e2b697c3416d1e96d48fe98e5/config/recurse.mk:73: gfx/2d/target] Error 2
  • error 4
  • 14:29.31 gmake[2]: *** [/tmp/B.fZaDP7/BUILD/mozilla-release-239e434d6d2b8e1e2b697c3416d1e96d48fe98e5/config/recurse.mk:33: compile] Error 2
  • error 5
  • 14:29.31 gmake[1]: *** [/tmp/B.fZaDP7/BUILD/mozilla-release-239e434d6d2b8e1e2b697c3416d1e96d48fe98e5/config/rules.mk:434: default] Error 2
  • error 6
  • error: Bad exit status from /tmp/B.fZaDP7/BUILD/tmp/rpm-tmp.42370 (%build)
  • error 7
  • RPM build errors:
  • error 8
  • error: No files produced.

Content:

 5:58.40 libplugin-container.a.desc
 5:58.65    Compiling cexpr v0.2.0
 6:04.61 libnetwerk_protocol_http.a.desc
 6:08.03    Compiling aho-corasick v0.6.3
 6:10.62 libjs_ipc.a.desc
 6:10.83    Compiling encoding_c v0.8.0
 6:11.54    Compiling syn v0.11.11
 6:12.26 libipc_chromium.a.desc
 6:19.38 libipc_glue.a.desc
 6:23.64 libhal.a.desc
 6:23.74    Compiling uluru v0.2.0
 6:24.21 libjs_xpconnect_wrappers.a.desc
 6:34.53 libjs_xpconnect_loader.a.desc
 6:35.55 libintl_chardet.a.desc
 6:41.64 libmodules_libjar_zipwriter.a.desc
 6:42.87 libmodules_libjar.a.desc
 6:44.26 libstorage_build.a.desc
 6:52.16 libstorage.a.desc
 7:02.76 libextensions_cookie.a.desc
 7:14.67 libjs_xpconnect_src.a.desc
 7:15.67 libextensions_permissions.a.desc
 7:21.32    Compiling bytes v0.4.5
 7:21.66 librdf_build.a.desc
 7:22.11 librdf_datasource.a.desc
 7:23.55 librdf_base.a.desc
 7:23.68    Compiling fallible v0.0.1 (file:///tmp/B.fZaDP7/BUILD/mozilla-release-239e434d6d2b8e1e2b697c3416d1e96d48fe98e5/servo/components/fallible)
 7:23.82 libmedia_webrtc_signaling_src_common.a.desc
 7:25.82    Compiling mio v0.6.9
 7:34.60    Compiling parking_lot_core v0.2.7
 7:36.93 libmedia_webrtc_signaling_src_mediapipeline.a.desc
 7:37.31 libmedia_webrtc_signaling_src_jsep.a.desc
 7:38.13    Compiling pulse v0.2.0 (file:///tmp/B.fZaDP7/BUILD/mozilla-release-239e434d6d2b8e1e2b697c3416d1e96d48fe98e5/media/libcubeb/cubeb-pulse-rs/pulse-rs)
 7:38.35 warning: unnecessary parentheses around function argument
 7:38.35    --> /tmp/B.fZaDP7/BUILD/mozilla-release-239e434d6d2b8e1e2b697c3416d1e96d48fe98e5/media/libcubeb/cubeb-pulse-rs/pulse-rs/src/lib.rs:373:40
 7:38.35     |
 7:38.35 373 |         unsafe { ::std::mem::transmute(((self.0 & ffi::PA_SUBSCRIPTION_EVENT_TYPE_MASK) >> 4)) }
 7:38.35     |                                        ^^^^^^^^^^^^^^^^^^^^^^^^^^^^^^^^^^^^^^^^^^^^^^^^^^^^^^ help: remove these parentheses
 7:38.35     |
 7:38.35     = note: #[warn(unused_parens)] on by default
 7:38.35 
 7:40.29    Compiling clap v2.29.0
 7:42.92 libmedia_webrtc_signaling_src_media-conduit.a.desc
 7:43.75 libmedia_mtransport_ipc.a.desc
 7:53.72 libmedia_webrtc_signaling_src_peerconnection.a.desc
 7:58.55 liburiloader_base.a.desc
 8:09.96 liburiloader_exthandler.a.desc
 8:14.06    Compiling phf_generator v0.7.21
 8:14.40    Compiling ordered-float v0.4.0
 8:17.11 libmedia_mtransport_build.a.desc
 8:21.41 libparser_xml.a.desc
 8:21.66 libparser_expat_lib.a.desc
 8:22.60 libmedia_webrtc_signaling_src_sdp.a.desc
 8:23.89 libcaps.a.desc
 8:24.74 liburiloader_prefetch.a.desc
 8:25.56 libparser_htmlparser.a.desc
 8:29.03 ./Tokenizer.l:2061:16: warning: function 'yyinput' is not needed and will not be emitted [-Wunneeded-internal-declaration]
 8:29.03     static int yyinput (yyscan_t yyscanner)
 8:29.03                ^
 8:29.81 1 warning generated.
 8:30.93 libgfx_ycbcr.a.desc
 8:48.04 libgfx_src.a.desc
 8:48.84    Compiling thread_local v0.3.3
 8:49.27    Compiling libudev v0.2.0
 8:50.60 libipc_ipdl.a.desc
 8:51.34    Compiling phf v0.7.21
 8:52.31 libparser_html.a.desc
 8:52.38 libgfx_qcms.a.desc
 8:57.31 In file included from /tmp/B.fZaDP7/BUILD/mozilla-release-239e434d6d2b8e1e2b697c3416d1e96d48fe98e5/obj-i686/gfx/graphite2/src/Unified_cpp_gfx_graphite2_src0.cpp:38:
 8:57.31 /tmp/B.fZaDP7/BUILD/mozilla-release-239e434d6d2b8e1e2b697c3416d1e96d48fe98e5/gfx/graphite2/src/Decompressor.cpp:108:21: warning: comparison of integers of different signs: '(anonymous namespace)::u32' (aka 'unsigned int') and 'int' [-Wsign-compare]
 8:57.31     if (literal_len > src_end - literal
 8:57.31         ~~~~~~~~~~~ ^ ~~~~~~~~~~~~~~~~~
 8:57.31 /tmp/B.fZaDP7/BUILD/mozilla-release-239e434d6d2b8e1e2b697c3416d1e96d48fe98e5/gfx/graphite2/src/Decompressor.cpp:109:30: warning: comparison of integers of different signs: '(anonymous namespace)::u32' (aka 'unsigned int') and 'int' [-Wsign-compare]
 8:57.31               || literal_len > dst_end - dst)
 8:57.31                  ~~~~~~~~~~~ ^ ~~~~~~~~~~~~~
 8:58.76    Compiling idna v0.1.4
 9:00.45 2 warnings generated.
 9:03.32 libgfx_graphite2_src.a.desc
 9:05.97    Compiling mp4parse_capi v0.9.1 (file:///tmp/B.fZaDP7/BUILD/mozilla-release-239e434d6d2b8e1e2b697c3416d1e96d48fe98e5/media/mp4parse-rust/mp4parse_capi)
 9:09.87 In file included from /tmp/B.fZaDP7/BUILD/mozilla-release-239e434d6d2b8e1e2b697c3416d1e96d48fe98e5/obj-i686/gfx/harfbuzz/src/Unified_cpp_gfx_harfbuzz_src0.cpp:38:
 9:09.87 In file included from /tmp/B.fZaDP7/BUILD/mozilla-release-239e434d6d2b8e1e2b697c3416d1e96d48fe98e5/gfx/harfbuzz/src/hb-ot-layout.cc:35:
 9:09.87 In file included from /tmp/B.fZaDP7/BUILD/mozilla-release-239e434d6d2b8e1e2b697c3416d1e96d48fe98e5/gfx/harfbuzz/src/hb-ot-layout-gsub-table.hh:32:
 9:09.87 /tmp/B.fZaDP7/BUILD/mozilla-release-239e434d6d2b8e1e2b697c3416d1e96d48fe98e5/gfx/harfbuzz/src/hb-ot-layout-gsubgpos-private.hh:1165:85: warning: possible misuse of comma operator here [-Wcomma]
 9:09.87       && (c->buffer->unsafe_to_break (c->buffer->idx, c->buffer->idx + match_length),
 9:09.87                                                                                     ^
 9:09.87 /tmp/B.fZaDP7/BUILD/mozilla-release-239e434d6d2b8e1e2b697c3416d1e96d48fe98e5/gfx/harfbuzz/src/hb-ot-layout-gsubgpos-private.hh:1165:11: note: cast expression to void to silence warning
 9:09.87       && (c->buffer->unsafe_to_break (c->buffer->idx, c->buffer->idx + match_length),
 9:09.87           ^~~~~~~~~~~~~~~~~~~~~~~~~~~~~~~~~~~~~~~~~~~~~~~~~~~~~~~~~~~~~~~~~~~~~~~~~~
 9:09.87           static_cast<void>(                                                        )
 9:09.89 /tmp/B.fZaDP7/BUILD/mozilla-release-239e434d6d2b8e1e2b697c3416d1e96d48fe98e5/gfx/harfbuzz/src/hb-ot-layout-gsubgpos-private.hh:1701:77: warning: possible misuse of comma operator here [-Wcomma]
 9:09.89       && (c->buffer->unsafe_to_break_from_outbuffer (start_index, end_index),
 9:09.89                                                                             ^
 9:09.89 /tmp/B.fZaDP7/BUILD/mozilla-release-239e434d6d2b8e1e2b697c3416d1e96d48fe98e5/gfx/harfbuzz/src/hb-ot-layout-gsubgpos-private.hh:1701:11: note: cast expression to void to silence warning
 9:09.89       && (c->buffer->unsafe_to_break_from_outbuffer (start_index, end_index),
 9:09.89           ^~~~~~~~~~~~~~~~~~~~~~~~~~~~~~~~~~~~~~~~~~~~~~~~~~~~~~~~~~~~~~~~~~
 9:09.89           static_cast<void>(                                                )
 9:17.69    Compiling nserror v0.1.0 (file:///tmp/B.fZaDP7/BUILD/mozilla-release-239e434d6d2b8e1e2b697c3416d1e96d48fe98e5/xpcom/rust/nserror)
 9:18.49    Compiling libcubeb-sys v0.1.0 (file:///tmp/B.fZaDP7/BUILD/mozilla-release-239e434d6d2b8e1e2b697c3416d1e96d48fe98e5/media/cubeb-rs/cubeb-api/libcubeb-sys)
 9:18.75    Compiling cubeb-backend v0.2.0 (file:///tmp/B.fZaDP7/BUILD/mozilla-release-239e434d6d2b8e1e2b697c3416d1e96d48fe98e5/media/cubeb-rs/cubeb-backend)
 9:19.34    Compiling synstructure v0.5.2
 9:19.38 /tmp/B.fZaDP7/BUILD/mozilla-release-239e434d6d2b8e1e2b697c3416d1e96d48fe98e5/gfx/2d/ScaledFontFontconfig.cpp:400:29: error: no matching function for call to 'cairo_ft_font_face_create_for_pattern'
 9:19.38   cairo_font_face_t* font = cairo_ft_font_face_create_for_pattern(pattern, nullptr, 0);
 9:19.38                             ^~~~~~~~~~~~~~~~~~~~~~~~~~~~~~~~~~~~~
 9:19.38 /usr/include/cairo/cairo-ft.h:104:1: note: candidate function not viable: requires single argument 'pattern', but 3 arguments were provided
 9:19.38 cairo_ft_font_face_create_for_pattern (FcPattern *pattern);
 9:19.38 ^
 9:19.50 1 error generated.
 9:19.51 gmake[4]: *** [/tmp/B.fZaDP7/BUILD/mozilla-release-239e434d6d2b8e1e2b697c3416d1e96d48fe98e5/config/rules.mk:1049: ScaledFontFontconfig.o] Error 1
 9:19.51 gmake[3]: *** [/tmp/B.fZaDP7/BUILD/mozilla-release-239e434d6d2b8e1e2b697c3416d1e96d48fe98e5/config/recurse.mk:73: gfx/2d/target] Error 2
 9:19.51 gmake[3]: *** Waiting for unfinished jobs....
 9:20.22    Compiling serde_derive_internals v0.19.0 (https://github.com/gankro/serde?branch=deserialize_from_enums4#93e24f26)
 9:23.34    Compiling darling_core v0.2.0
 9:24.87 2 warnings generated.
 9:26.46 libgfx_harfbuzz_src.a.desc
 9:28.94 libgfx_angle.a.desc
 9:29.33 libgfx_ipc.a.desc
 9:29.80    Compiling cssparser v0.23.2
 9:46.24 libgfx_gl.a.desc
10:02.42    Compiling mio-uds v0.6.4
10:03.94    Compiling parking_lot v0.4.4
10:05.02    Compiling cubeb-pulse v0.0.2 (file:///tmp/B.fZaDP7/BUILD/mozilla-release-239e434d6d2b8e1e2b697c3416d1e96d48fe98e5/media/libcubeb/cubeb-pulse-rs)
10:06.65    Compiling cose-c v0.1.5
10:08.34    Compiling phf_codegen v0.7.21
10:08.75    Compiling regex v0.2.2
10:09.68    Compiling rayon v0.8.2
10:16.28    Compiling url v1.6.0
10:17.15    Compiling encoding_glue v0.1.0 (file:///tmp/B.fZaDP7/BUILD/mozilla-release-239e434d6d2b8e1e2b697c3416d1e96d48fe98e5/intl/encoding_glue)
10:17.21    Compiling netwerk_helper v0.0.1 (file:///tmp/B.fZaDP7/BUILD/mozilla-release-239e434d6d2b8e1e2b697c3416d1e96d48fe98e5/netwerk/base/rust-helper)
10:25.93 libgfx_layers.a.desc
10:26.53    Compiling cubeb v0.3.0 (file:///tmp/B.fZaDP7/BUILD/mozilla-release-239e434d6d2b8e1e2b697c3416d1e96d48fe98e5/media/cubeb-rs/cubeb-api)
10:26.57    Compiling malloc_size_of_derive v0.0.1 (file:///tmp/B.fZaDP7/BUILD/mozilla-release-239e434d6d2b8e1e2b697c3416d1e96d48fe98e5/servo/components/malloc_size_of_derive)
10:26.64 warning: unused import: `str`
10:26.64   --> /tmp/B.fZaDP7/BUILD/mozilla-release-239e434d6d2b8e1e2b697c3416d1e96d48fe98e5/media/cubeb-rs/cubeb-api/src/stream.rs:73:16
10:26.64    |
10:26.64 73 | use std::{ptr, str};
10:26.64    |                ^^^
10:26.64    |
10:26.64    = note: #[warn(unused_imports)] on by default
10:26.64 
10:26.65    Compiling serde_derive v1.0.27 (https://github.com/gankro/serde?branch=deserialize_from_enums4#93e24f26)
10:26.69    Compiling darling_macro v0.2.0
10:26.81 warning: variable does not need to be mutable
10:26.81    --> /tmp/B.fZaDP7/BUILD/mozilla-release-239e434d6d2b8e1e2b697c3416d1e96d48fe98e5/media/cubeb-rs/cubeb-api/src/stream.rs:322:17
10:26.81     |
10:26.81 322 |             let mut output: &mut [CB::Frame] = if output_buffer.is_null() {
10:26.81     |                 ----^^^^^^
10:26.81     |                 |
10:26.81     |                 help: remove this `mut`
10:26.81     |
10:26.81     = note: #[warn(unused_mut)] on by default
10:26.81 
10:26.87    Compiling cssparser-macros v0.3.0
10:26.92    Compiling selectors v0.19.0 (file:///tmp/B.fZaDP7/BUILD/mozilla-release-239e434d6d2b8e1e2b697c3416d1e96d48fe98e5/servo/components/selectors)
10:27.60    Compiling rust_url_capi v0.0.1 (file:///tmp/B.fZaDP7/BUILD/mozilla-release-239e434d6d2b8e1e2b697c3416d1e96d48fe98e5/netwerk/base/rust-url-capi)
10:30.62    Compiling env_logger v0.4.3
10:35.37    Compiling darling v0.2.0
10:38.78    Compiling u2fhid v0.1.0 (file:///tmp/B.fZaDP7/BUILD/mozilla-release-239e434d6d2b8e1e2b697c3416d1e96d48fe98e5/dom/webauthn/u2f-hid-rs)
10:39.69    Compiling style_derive v0.0.1 (file:///tmp/B.fZaDP7/BUILD/mozilla-release-239e434d6d2b8e1e2b697c3416d1e96d48fe98e5/servo/components/style_derive)
10:55.82    Compiling malloc_size_of v0.0.1 (file:///tmp/B.fZaDP7/BUILD/mozilla-release-239e434d6d2b8e1e2b697c3416d1e96d48fe98e5/servo/components/malloc_size_of)
10:56.39    Compiling style_traits v0.0.1 (file:///tmp/B.fZaDP7/BUILD/mozilla-release-239e434d6d2b8e1e2b697c3416d1e96d48fe98e5/servo/components/style_traits)
10:58.44    Compiling audioipc v0.1.0 (file:///tmp/B.fZaDP7/BUILD/mozilla-release-239e434d6d2b8e1e2b697c3416d1e96d48fe98e5/media/audioipc/audioipc)
11:02.09    Compiling audioipc-server v0.1.0 (file:///tmp/B.fZaDP7/BUILD/mozilla-release-239e434d6d2b8e1e2b697c3416d1e96d48fe98e5/media/audioipc/server)
11:02.09    Compiling audioipc-client v0.1.0 (file:///tmp/B.fZaDP7/BUILD/mozilla-release-239e434d6d2b8e1e2b697c3416d1e96d48fe98e5/media/audioipc/client)
11:14.60    Compiling style v0.0.1 (file:///tmp/B.fZaDP7/BUILD/mozilla-release-239e434d6d2b8e1e2b697c3416d1e96d48fe98e5/servo/components/style)
13:50.55    Compiling geckoservo v0.0.1 (file:///tmp/B.fZaDP7/BUILD/mozilla-release-239e434d6d2b8e1e2b697c3416d1e96d48fe98e5/servo/ports/geckolib)
13:51.13 warning: unnecessary parentheses around function argument
13:51.13     --> /tmp/B.fZaDP7/BUILD/mozilla-release-239e434d6d2b8e1e2b697c3416d1e96d48fe98e5/servo/ports/geckolib/glue.rs:4393:36
13:51.13      |
13:51.13 4393 |     let name = unsafe { Atom::from((&*name)) };
13:51.13      |                                    ^^^^^^^^ help: remove these parentheses
13:51.13      |
13:51.13      = note: #[warn(unused_parens)] on by default
13:51.13 
14:26.52    Compiling gkrust-shared v0.1.0 (file:///tmp/B.fZaDP7/BUILD/mozilla-release-239e434d6d2b8e1e2b697c3416d1e96d48fe98e5/toolkit/library/rust/shared)
14:27.79    Compiling gkrust v0.1.0 (file:///tmp/B.fZaDP7/BUILD/mozilla-release-239e434d6d2b8e1e2b697c3416d1e96d48fe98e5/toolkit/library/rust)
14:29.29     Finished release [optimized] target(s) in 704.86 secs
14:29.31 gmake[2]: *** [/tmp/B.fZaDP7/BUILD/mozilla-release-239e434d6d2b8e1e2b697c3416d1e96d48fe98e5/config/recurse.mk:33: compile] Error 2
14:29.31 gmake[1]: *** [/tmp/B.fZaDP7/BUILD/mozilla-release-239e434d6d2b8e1e2b697c3416d1e96d48fe98e5/config/rules.mk:434: default] Error 2
14:29.31 gmake: *** [client.mk:168: build] Error 2
14:29.35 32 compiler warnings present.
14:29.38 /usr/bin/notify-send --app-name=Mozilla Build System Mozilla Build System Build failed
error: Bad exit status from /tmp/B.fZaDP7/BUILD/tmp/rpm-tmp.42370 (%build)


RPM build errors:
    Bad exit status from /tmp/B.fZaDP7/BUILD/tmp/rpm-tmp.42370 (%build)
ended at: Sat Mar 31 11:23:03 2018, done in 0:15:23.730274
error: No files produced.
+ chmod -R u+rwX /tmp/B.fZaDP7/BUILD
+ rm -rf /tmp/B.fZaDP7/tmp /tmp/B.fZaDP7/BUILD
+ rm -rf /tmp/B.fZaDP7
Begin-PLD-Builder-Info
Build-Time: user:5073.54s sys:130.96s real:989.08s (faults io:203 non-io:20056676)

End-PLD-Builder-Info
[Back to list of logs] [View rpm -qa of builder]