FailedOk

th/SRPMS[OK]
th/x32[OK]
th/i686[OK]
th/x86_64[OK]

ac/SRPMS[OK]
ac/i386[OK]
ac/i586[OK]
ac/i686[OK]
ac/alpha[OK]
ac/amd64[OK]
ac/athlon[OK]
ac/ppc[OK]
ac/sparc[OK]
ac/sparc64[OK]

Advanced Search
main()
Powered by PLD Linux
(c) 2002-2018 PLD Team
$Revision: 1.37 $
Powered by DWARF.
Your IP: 54.158.199.217

firefox db583223-a25d-45ed-9f43-b590f3747822

Status:Failed
Source URL:ftp://buildlogs.pld-linux.org/th/i686/FAIL/firefox,db583223-a25d-45ed-9f43-b590f3747822.bz2
text/plain URL:View!
full text:View!
rpm -qa of builder:View!
Date:2018/07/07 22:35:24
Runtime:0:31:33.123526

Toc:

  • error 1
  • 30:32.35 clang-6.0: error: linker command failed with exit code 1 (use -v to see invocation)
  • error 2
  • 30:32.35 gmake[4]: *** [/tmp/B.TiqHnA/BUILD/firefox-61.0.1/config/rules.mk:681: libxul.so] Error 1
  • error 3
  • 30:32.35 gmake[3]: *** [/tmp/B.TiqHnA/BUILD/firefox-61.0.1/config/recurse.mk:73: toolkit/library/target] Error 2
  • error 4
  • 30:59.18 gmake[2]: *** [/tmp/B.TiqHnA/BUILD/firefox-61.0.1/config/recurse.mk:33: compile] Error 2
  • error 5
  • 30:59.18 gmake[1]: *** [/tmp/B.TiqHnA/BUILD/firefox-61.0.1/config/rules.mk:418: default] Error 2
  • error 6
  • error: Bad exit status from /tmp/B.TiqHnA/BUILD/tmp/rpm-tmp.63851 (%build)
  • error 7
  • RPM build errors:
  • error 8
  • error: No files produced.

Content:

27:19.42                ^
27:20.31 3 warnings generated.
27:24.70 dom/ipc
27:24.70 security/sandbox/linux/glue
27:26.97 gfx/angle/targets/translator
27:27.10    Compiling cfg-if v0.1.2
27:27.23    Compiling podio v0.1.5
27:27.62    Compiling adler32 v1.0.2
27:28.10    Compiling libc v0.2.39
27:29.22 brotli
27:29.67    Compiling version_check v0.1.3
27:31.53    Compiling httparse v1.2.3
27:32.65    Compiling num-traits v0.2.0
27:34.47    Compiling utf8-ranges v1.0.0
27:35.29    Compiling typeable v0.1.2
27:35.54    Compiling unicode-width v0.1.4
27:35.72    Compiling percent-encoding v1.0.0
27:35.95    Compiling bitflags v1.0.1
27:36.20    Compiling void v1.0.2
27:36.36    Compiling unicode-segmentation v1.1.0
27:37.28    Compiling rustc-serialize v0.3.24
27:49.79    Compiling regex-syntax v0.4.1
27:53.20    Compiling lazy_static v1.0.0
27:57.36    Compiling safemem v0.2.0
27:57.67    Compiling geckodriver v0.20.1 (file:///tmp/B.TiqHnA/BUILD/firefox-61.0.1/testing/geckodriver)
28:00.54    Compiling matches v0.1.6
28:00.78    Compiling semver-parser v0.7.0
28:04.06    Compiling language-tags v0.2.2
28:06.99    Compiling crc v1.7.0
28:07.73    Compiling bzip2-sys v0.1.6
28:07.83    Compiling miniz_oxide_c_api v0.1.2
28:10.17    Compiling log v0.4.1
28:10.76    Compiling rand v0.3.18
28:11.03    Compiling time v0.1.38
28:12.26    Compiling num_cpus v1.7.0
28:14.41    Compiling miniz_oxide v0.1.2
28:15.76    Compiling memchr v1.0.2
28:16.04    Compiling term_size v0.3.0
28:17.39    Compiling unicase v1.4.2
28:19.46    Compiling num-traits v0.1.43
28:19.71    Compiling unreachable v1.0.0
28:19.84    Compiling base64 v0.6.0
28:20.80    Compiling unicode-bidi v0.3.4
28:21.56    Compiling semver v0.6.0
28:24.81    Compiling rust-ini v0.10.2
28:24.81    Compiling log v0.3.9
28:24.81    Compiling tempdir v0.3.5
28:24.81    Compiling uuid v0.1.18
28:25.70    Compiling cookie v0.10.1
28:25.93    Compiling msdos_time v0.1.5
28:26.05    Compiling textwrap v0.9.0
28:26.28    Compiling aho-corasick v0.6.3
28:27.17    Compiling num-integer v0.1.35
28:29.06    Compiling thread_local v0.3.5
28:29.92    Compiling idna v0.1.4
28:31.87    Compiling mime v0.2.6
28:33.50    Compiling mozprofile v0.3.0 (file:///tmp/B.TiqHnA/BUILD/firefox-61.0.1/testing/mozbase/rust/mozprofile)
28:35.91    Compiling num-iter v0.1.34
28:36.23    Compiling clap v2.29.0
28:40.23    Compiling regex v0.2.2
28:40.71                                         if ( ! yyg->yy_did_buffer_switch_on_eof )
28:40.71                                                ^~~
28:40.80                                         if ( ! yyg->yy_did_buffer_switch_on_eof )
28:40.80                                                ^~~
28:40.85 /tmp/B.TiqHnA/BUILD/firefox-61.0.1/gfx/angle/checkout/src/compiler/translator/glslang_tab.cpp:5043:6: warning: code will never be executed [-Wunreachable-code]
28:40.85      goto yyerrorlab;
28:40.85      ^~~~~~~~~~~~~~~
28:40.85 /tmp/B.TiqHnA/BUILD/firefox-61.0.1/gfx/angle/checkout/src/compiler/translator/glslang_tab.cpp:5042:21: note: silence by adding parentheses to mark code as explicitly dead
28:40.85   if (/*CONSTCOND*/ 0)
28:40.85                     ^
28:40.85                     /* DISABLES CODE */ ( )
28:40.85 /tmp/B.TiqHnA/BUILD/firefox-61.0.1/gfx/angle/checkout/src/compiler/translator/glslang_tab.cpp:2381:15: warning: code will never be executed [-Wunreachable-code]
28:40.85       yyssp = yyss + yysize - 1;
28:40.85               ^~~~
28:41.40    Compiling bzip2 v0.3.2
28:41.56    Compiling url v1.7.0
28:41.78    Compiling num v0.1.40
28:42.02    Compiling mozrunner v0.6.1 (file:///tmp/B.TiqHnA/BUILD/firefox-61.0.1/testing/mozbase/rust/mozrunner)
28:42.10    Compiling flate2 v1.0.1
28:42.16 2 warnings generated.
28:42.18    Compiling chrono v0.2.25
28:42.42 2 warnings generated.
28:42.44 dom/canvas
28:44.11    Compiling zip v0.3.1
28:54.07    Compiling hyper v0.10.13
29:09.21    Compiling mozversion v0.1.3 (file:///tmp/B.TiqHnA/BUILD/firefox-61.0.1/testing/mozbase/rust/mozversion)
29:25.94    Compiling webdriver v0.35.0 (file:///tmp/B.TiqHnA/BUILD/firefox-61.0.1/testing/webdriver)
29:27.31 warning: variant is never constructed: `Quit`
29:27.31   --> testing/webdriver/src/server.rs:23:5
29:27.31    |
29:27.31 23 |     Quit
29:27.31    |     ^^^^
29:27.31    |
29:27.31    = note: #[warn(dead_code)] on by default
29:52.40     Finished release [optimized] target(s) in 1680.96 secs
29:52.43 symverscript
29:52.43 toolkit/library
29:52.73 libxul.so
30:32.05 /usr/bin/ld: final link failed: Memory exhausted
30:32.35 clang-6.0: error: linker command failed with exit code 1 (use -v to see invocation)
30:32.35 gmake[4]: *** [/tmp/B.TiqHnA/BUILD/firefox-61.0.1/config/rules.mk:681: libxul.so] Error 1
30:32.35 gmake[3]: *** [/tmp/B.TiqHnA/BUILD/firefox-61.0.1/config/recurse.mk:73: toolkit/library/target] Error 2
30:32.35 gmake[3]: *** Waiting for unfinished jobs....
30:59.17     Finished release [optimized] target(s) in 227.12 secs
30:59.18 gmake[2]: *** [/tmp/B.TiqHnA/BUILD/firefox-61.0.1/config/recurse.mk:33: compile] Error 2
30:59.18 gmake[1]: *** [/tmp/B.TiqHnA/BUILD/firefox-61.0.1/config/rules.mk:418: default] Error 2
30:59.18 gmake: *** [client.mk:172: build] Error 2
30:59.23 158 compiler warnings present.
30:59.30 /usr/bin/notify-send --app-name=Mozilla Build System Mozilla Build System Build failed
error: Bad exit status from /tmp/B.TiqHnA/BUILD/tmp/rpm-tmp.63851 (%build)


RPM build errors:
    Bad exit status from /tmp/B.TiqHnA/BUILD/tmp/rpm-tmp.63851 (%build)
ended at: Sat Jul  7 22:35:09 2018, done in 0:31:33.123526
error: No files produced.
+ chmod -R u+rwX /tmp/B.TiqHnA/BUILD
+ rm -rf /tmp/B.TiqHnA/tmp /tmp/B.TiqHnA/BUILD
+ rm -rf /tmp/B.TiqHnA
Begin-PLD-Builder-Info
Build-Time: user:11871.02s sys:294.74s real:1938.19s (faults io:0 non-io:51571304)

End-PLD-Builder-Info
[Back to list of logs] [View rpm -qa of builder]