FailedOk

th/SRPMS[OK]
th/x32[OK]
th/i686[OK]
th/x86_64[OK]

ac/SRPMS[OK]
ac/i386[OK]
ac/i586[OK]
ac/i686[OK]
ac/alpha[OK]
ac/amd64[OK]
ac/athlon[OK]
ac/ppc[OK]
ac/sparc[OK]
ac/sparc64[OK]

Advanced Search
main()
Powered by PLD Linux
(c) 2002-2018 PLD Team
$Revision: 1.37 $
Powered by /dev/zero.
Your IP: 54.144.16.135

firefox52-esr 184fc61e-98c9-4bc3-aad0-1e26bf7d693c

Status:Failed
Source URL:ftp://buildlogs.pld-linux.org/th/i686/FAIL/firefox52-esr,184fc61e-98c9-4bc3-aad0-1e26bf7d693c.bz2
text/plain URL:View!
rpm -qa of builder:View!
Date:2018/01/11 18:46:57
Runtime:0:04:18.051623

Toc:

  • prep
  • Executing(%prep): /bin/sh -e /tmp/B.1_qms0/BUILD/tmp/rpm-tmp.88193
  • build
  • Executing(%build): /bin/sh -e /tmp/B.1_qms0/BUILD/tmp/rpm-tmp.67409
  • error 1
  • configure: error: These compiler flags for C are invalid: -O2 -fwrapv -pipe -Wformat -Werror=format-security -gdwarf-4 -fno-debug-types-section -fvar-tracking-assignments -g2 -Wp,-D_FORTIFY_SOURCE=2 -fstack-protector-strong --param=ssp-buffer-size=4 -fomit-frame-pointer -march=i686 -fasynchronous-unwind-tables -mtune=pentium4 -gdwarf-4 -fno-debug-types-section -fvar-tracking-assignments -g2
  • error 2
  • DEBUG: clang-3.9: error: unknown argument: '-fvar-tracking-assignments'
  • error 3
  • DEBUG: clang-3.9: error: unknown argument: '-fvar-tracking-assignments'
  • error 4
  • DEBUG: configure: error: These compiler flags for C are invalid: -O2 -fwrapv -pipe -Wformat -Werror=format-security -gdwarf-4 -fno-debug-types-section -fvar-tracking-assignments -g2 -Wp,-D_FORTIFY_SOURCE=2 -fstack-protector-strong --param=ssp-buffer-size=4 -fomit-frame-pointer -march=i686 -fasynchronous-unwind-tables -mtune=pentium4 -gdwarf-4 -fno-debug-types-section -fvar-tracking-assignments -g2
  • error 5
  • ERROR: old-configure failed
  • error 6
  • make[2]: *** [/tmp/B.1_qms0/BUILD/firefox-52.5.3esr/client.mk:379: configure] Error 1
  • error 7
  • make[1]: *** [/tmp/B.1_qms0/BUILD/firefox-52.5.3esr/client.mk:392: /tmp/B.1_qms0/BUILD/firefox-52.5.3esr/obj-i686/Makefile] Error 2
  • error 8
  • error: Bad exit status from /tmp/B.1_qms0/BUILD/tmp/rpm-tmp.67409 (%build)
  • error 9
  • RPM build errors:
  • error 10
  • error: No files produced.

Content:

request from: atler
checking if we should skip the build
started at: Thu Jan 11 18:39:16 2018
fetching https://srcbuilder.pld-linux.org/th//srpms/184fc61e-98c9-4bc3-aad0-1e26bf7d693c/firefox52-esr-52.5.3-1.src.rpm
fetched 213845932 bytes, 4432.5 K/s
installing srpm: firefox52-esr-52.5.3-1.src.rpm
+ install -d /tmp/B.1_qms0/BUILD /tmp/B.1_qms0/RPMS
+ LC_ALL=en_US.UTF-8
+ rpm -qp --changelog firefox52-esr-52.5.3-1.src.rpm
* Thu Jan 11 2018 PLD Linux Team <feedback@pld-linux.org>
- For complete changelog see: http://git.pld-linux.org/?p=packages/firefox52-esr.git;a=log;h=master
* Thu Jan 11 2018 Jan Palus <atler@pld-linux.org> 3a4708d
- bring clang support from firefox * Thu Jan 11 2018 Jan Palus <atler@pld-linux.org> 899c120
- disable pgo by default (broken with -O2) * Thu Jan 11 2018 Jan Palus <atler@pld-linux.org> 540e18d
- drop -Os workaround -- it's causing "widget issue" with gcc7 * Wed Jan 10 2018 Jan Palus <atler@pld-linux.org> d02be7c
- correct config dir path * Thu Jan 04 2018 Adam Osuchowski <adwol@pld-linux.org> cf0a641
- up to 52.5.3 * Fri Dec 08 2017 Adam Osuchowski <adwol@pld-linux.org> 620a169
- up to 52.5.2 * Tue Nov 14 2017 Adam Osuchowski <adwol@pld-linux.org> 032dde0
- up to 52.5.0 * Tue Oct 10 2017 Adam Osuchowski <adwol@pld-linux.org> 2659038
- up to 52.4.1 * Fri Sep 29 2017 Adam Osuchowski <adwol@pld-linux.org> cee08d6
- up to 52.4.0 * Tue Aug 08 2017 Adam Osuchowski <adwol@pld-linux.org> 96a4c58
- up to 52.3.0 * Mon Jul 17 2017 Jakub Bogusz <qboosh@pld-linux.org> 6ab32e1
- updated xulrunner-pc patch, pass more vars to make stage-package in order to generate correct .pc files * Mon Jul 17 2017 Jakub Bogusz <qboosh@pld-linux.org> ed1a48e
- adjusted dependencies and _noautoreq - versioned xulrunner-libs obsoletes to avoid obsoleting newer non-esr firefox * Fri Jun 30 2017 Adam Osuchowski <adwol@pld-linux.org> fe4dc47
- up to 52.2.1 * Fri Jun 23 2017 Adam Osuchowski <adwol@pld-linux.org> 346ae42
- fixed name in .desktop file * Fri Jun 23 2017 Adam Osuchowski <adwol@pld-linux.org> a4803e5
- initial, ESR release based on FF 52 + rpm -Uhv --nodeps --define '_topdir /tmp/B.1_qms0' --define '_specdir %{_topdir}' --define '_sourcedir %{_specdir}' --define '_rpmdir %{_topdir}/RPMS' --define '_builddir %{_topdir}/BUILD' firefox52-esr-52.5.3-1.src.rpm Preparing... ################################################## firefox52-esr ################################################## + rm -f firefox52-esr-52.5.3-1.src.rpm + install -m 700 -d /tmp/B.1_qms0/BUILD/tmp + TMPDIR=/tmp/B.1_qms0/BUILD/tmp + exec nice -n 0 rpmbuild -bp --short-circuit --nodeps --define '_topdir /tmp/B.1_qms0' --define '_specdir %{_topdir}' --define '_sourcedir %{_specdir}' --define '_rpmdir %{_topdir}/RPMS' --define '_builddir %{_topdir}/BUILD' --target i686-pld-linux --define 'prep exit 0' /tmp/B.1_qms0/firefox52-esr.spec Building target platforms: i686-pld-linux checking BuildConflict-ing packages no BuildConflicts found checking BR rpm: Building target platforms: i686-pld-linux no BR needed building RPM using: set -ex; : build-id: 184fc61e-98c9-4bc3-aad0-1e26bf7d693c; TMPDIR=/tmp/B.1_qms0/BUILD/tmp exec nice -n 0 rpmbuild -bb --define '_smp_mflags -j9' --define '_make_opts -Otarget' --define '_pld_builder 1' --define '_topdir /tmp/B.1_qms0' --define '_specdir %{_topdir}' --define '_sourcedir %{_specdir}' --define '_rpmdir %{_topdir}/RPMS' --define '_builddir %{_topdir}/BUILD' --target i686-pld-linux /tmp/B.1_qms0/firefox52-esr.spec + : build-id: 184fc61e-98c9-4bc3-aad0-1e26bf7d693c + TMPDIR=/tmp/B.1_qms0/BUILD/tmp + exec nice -n 0 rpmbuild -bb --define '_smp_mflags -j9' --define '_make_opts -Otarget' --define '_pld_builder 1' --define '_topdir /tmp/B.1_qms0' --define '_specdir %{_topdir}' --define '_sourcedir %{_specdir}' --define '_rpmdir %{_topdir}/RPMS' --define '_builddir %{_topdir}/BUILD' --target i686-pld-linux /tmp/B.1_qms0/firefox52-esr.spec Building target platforms: i686-pld-linux Executing(%prep): /bin/sh -e /tmp/B.1_qms0/BUILD/tmp/rpm-tmp.88193 + umask 022 + cd /tmp/B.1_qms0/BUILD + cd /tmp/B.1_qms0/BUILD + rm -rf firefox-52.5.3esr + /usr/bin/xz -dc /tmp/B.1_qms0/firefox-52.5.3esr.source.tar.xz + /bin/tar -xf - + STATUS=0 + '[' 0 -ne 0 ']' + cd firefox-52.5.3esr + /bin/id -u + '[' 1001 '=' 0 ']' + /bin/id -u + '[' 1001 '=' 0 ']' + /bin/chmod -Rf a+rX,u+w,g-w,o-w . + /bin/rm '--interactive=never' extensions/spellcheck/hunspell/src/affentry.hxx extensions/spellcheck/hunspell/src/affixmgr.hxx extensions/spellcheck/hunspell/src/atypes.hxx extensions/spellcheck/hunspell/src/baseaffix.hxx extensions/spellcheck/hunspell/src/csutil.hxx extensions/spellcheck/hunspell/src/filemgr.hxx extensions/spellcheck/hunspell/src/hashmgr.hxx extensions/spellcheck/hunspell/src/htypes.hxx extensions/spellcheck/hunspell/src/hunspell.hxx extensions/spellcheck/hunspell/src/hunzip.hxx extensions/spellcheck/hunspell/src/langnum.hxx extensions/spellcheck/hunspell/src/phonet.hxx extensions/spellcheck/hunspell/src/replist.hxx extensions/spellcheck/hunspell/src/suggestmgr.hxx extensions/spellcheck/hunspell/src/w_char.hxx extensions/spellcheck/hunspell/src/hunspell.h + >>extensions/spellcheck/src/Makefile.in + echo 'LOCAL_INCLUDES += $(MOZ_HUNSPELL_CFLAGS)' + echo 'Patch #0 (idl-parser.patch):' Patch #0 (idl-parser.patch): + '[' -f /tmp/B.1_qms0/idl-parser.patch ']' + /bin/cat /tmp/B.1_qms0/idl-parser.patch + /usr/bin/patch -s -p2 + echo 'Patch #1 (xulrunner-new-libxul.patch):' Patch #1 (xulrunner-new-libxul.patch): + '[' -f /tmp/B.1_qms0/xulrunner-new-libxul.patch ']' + /bin/cat /tmp/B.1_qms0/xulrunner-new-libxul.patch + /usr/bin/patch -s -p1 + echo 'Patch #2 (xulrunner-paths.patch):' Patch #2 (xulrunner-paths.patch): + '[' -f /tmp/B.1_qms0/xulrunner-paths.patch ']' + /bin/cat /tmp/B.1_qms0/xulrunner-paths.patch + /usr/bin/patch -s -p2 + echo 'Patch #3 (xulrunner-pc.patch):' Patch #3 (xulrunner-pc.patch): + '[' -f /tmp/B.1_qms0/xulrunner-pc.patch ']' + /bin/cat /tmp/B.1_qms0/xulrunner-pc.patch + /usr/bin/patch -s -p1 + echo 'Patch #4 (firefox-prefs.patch):' Patch #4 (firefox-prefs.patch): + '[' -f /tmp/B.1_qms0/firefox-prefs.patch ']' + /bin/cat /tmp/B.1_qms0/firefox-prefs.patch + /usr/bin/patch -s -p1 + echo 'Patch #5 (firefox-pld-bookmarks.patch):' Patch #5 (firefox-pld-bookmarks.patch): + '[' -f /tmp/B.1_qms0/firefox-pld-bookmarks.patch ']' + /bin/cat /tmp/B.1_qms0/firefox-pld-bookmarks.patch + /usr/bin/patch -s -p1 + echo 'Patch #6 (firefox-no-subshell.patch):' Patch #6 (firefox-no-subshell.patch): + '[' -f /tmp/B.1_qms0/firefox-no-subshell.patch ']' + /bin/cat /tmp/B.1_qms0/firefox-no-subshell.patch + /usr/bin/patch -s -p2 + echo 'Patch #7 (firefox-middle_click_paste.patch):' Patch #7 (firefox-middle_click_paste.patch): + '[' -f /tmp/B.1_qms0/firefox-middle_click_paste.patch ']' + /bin/cat /tmp/B.1_qms0/firefox-middle_click_paste.patch + /usr/bin/patch -s -p1 + echo 'Patch #8 (firefox-system-virtualenv.patch):' Patch #8 (firefox-system-virtualenv.patch): + '[' -f /tmp/B.1_qms0/firefox-system-virtualenv.patch ']' + /bin/cat /tmp/B.1_qms0/firefox-system-virtualenv.patch + /usr/bin/patch -s -p2 + echo 'Patch #9 (firefox-Disable-Firefox-Health-Report.patch):' Patch #9 (firefox-Disable-Firefox-Health-Report.patch): + '[' -f /tmp/B.1_qms0/firefox-Disable-Firefox-Health-Report.patch ']' + /bin/cat /tmp/B.1_qms0/firefox-Disable-Firefox-Health-Report.patch + /usr/bin/patch -s -p1 + echo 'Patch #10 (freetype.patch):' Patch #10 (freetype.patch): + '[' -f /tmp/B.1_qms0/freetype.patch ']' + /bin/cat /tmp/B.1_qms0/freetype.patch + /usr/bin/patch -s -p2 + /bin/sed -i -e '1s,/usr/bin/env python,/usr/bin/python2,' xpcom/typelib/xpt/tools/xpt.py xpcom/idl-parser/xpidl/xpidl.py + exit 0 Executing(%build): /bin/sh -e /tmp/B.1_qms0/BUILD/tmp/rpm-tmp.67409 TMP=/home/users/builder/tmp HOME=/home/users/builder PATH=/home/users/builder/GNUstep/Tools:/usr/local/bin:/usr/bin:/bin:/home/users/builder/bin TMPDIR=/tmp/B.1_qms0/BUILD/tmp + umask 022 + cd /tmp/B.1_qms0/BUILD + cd firefox-52.5.3esr + cp -p /usr/share/automake/config.guess /usr/share/automake/config.sub build/autoconf + <<"EOF" + >.mozconfig + cat + /usr/bin/make -Otarget -j9 -j1 -f client.mk build 'AUTOCONF=/usr/bin/autoconf2_13' 'MOZ_MAKE_FLAGS=-j9' mkdir -p '/tmp/B.1_qms0/BUILD/firefox-52.5.3esr/obj-i686/' python2.7 /tmp/B.1_qms0/BUILD/firefox-52.5.3esr/config/pythonpath.py -I /tmp/B.1_qms0/BUILD/firefox-52.5.3esr/testing/mozbase/mozfile \ /tmp/B.1_qms0/BUILD/firefox-52.5.3esr/python/mozbuild/mozbuild/controller/clobber.py /tmp/B.1_qms0/BUILD/firefox-52.5.3esr /tmp/B.1_qms0/BUILD/firefox-52.5.3esr/obj-i686 Clobber not needed. > /tmp/B.1_qms0/BUILD/firefox-52.5.3esr/obj-i686/.mozconfig.mk /usr/bin/make -f /tmp/B.1_qms0/BUILD/firefox-52.5.3esr/client.mk realbuild CREATE_MOZCONFIG_JSON= make[1]: Entering directory '/tmp/B.1_qms0/BUILD/firefox-52.5.3esr' Adding client.mk options from /tmp/B.1_qms0/BUILD/firefox-52.5.3esr/.mozconfig: MOZ_OBJDIR=/tmp/B.1_qms0/BUILD/firefox-52.5.3esr/obj-i686 OBJDIR=/tmp/B.1_qms0/BUILD/firefox-52.5.3esr/obj-i686 FOUND_MOZCONFIG=/tmp/B.1_qms0/BUILD/firefox-52.5.3esr/.mozconfig make[2]: Entering directory '/tmp/B.1_qms0/BUILD/firefox-52.5.3esr' cp /tmp/B.1_qms0/BUILD/firefox-52.5.3esr/.mozconfig /tmp/B.1_qms0/BUILD/firefox-52.5.3esr/obj-i686/.mozconfig cd /tmp/B.1_qms0/BUILD/firefox-52.5.3esr/obj-i686 /tmp/B.1_qms0/BUILD/firefox-52.5.3esr/configure Creating Python environment New python executable in /tmp/B.1_qms0/BUILD/firefox-52.5.3esr/obj-i686/_virtualenv/bin/python2.7 Also creating executable in /tmp/B.1_qms0/BUILD/firefox-52.5.3esr/obj-i686/_virtualenv/bin/python Installing setuptools, pip, wheel...done. running build_ext building 'psutil._psutil_linux' extension creating build/temp.linux-i686-2.7 creating build/temp.linux-i686-2.7/psutil i686-pld-linux-gcc -pthread -fno-strict-aliasing -O2 -fwrapv -pipe -Wformat -Werror=format-security -gdwarf-4 -fno-debug-types-section -fvar-tracking-assignments -g2 -Wp,-D_FORTIFY_SOURCE=2 -fstack-protector-strong --param=ssp-buffer-size=4 -fomit-frame-pointer -march=i686 -fasynchronous-unwind-tables -mtune=pentium4 -gdwarf-4 -fno-debug-types-section -fvar-tracking-assignments -g2 -DNDEBUG -O2 -fwrapv -pipe -Wformat -Werror=format-security -gdwarf-4 -fno-debug-types-section -fvar-tracking-assignments -g2 -Wp,-D_FORTIFY_SOURCE=2 -fstack-protector-strong --param=ssp-buffer-size=4 -fomit-frame-pointer -march=i686 -fasynchronous-unwind-tables -mtune=pentium4 -gdwarf-4 -fno-debug-types-section -fvar-tracking-assignments -g2 -fPIC -DPSUTIL_VERSION=311 -I/usr/include/python2.7 -c psutil/_psutil_linux.c -o build/temp.linux-i686-2.7/psutil/_psutil_linux.o psutil/_psutil_linux.c: In function 'init_psutil_linux': psutil/_psutil_linux.c:652:54: warning: overflow in implicit constant conversion [-Woverflow] PyModule_AddIntConstant(module, "RLIM_INFINITY", RLIM_INFINITY); ^~~~~~~~~~~~~ creating build/lib.linux-i686-2.7 creating build/lib.linux-i686-2.7/psutil i686-pld-linux-gcc -pthread -shared -Wl,--as-needed -Wl,--no-copy-dt-needed-entries -Wl,-z,relro -Wl,-z,combreloc build/temp.linux-i686-2.7/psutil/_psutil_linux.o -L/usr/lib -lpython2.7 -o build/lib.linux-i686-2.7/psutil/_psutil_linux.so building 'psutil._psutil_posix' extension i686-pld-linux-gcc -pthread -fno-strict-aliasing -O2 -fwrapv -pipe -Wformat -Werror=format-security -gdwarf-4 -fno-debug-types-section -fvar-tracking-assignments -g2 -Wp,-D_FORTIFY_SOURCE=2 -fstack-protector-strong --param=ssp-buffer-size=4 -fomit-frame-pointer -march=i686 -fasynchronous-unwind-tables -mtune=pentium4 -gdwarf-4 -fno-debug-types-section -fvar-tracking-assignments -g2 -DNDEBUG -O2 -fwrapv -pipe -Wformat -Werror=format-security -gdwarf-4 -fno-debug-types-section -fvar-tracking-assignments -g2 -Wp,-D_FORTIFY_SOURCE=2 -fstack-protector-strong --param=ssp-buffer-size=4 -fomit-frame-pointer -march=i686 -fasynchronous-unwind-tables -mtune=pentium4 -gdwarf-4 -fno-debug-types-section -fvar-tracking-assignments -g2 -fPIC -I/usr/include/python2.7 -c psutil/_psutil_posix.c -o build/temp.linux-i686-2.7/psutil/_psutil_posix.o i686-pld-linux-gcc -pthread -shared -Wl,--as-needed -Wl,--no-copy-dt-needed-entries -Wl,-z,relro -Wl,-z,combreloc build/temp.linux-i686-2.7/psutil/_psutil_posix.o -L/usr/lib -lpython2.7 -o build/lib.linux-i686-2.7/psutil/_psutil_posix.so copying build/lib.linux-i686-2.7/psutil/_psutil_linux.so -> psutil copying build/lib.linux-i686-2.7/psutil/_psutil_posix.so -> psutil Reexecuting in the virtualenv Adding configure options from /tmp/B.1_qms0/BUILD/firefox-52.5.3esr/.mozconfig --enable-application=browser --host=i686-pld-linux --prefix=/usr --disable-debug --enable-optimize=-O2 -fwrapv -pipe -Wformat -Werror=format-security -gdwarf-4 -fno-debug-types-section -fvar-tracking-assignments -g2 -Wp,-D_FORTIFY_SOURCE=2 -fstack-protector-strong --param=ssp-buffer-size=4 -fomit-frame-pointer -march=i686 -fasynchronous-unwind-tables -mtune=pentium4 -gdwarf-4 -fno-debug-types-section -fvar-tracking-assignments -g2 --disable-strip --disable-install-strip --disable-tests --disable-crashreporter --disable-gconf --disable-gnomeui --disable-necko-wifi --disable-updater --enable-alsa --enable-chrome-format=omni --enable-default-toolkit=cairo-gtk3 --enable-extensions=default --enable-gio --enable-readline --enable-safe-browsing --enable-startup-notification --enable-system-cairo --enable-system-ffi --enable-system-hunspell --enable-system-sqlite --enable-url-classifier --enable-official-branding --with-default-mozilla-five-home=/usr/lib/firefox52-esr --with-distribution-id=org.pld-linux --with-pthreads --with-system-bz2 --without-system-icu --with-system-jpeg --with-system-libevent --with-system-libvpx --with-system-nspr --with-system-nss --with-system-png --with-system-zlib --with-x CC=clang CXX=clang++ EPOCHREALTIME=1515692651.810482 RANDOM=2624 checking for a shell... /bin/sh checking for host system type... i686-pld-linux-gnu checking for target system type... i686-pld-linux-gnu checking whether cross compiling... no checking for pkg_config... /usr/bin/pkg-config checking for pkg-config version... 0.29.2 checking for yasm... /usr/bin/yasm checking yasm version... 1.3.0 checking for the target C compiler... /usr/bin/clang checking whether the target C compiler can be used... yes checking the target C compiler version... 3.9.1 checking the target C compiler works... yes checking for the target C++ compiler... /usr/bin/clang++ checking whether the target C++ compiler can be used... yes checking the target C++ compiler version... 3.9.1 checking the target C++ compiler works... yes checking for the host C compiler... /usr/bin/clang checking whether the host C compiler can be used... yes checking the host C compiler version... 3.9.1 checking the host C compiler works... yes checking for the host C++ compiler... /usr/bin/clang++ checking whether the host C++ compiler can be used... yes checking the host C++ compiler version... 3.9.1 checking the host C++ compiler works... yes checking for 64-bit OS... no checking for stdint.h... yes checking for inttypes.h... yes checking for malloc.h... yes checking for alloca.h... yes checking for sys/byteorder.h... no checking for getopt.h... yes checking for unistd.h... yes checking for nl_types.h... yes checking for cpuid.h... yes checking for sys/statvfs.h... yes checking for sys/statfs.h... yes checking for sys/vfs.h... yes checking for sys/mount.h... yes checking for sys/quota.h... yes checking for linux/quota.h... yes checking for linux/if_addr.h... yes checking for linux/rtnetlink.h... yes checking for sys/queue.h... yes checking for sys/types.h... yes checking for netinet/in.h... yes checking for byteswap.h... yes checking for linux/perf_event.h... yes checking for perf_event_open system call... yes checking whether the C compiler supports -Wclass-varargs... yes checking whether the C++ compiler supports -Wclass-varargs... yes checking whether the C compiler supports -Wloop-analysis... yes checking whether the C++ compiler supports -Wloop-analysis... yes checking whether the C++ compiler supports -Wc++11-compat-pedantic... yes checking whether the C++ compiler supports -Wc++14-compat... yes checking whether the C++ compiler supports -Wc++14-compat-pedantic... yes checking whether the C++ compiler supports -Wc++1z-compat... yes checking whether the C++ compiler supports -Wimplicit-fallthrough... yes checking whether the C compiler supports -Wstring-conversion... yes checking whether the C++ compiler supports -Wstring-conversion... yes checking whether the C compiler supports -Wthread-safety... yes checking whether the C++ compiler supports -Wthread-safety... yes checking whether the C++ compiler supports -Wno-inline-new-delete... yes checking whether the C compiler supports -Wno-error=maybe-uninitialized... no checking whether the C++ compiler supports -Wno-error=maybe-uninitialized... no checking whether the C compiler supports -Wno-error=deprecated-declarations... yes checking whether the C++ compiler supports -Wno-error=deprecated-declarations... yes checking whether the C compiler supports -Wno-error=array-bounds... yes checking whether the C++ compiler supports -Wno-error=array-bounds... yes checking for libffi > 3.0.9... yes checking MOZ_FFI_CFLAGS... -I/usr/lib/libffi-3.2.1/include checking MOZ_FFI_LIBS... -lffi checking for pango >= 1.22.0 pangoft2 >= 1.22.0 pangocairo >= 1.22.0... yes checking MOZ_PANGO_CFLAGS... -I/usr/include/pango-1.0 -I/usr/include/cairo -I/usr/include/pixman-1 -I/usr/include/freetype2 -I/usr/include/libpng16 -I/usr/include/harfbuzz -I/usr/include/glib-2.0 -I/usr/lib/glib-2.0/include -I/usr/include/freetype2 -I/usr/include/harfbuzz -I/usr/include/glib-2.0 -I/usr/lib/glib-2.0/include -I/usr/include/libpng16 checking MOZ_PANGO_LIBS... -lpangoft2-1.0 -lfontconfig -lfreetype -lpangocairo-1.0 -lpango-1.0 -lgobject-2.0 -lglib-2.0 -lcairo checking for fontconfig >= 2.7.0... yes checking _FONTCONFIG_CFLAGS... -I/usr/include/freetype2 -I/usr/include/libpng16 -I/usr/include/harfbuzz -I/usr/include/glib-2.0 -I/usr/lib/glib-2.0/include -I/usr/include/freetype2 -I/usr/include/libpng16 -I/usr/include/harfbuzz -I/usr/include/glib-2.0 -I/usr/lib/glib-2.0/include checking _FONTCONFIG_LIBS... -lfontconfig -lfreetype checking for freetype2 >= 6.1.0... yes checking _FT2_CFLAGS... -I/usr/include/freetype2 -I/usr/include/libpng16 -I/usr/include/harfbuzz -I/usr/include/glib-2.0 -I/usr/lib/glib-2.0/include checking _FT2_LIBS... -lfreetype checking for tar... /usr/bin/gtar checking for unzip... /usr/bin/unzip checking for zip... /usr/bin/zip checking for the Mozilla API key... no checking for the Google API key... no checking for the Bing API key... no checking for the Adjust SDK key... no checking for awk... /usr/bin/gawk checking for perl... /usr/bin/perl checking for minimum required perl version >= 5.006... 5.026001 checking for full perl installation... yes checking for gmake... /usr/bin/make checking for doxygen... /usr/bin/doxygen checking for xargs... /bin/xargs checking for rpmbuild... /usr/bin/rpmbuild checking for hunspell... yes checking MOZ_HUNSPELL_CFLAGS... -I/usr/include/hunspell checking MOZ_HUNSPELL_LIBS... -lhunspell-1.6 checking for autoconf... /usr/bin/autoconf2_13 creating cache ./config.cache checking host system type... i686-pld-linux-gnu checking target system type... i686-pld-linux-gnu checking build system type... i686-pld-linux-gnu checking for objcopy... /usr/bin/objcopy checking for gcc... /usr/bin/clang -std=gnu99 checking whether the C compiler (/usr/bin/clang -std=gnu99 ) works... yes checking whether the C compiler (/usr/bin/clang -std=gnu99 ) is a cross-compiler... no checking whether we are using GNU C... yes checking whether /usr/bin/clang -std=gnu99 accepts -g... yes checking for c++... /usr/bin/clang++ -std=gnu++11 checking whether the C++ compiler (/usr/bin/clang++ -std=gnu++11 ) works... yes checking whether the C++ compiler (/usr/bin/clang++ -std=gnu++11 ) is a cross-compiler... no checking whether we are using GNU C++... yes checking whether /usr/bin/clang++ -std=gnu++11 accepts -g... yes checking for ranlib... ranlib checking for as... /usr/bin/as checking for ar... ar checking for ld... ld checking for strip... strip checking for windres... no checking for otool... no checking for X... libraries , headers checking for dnet_ntoa in -ldnet... no checking for dnet_ntoa in -ldnet_stub... no checking for gethostbyname... yes checking for connect... yes checking for remove... yes checking for shmat... yes checking for IceConnectionNumber in -lICE... yes checking for --noexecstack option to as... yes checking for -z noexecstack option to ld... yes checking for -z text option to ld... yes checking for --build-id option to ld... yes checking for --ignore-unresolved-symbol option to ld... yes checking if toolchain supports -mssse3 option... yes checking if toolchain supports -msse4.1 option... yes checking for x86 AVX2 asm support in compiler... yes checking for working const... yes checking for mode_t... yes checking for off_t... yes checking for pid_t... yes checking for size_t... yes checking whether 64-bits std::atomic requires -latomic... yes checking for dirent.h that defines DIR... yes checking for opendir in -ldir... no checking for sockaddr_in.sin_len... false checking for sockaddr_in6.sin6_len... false checking for sockaddr.sa_len... false checking for gethostbyname_r in -lc_r... no checking for library containing dlopen... -ldl checking for dlfcn.h... yes checking for dladdr... yes checking for memmem... yes checking for socket in -lsocket... no checking for XDrawLines in -lX11... yes checking for XextAddDisplay in -lXext... yes checking for XtFree in -lXt... yes checking for xcb_connect in -lxcb... yes checking for xcb_shm_query_version in -lxcb-shm... yes checking for XGetXCBConnection in -lX11-xcb... yes checking for X11/extensions/scrnsaver.h... yes checking for XScreenSaverQueryInfo in -lXss... yes checking for pthread_create in -lpthreads... no checking for pthread_create in -lpthread... yes checking whether /usr/bin/clang -std=gnu99 accepts -pthread... yes checking for pthread.h... yes checking whether /usr/bin/clang -std=gnu99 needs -traditional... no checking for 8-bit clean memcmp... yes checking for stat64... yes checking for lstat64... yes checking for truncate64... yes checking for statvfs64... yes checking for statvfs... yes checking for statfs64... yes checking for statfs... yes checking for getpagesize... yes checking for gmtime_r... yes checking for localtime_r... yes checking for arc4random... no checking for arc4random_buf... no checking for mallinfo... yes checking for gettid... no checking for lchown... yes checking for setpriority... yes checking for strerror... yes checking for syscall... yes checking for clock_gettime(CLOCK_MONOTONIC)... checking for pthread_cond_timedwait_monotonic_np... checking for wcrtomb... yes checking for mbrtowc... yes checking for res_ninit()... yes checking for iconv in -lc... yes checking for iconv()... yes checking for iconv() with const input... no checking for nl_langinfo and CODESET... yes checking for an implementation of va_copy()... yes checking whether va_list can be copied by value... yes checking whether the C++ "using" keyword resolves ambiguity... yes checking for C++ dynamic_cast to void*... yes checking for __thread keyword for TLS variables... yes checking for __attribute__((always_inline))... yes checking for LC_MESSAGES... yes checking for localeconv... yes checking for malloc.h... yes checking for strndup... yes checking for posix_memalign... yes checking for memalign... yes checking for malloc_usable_size... yes checking whether malloc_usable_size definition can use const argument... no checking for valloc in malloc.h... yes checking for valloc in unistd.h... no checking NSPR selection... system checking for nspr-config... /usr/bin/nspr-config checking for NSPR - version >= 4.13.1... yes checking for libevent... yes checking MOZ_LIBEVENT_CFLAGS... checking MOZ_LIBEVENT_LIBS... -levent checking for nss-config... /usr/bin/nss-config checking for NSS - version >= 3.28.6... yes checking for jpeg_destroy_compress in -ljpeg... yes checking for gzread in -lz... yes checking for BZ2_bzread in -lbz2... yes checking for png_get_valid in -lpng... yes checking for png_get_acTL in -lpng... yes checking if app-specific confvars.sh exists... /tmp/B.1_qms0/BUILD/firefox-52.5.3esr/browser/confvars.sh checking for gtk+-3.0 >= 3.4.0 gtk+-unix-print-3.0 glib-2.0 gobject-2.0 ... yes checking MOZ_GTK3_CFLAGS... -pthread -I/usr/include/gtk-3.0/unix-print -I/usr/include/gtk-3.0 -I/usr/include/at-spi2-atk/2.0 -I/usr/include/at-spi-2.0 -I/usr/include/dbus-1.0 -I/usr/lib/dbus-1.0/include -I/usr/include/gtk-3.0 -I/usr/include/gio-unix-2.0/ -I/usr/include/cairo -I/usr/include/pango-1.0 -I/usr/include/atk-1.0 -I/usr/include/cairo -I/usr/include/pixman-1 -I/usr/include/freetype2 -I/usr/include/libpng16 -I/usr/include/harfbuzz -I/usr/include/glib-2.0 -I/usr/lib/glib-2.0/include -I/usr/include/freetype2 -I/usr/include/harfbuzz -I/usr/include/libpng16 -I/usr/include/gdk-pixbuf-2.0 -I/usr/include/glib-2.0 -I/usr/lib/glib-2.0/include checking MOZ_GTK3_LIBS... -lgtk-3 -lgdk-3 -lpangocairo-1.0 -lpango-1.0 -latk-1.0 -lcairo-gobject -lcairo -lgdk_pixbuf-2.0 -lgio-2.0 -lgobject-2.0 -lglib-2.0 checking for gtk+-2.0 >= 2.18.0 gtk+-unix-print-2.0 glib-2.0 >= 2.22 gobject-2.0 gdk-x11-2.0... yes checking MOZ_GTK2_CFLAGS... -pthread -I/usr/include/gtk-2.0 -I/usr/include/gtk-unix-print-2.0 -I/usr/include/gtk-2.0 -I/usr/include/atk-1.0 -I/usr/include/gtk-2.0 -I/usr/lib/gtk-2.0/include -I/usr/include/pango-1.0 -I/usr/include/gio-unix-2.0/ -I/usr/include/gdk-pixbuf-2.0 -I/usr/include/cairo -I/usr/include/pixman-1 -I/usr/include/freetype2 -I/usr/include/libpng16 -I/usr/include/harfbuzz -I/usr/include/glib-2.0 -I/usr/lib/glib-2.0/include -I/usr/include/freetype2 -I/usr/include/harfbuzz -I/usr/include/glib-2.0 -I/usr/lib/glib-2.0/include -I/usr/include/libpng16 checking MOZ_GTK2_LIBS... -lgtk-x11-2.0 -latk-1.0 -lpangoft2-1.0 -lgdk-x11-2.0 -lpangocairo-1.0 -lpango-1.0 -lgio-2.0 -lfontconfig -lfreetype -lXrender -lXinerama -lXi -lXrandr -lXcursor -lXcomposite -lXdamage -lXfixes -lgdk_pixbuf-2.0 -lgobject-2.0 -lglib-2.0 -lcairo -lX11 -lXext checking for libstartup-notification-1.0 >= 0.8... yes checking MOZ_STARTUP_NOTIFICATION_CFLAGS... -I/usr/include/startup-notification-1.0 checking MOZ_STARTUP_NOTIFICATION_LIBS... -lstartup-notification-1 checking for gio-2.0 >= 2.22... yes checking MOZ_GIO_CFLAGS... -pthread -I/usr/include/glib-2.0 -I/usr/lib/glib-2.0/include checking MOZ_GIO_LIBS... -lgio-2.0 -lgobject-2.0 -lglib-2.0 checking for dbus-1 >= 0.60... yes checking MOZ_DBUS_CFLAGS... -I/usr/include/dbus-1.0 -I/usr/lib/dbus-1.0/include checking MOZ_DBUS_LIBS... -ldbus-1 checking for dbus-glib-1 >= 0.60... yes checking MOZ_DBUS_GLIB_CFLAGS... -I/usr/include/dbus-1.0 -I/usr/lib/dbus-1.0/include -I/usr/include/glib-2.0 -I/usr/lib/glib-2.0/include checking MOZ_DBUS_GLIB_LIBS... -ldbus-glib-1 -ldbus-1 -lgobject-2.0 -lglib-2.0 checking for vpx >= 1.5.0... yes checking MOZ_LIBVPX_CFLAGS... checking MOZ_LIBVPX_LIBS... -lvpx -lm checking for vpx/vpx_decoder.h... yes checking for vpx_codec_dec_init_ver in -lvpx... yes checking for vpx_mem/vpx_mem.h... no checking for alsa... yes checking MOZ_ALSA_CFLAGS... -I/usr/include/alsa checking MOZ_ALSA_LIBS... -lasound checking for libpulse... yes checking MOZ_PULSEAUDIO_CFLAGS... -D_REENTRANT checking MOZ_PULSEAUDIO_LIBS... -lpulse checking for linux/joystick.h... yes checking for wget... wget checking for sqlite3 >= 3.17.0... yes checking SQLITE_CFLAGS... checking SQLITE_LIBS... -lsqlite3 checking for SQLITE_SECURE_DELETE support in system SQLite... yes checking for SQLITE_THREADSAFE support in system SQLite... yes checking for SQLITE_ENABLE_FTS3 support in system SQLite... yes checking for SQLITE_ENABLE_UNLOCK_NOTIFY support in system SQLite... yes checking for SQLITE_ENABLE_DBSTAT_VTAB support in system SQLite... yes checking for valid C compiler optimization flags... no configure: error: These compiler flags for C are invalid: -O2 -fwrapv -pipe -Wformat -Werror=format-security -gdwarf-4 -fno-debug-types-section -fvar-tracking-assignments -g2 -Wp,-D_FORTIFY_SOURCE=2 -fstack-protector-strong --param=ssp-buffer-size=4 -fomit-frame-pointer -march=i686 -fasynchronous-unwind-tables -mtune=pentium4 -gdwarf-4 -fno-debug-types-section -fvar-tracking-assignments -g2 DEBUG: <truncated - see config.log for full output> DEBUG: configure:16018: checking for SQLITE_THREADSAFE support in system SQLite DEBUG: configure:16041: /usr/bin/clang -std=gnu99 -o conftest -fno-strict-aliasing -fno-math-errno -pthread -Qunused-arguments -lpthread -Wl,-z,noexecstack -Wl,-z,text -Wl,--build-id -B /tmp/B.1_qms0/BUILD/firefox-52.5.3esr/obj-i686/build/unix/gold conftest.c -ldl -lsqlite3 1>&5 DEBUG: configure:16064: checking for SQLITE_ENABLE_FTS3 support in system SQLite DEBUG: configure:16087: /usr/bin/clang -std=gnu99 -o conftest -fno-strict-aliasing -fno-math-errno -pthread -Qunused-arguments -lpthread -Wl,-z,noexecstack -Wl,-z,text -Wl,--build-id -B /tmp/B.1_qms0/BUILD/firefox-52.5.3esr/obj-i686/build/unix/gold conftest.c -ldl -lsqlite3 1>&5 DEBUG: configure:16110: checking for SQLITE_ENABLE_UNLOCK_NOTIFY support in system SQLite DEBUG: configure:16133: /usr/bin/clang -std=gnu99 -o conftest -fno-strict-aliasing -fno-math-errno -pthread -Qunused-arguments -lpthread -Wl,-z,noexecstack -Wl,-z,text -Wl,--build-id -B /tmp/B.1_qms0/BUILD/firefox-52.5.3esr/obj-i686/build/unix/gold conftest.c -ldl -lsqlite3 1>&5 DEBUG: configure:16156: checking for SQLITE_ENABLE_DBSTAT_VTAB support in system SQLite DEBUG: configure:16179: /usr/bin/clang -std=gnu99 -o conftest -fno-strict-aliasing -fno-math-errno -pthread -Qunused-arguments -lpthread -Wl,-z,noexecstack -Wl,-z,text -Wl,--build-id -B /tmp/B.1_qms0/BUILD/firefox-52.5.3esr/obj-i686/build/unix/gold conftest.c -ldl -lsqlite3 1>&5 DEBUG: configure:16363: checking for valid C compiler optimization flags DEBUG: configure:16374: /usr/bin/clang -std=gnu99 -c -fno-strict-aliasing -fno-math-errno -pthread -O2 -fwrapv -pipe -Wformat -Werror=format-security -gdwarf-4 -fno-debug-types-section -fvar-tracking-assignments -g2 -Wp,-D_FORTIFY_SOURCE=2 -fstack-protector-strong --param=ssp-buffer-size=4 -fomit-frame-pointer -march=i686 -fasynchronous-unwind-tables -mtune=pentium4 -gdwarf-4 -fno-debug-types-section -fvar-tracking-assignments -g2 -Qunused-arguments conftest.c 1>&5 DEBUG: clang-3.9: error: unknown argument: '-fvar-tracking-assignments' DEBUG: clang-3.9: error: unknown argument: '-fvar-tracking-assignments' DEBUG: configure: failed program was: DEBUG: #line 16367 "configure" DEBUG: #include "confdefs.h" DEBUG: #include <stdio.h> DEBUG: int main() { DEBUG: printf("Hello World\n"); DEBUG: ; return 0; } DEBUG: configure: error: These compiler flags for C are invalid: -O2 -fwrapv -pipe -Wformat -Werror=format-security -gdwarf-4 -fno-debug-types-section -fvar-tracking-assignments -g2 -Wp,-D_FORTIFY_SOURCE=2 -fstack-protector-strong --param=ssp-buffer-size=4 -fomit-frame-pointer -march=i686 -fasynchronous-unwind-tables -mtune=pentium4 -gdwarf-4 -fno-debug-types-section -fvar-tracking-assignments -g2 ERROR: old-configure failed *** Fix above errors and then restart with\ "/usr/bin/make -f client.mk build" make[2]: *** [/tmp/B.1_qms0/BUILD/firefox-52.5.3esr/client.mk:379: configure] Error 1 make[2]: Leaving directory '/tmp/B.1_qms0/BUILD/firefox-52.5.3esr' make[1]: *** [/tmp/B.1_qms0/BUILD/firefox-52.5.3esr/client.mk:392: /tmp/B.1_qms0/BUILD/firefox-52.5.3esr/obj-i686/Makefile] Error 2 make[1]: Leaving directory '/tmp/B.1_qms0/BUILD/firefox-52.5.3esr' make: *** [client.mk:170: build] Error 2 error: Bad exit status from /tmp/B.1_qms0/BUILD/tmp/rpm-tmp.67409 (%build) RPM build errors: Bad exit status from /tmp/B.1_qms0/BUILD/tmp/rpm-tmp.67409 (%build) ended at: Thu Jan 11 18:44:25 2018, done in 0:04:18.051623 error: No files produced. + chmod -R u+rwX /tmp/B.1_qms0/BUILD + rm -rf /tmp/B.1_qms0/tmp /tmp/B.1_qms0/BUILD + rm -rf /tmp/B.1_qms0 Begin-PLD-Builder-Info Build-Time: user:31.81s sys:18.41s real:460.27s (faults io:63 non-io:1090113) End-PLD-Builder-Info
[Back to list of logs] [View rpm -qa of builder]