FailedOk

th/SRPMS[OK]
th/x32[OK]
th/i686[OK]
th/x86_64[OK]

ac/SRPMS[OK]
ac/i386[OK]
ac/i586[OK]
ac/i686[OK]
ac/alpha[OK]
ac/amd64[OK]
ac/athlon[OK]
ac/ppc[OK]
ac/sparc[OK]
ac/sparc64[OK]

Advanced Search
main()
Powered by PLD Linux
(c) 2002-2018 PLD Team
$Revision: 1.37 $
Powered by foobar.
Your IP: 54.162.239.233

fontconfig 3b6619e4-8661-44cf-bed1-c66aa21cdeda

Status:Failed
Source URL:ftp://buildlogs.pld-linux.org/th/i686/FAIL/fontconfig,3b6619e4-8661-44cf-bed1-c66aa21cdeda.bz2
text/plain URL:View!
full text:View!
rpm -qa of builder:View!
Date:2018/03/11 12:57:58
Runtime:0:00:38.400840

Toc:

Content:

make[3]: Leaving directory '/tmp/B.wW5vgi/BUILD/fontconfig-2.13.0/test'
make[3]: Entering directory '/tmp/B.wW5vgi/BUILD/fontconfig-2.13.0/test'
i686-pld-linux-gcc -DHAVE_CONFIG_H -I. -I..  -I.. -I..  -DSRCDIR="\"/tmp/B.wW5vgi/BUILD/fontconfig-2.13.0/test\"" -O2 -fwrapv -pipe -Wformat -Werror=format-security -gdwarf-4 -fno-debug-types-section -fvar-tracking-assignments -g2 -Wp,-D_FORTIFY_SOURCE=2 -fstack-protector-strong --param=ssp-buffer-size=4 -fomit-frame-pointer -march=i686 -fasynchronous-unwind-tables -mtune=pentium4 -gdwarf-4 -fno-debug-types-section -fvar-tracking-assignments -g2  -pthread -MT test_bz89617-test-bz89617.o -MD -MP -MF .deps/test_bz89617-test-bz89617.Tpo -c -o test_bz89617-test-bz89617.o `test -f 'test-bz89617.c' || echo './'`test-bz89617.c
mv -f .deps/test_bz89617-test-bz89617.Tpo .deps/test_bz89617-test-bz89617.Po
make[3]: Leaving directory '/tmp/B.wW5vgi/BUILD/fontconfig-2.13.0/test'
make[3]: Entering directory '/tmp/B.wW5vgi/BUILD/fontconfig-2.13.0/test'
i686-pld-linux-gcc -DHAVE_CONFIG_H -I. -I..  -I.. -I..   -O2 -fwrapv -pipe -Wformat -Werror=format-security -gdwarf-4 -fno-debug-types-section -fvar-tracking-assignments -g2 -Wp,-D_FORTIFY_SOURCE=2 -fstack-protector-strong --param=ssp-buffer-size=4 -fomit-frame-pointer -march=i686 -fasynchronous-unwind-tables -mtune=pentium4 -gdwarf-4 -fno-debug-types-section -fvar-tracking-assignments -g2  -pthread -MT test-bz131804.o -MD -MP -MF .deps/test-bz131804.Tpo -c -o test-bz131804.o test-bz131804.c
mv -f .deps/test-bz131804.Tpo .deps/test-bz131804.Po
make[3]: Leaving directory '/tmp/B.wW5vgi/BUILD/fontconfig-2.13.0/test'
make[3]: Entering directory '/tmp/B.wW5vgi/BUILD/fontconfig-2.13.0/test'
i686-pld-linux-gcc -DHAVE_CONFIG_H -I. -I..  -I.. -I..   -O2 -fwrapv -pipe -Wformat -Werror=format-security -gdwarf-4 -fno-debug-types-section -fvar-tracking-assignments -g2 -Wp,-D_FORTIFY_SOURCE=2 -fstack-protector-strong --param=ssp-buffer-size=4 -fomit-frame-pointer -march=i686 -fasynchronous-unwind-tables -mtune=pentium4 -gdwarf-4 -fno-debug-types-section -fvar-tracking-assignments -g2  -pthread -MT test-pthread.o -MD -MP -MF .deps/test-pthread.Tpo -c -o test-pthread.o test-pthread.c
mv -f .deps/test-pthread.Tpo .deps/test-pthread.Po
make[3]: Leaving directory '/tmp/B.wW5vgi/BUILD/fontconfig-2.13.0/test'
make[3]: Entering directory '/tmp/B.wW5vgi/BUILD/fontconfig-2.13.0/test'
i686-pld-linux-gcc -DHAVE_CONFIG_H -I. -I..  -I.. -I..   -O2 -fwrapv -pipe -Wformat -Werror=format-security -gdwarf-4 -fno-debug-types-section -fvar-tracking-assignments -g2 -Wp,-D_FORTIFY_SOURCE=2 -fstack-protector-strong --param=ssp-buffer-size=4 -fomit-frame-pointer -march=i686 -fasynchronous-unwind-tables -mtune=pentium4 -gdwarf-4 -fno-debug-types-section -fvar-tracking-assignments -g2  -pthread -MT test-migration.o -MD -MP -MF .deps/test-migration.Tpo -c -o test-migration.o test-migration.c
mv -f .deps/test-migration.Tpo .deps/test-migration.Po
make[3]: Leaving directory '/tmp/B.wW5vgi/BUILD/fontconfig-2.13.0/test'
make[3]: Entering directory '/tmp/B.wW5vgi/BUILD/fontconfig-2.13.0/test'
/bin/sh ../libtool  --tag=CC   --mode=link i686-pld-linux-gcc  -O2 -fwrapv -pipe -Wformat -Werror=format-security -gdwarf-4 -fno-debug-types-section -fvar-tracking-assignments -g2 -Wp,-D_FORTIFY_SOURCE=2 -fstack-protector-strong --param=ssp-buffer-size=4 -fomit-frame-pointer -march=i686 -fasynchronous-unwind-tables -mtune=pentium4 -gdwarf-4 -fno-debug-types-section -fvar-tracking-assignments -g2  -pthread  -Wl,--as-needed -Wl,--no-copy-dt-needed-entries -Wl,-z,relro -Wl,-z,combreloc  -o test-bz96676 test-bz96676.o ../src/libfontconfig.la 
libtool: link: i686-pld-linux-gcc -O2 -fwrapv -pipe -Wformat -Werror=format-security -gdwarf-4 -fno-debug-types-section -fvar-tracking-assignments -g2 -Wp,-D_FORTIFY_SOURCE=2 -fstack-protector-strong --param=ssp-buffer-size=4 -fomit-frame-pointer -march=i686 -fasynchronous-unwind-tables -mtune=pentium4 -gdwarf-4 -fno-debug-types-section -fvar-tracking-assignments -g2 -pthread -Wl,--as-needed -Wl,--no-copy-dt-needed-entries -Wl,-z -Wl,relro -Wl,-z -Wl,combreloc -o .libs/test-bz96676 test-bz96676.o  ../src/.libs/libfontconfig.so /usr/lib/libfreetype.so /usr/lib/libbz2.so /usr/lib/libpng16.so -lm -lz -lharfbuzz /usr/lib/libexpat.so /usr/lib/libuuid.so -pthread
make[3]: Leaving directory '/tmp/B.wW5vgi/BUILD/fontconfig-2.13.0/test'
make[3]: Entering directory '/tmp/B.wW5vgi/BUILD/fontconfig-2.13.0/test'
/bin/sh ../libtool  --tag=CC   --mode=link i686-pld-linux-gcc -DSRCDIR="\"/tmp/B.wW5vgi/BUILD/fontconfig-2.13.0/test\"" -O2 -fwrapv -pipe -Wformat -Werror=format-security -gdwarf-4 -fno-debug-types-section -fvar-tracking-assignments -g2 -Wp,-D_FORTIFY_SOURCE=2 -fstack-protector-strong --param=ssp-buffer-size=4 -fomit-frame-pointer -march=i686 -fasynchronous-unwind-tables -mtune=pentium4 -gdwarf-4 -fno-debug-types-section -fvar-tracking-assignments -g2  -pthread  -Wl,--as-needed -Wl,--no-copy-dt-needed-entries -Wl,-z,relro -Wl,-z,combreloc  -o test-bz89617 test_bz89617-test-bz89617.o ../src/libfontconfig.la 
libtool: link: i686-pld-linux-gcc -DSRCDIR=\"/tmp/B.wW5vgi/BUILD/fontconfig-2.13.0/test\" -O2 -fwrapv -pipe -Wformat -Werror=format-security -gdwarf-4 -fno-debug-types-section -fvar-tracking-assignments -g2 -Wp,-D_FORTIFY_SOURCE=2 -fstack-protector-strong --param=ssp-buffer-size=4 -fomit-frame-pointer -march=i686 -fasynchronous-unwind-tables -mtune=pentium4 -gdwarf-4 -fno-debug-types-section -fvar-tracking-assignments -g2 -pthread -Wl,--as-needed -Wl,--no-copy-dt-needed-entries -Wl,-z -Wl,relro -Wl,-z -Wl,combreloc -o .libs/test-bz89617 test_bz89617-test-bz89617.o  ../src/.libs/libfontconfig.so /usr/lib/libfreetype.so /usr/lib/libbz2.so /usr/lib/libpng16.so -lm -lz -lharfbuzz /usr/lib/libexpat.so /usr/lib/libuuid.so -pthread
make[3]: Leaving directory '/tmp/B.wW5vgi/BUILD/fontconfig-2.13.0/test'
make[3]: Entering directory '/tmp/B.wW5vgi/BUILD/fontconfig-2.13.0/test'
/bin/sh ../libtool  --tag=CC   --mode=link i686-pld-linux-gcc  -O2 -fwrapv -pipe -Wformat -Werror=format-security -gdwarf-4 -fno-debug-types-section -fvar-tracking-assignments -g2 -Wp,-D_FORTIFY_SOURCE=2 -fstack-protector-strong --param=ssp-buffer-size=4 -fomit-frame-pointer -march=i686 -fasynchronous-unwind-tables -mtune=pentium4 -gdwarf-4 -fno-debug-types-section -fvar-tracking-assignments -g2  -pthread  -Wl,--as-needed -Wl,--no-copy-dt-needed-entries -Wl,-z,relro -Wl,-z,combreloc  -o test-bz131804 test-bz131804.o ../src/libfontconfig.la 
libtool: link: i686-pld-linux-gcc -O2 -fwrapv -pipe -Wformat -Werror=format-security -gdwarf-4 -fno-debug-types-section -fvar-tracking-assignments -g2 -Wp,-D_FORTIFY_SOURCE=2 -fstack-protector-strong --param=ssp-buffer-size=4 -fomit-frame-pointer -march=i686 -fasynchronous-unwind-tables -mtune=pentium4 -gdwarf-4 -fno-debug-types-section -fvar-tracking-assignments -g2 -pthread -Wl,--as-needed -Wl,--no-copy-dt-needed-entries -Wl,-z -Wl,relro -Wl,-z -Wl,combreloc -o .libs/test-bz131804 test-bz131804.o  ../src/.libs/libfontconfig.so /usr/lib/libfreetype.so /usr/lib/libbz2.so /usr/lib/libpng16.so -lm -lz -lharfbuzz /usr/lib/libexpat.so /usr/lib/libuuid.so -pthread
make[3]: Leaving directory '/tmp/B.wW5vgi/BUILD/fontconfig-2.13.0/test'
make[3]: Entering directory '/tmp/B.wW5vgi/BUILD/fontconfig-2.13.0/test'
/bin/sh ../libtool  --tag=CC   --mode=link i686-pld-linux-gcc  -O2 -fwrapv -pipe -Wformat -Werror=format-security -gdwarf-4 -fno-debug-types-section -fvar-tracking-assignments -g2 -Wp,-D_FORTIFY_SOURCE=2 -fstack-protector-strong --param=ssp-buffer-size=4 -fomit-frame-pointer -march=i686 -fasynchronous-unwind-tables -mtune=pentium4 -gdwarf-4 -fno-debug-types-section -fvar-tracking-assignments -g2  -pthread  -Wl,--as-needed -Wl,--no-copy-dt-needed-entries -Wl,-z,relro -Wl,-z,combreloc  -o test-pthread test-pthread.o ../src/libfontconfig.la 
libtool: link: i686-pld-linux-gcc -O2 -fwrapv -pipe -Wformat -Werror=format-security -gdwarf-4 -fno-debug-types-section -fvar-tracking-assignments -g2 -Wp,-D_FORTIFY_SOURCE=2 -fstack-protector-strong --param=ssp-buffer-size=4 -fomit-frame-pointer -march=i686 -fasynchronous-unwind-tables -mtune=pentium4 -gdwarf-4 -fno-debug-types-section -fvar-tracking-assignments -g2 -pthread -Wl,--as-needed -Wl,--no-copy-dt-needed-entries -Wl,-z -Wl,relro -Wl,-z -Wl,combreloc -o .libs/test-pthread test-pthread.o  ../src/.libs/libfontconfig.so /usr/lib/libfreetype.so /usr/lib/libbz2.so /usr/lib/libpng16.so -lm -lz -lharfbuzz /usr/lib/libexpat.so /usr/lib/libuuid.so -pthread
make[3]: Leaving directory '/tmp/B.wW5vgi/BUILD/fontconfig-2.13.0/test'
make[3]: Entering directory '/tmp/B.wW5vgi/BUILD/fontconfig-2.13.0/test'
/bin/sh ../libtool  --tag=CC   --mode=link i686-pld-linux-gcc  -O2 -fwrapv -pipe -Wformat -Werror=format-security -gdwarf-4 -fno-debug-types-section -fvar-tracking-assignments -g2 -Wp,-D_FORTIFY_SOURCE=2 -fstack-protector-strong --param=ssp-buffer-size=4 -fomit-frame-pointer -march=i686 -fasynchronous-unwind-tables -mtune=pentium4 -gdwarf-4 -fno-debug-types-section -fvar-tracking-assignments -g2  -pthread  -Wl,--as-needed -Wl,--no-copy-dt-needed-entries -Wl,-z,relro -Wl,-z,combreloc  -o test-migration test-migration.o ../src/libfontconfig.la 
libtool: link: i686-pld-linux-gcc -O2 -fwrapv -pipe -Wformat -Werror=format-security -gdwarf-4 -fno-debug-types-section -fvar-tracking-assignments -g2 -Wp,-D_FORTIFY_SOURCE=2 -fstack-protector-strong --param=ssp-buffer-size=4 -fomit-frame-pointer -march=i686 -fasynchronous-unwind-tables -mtune=pentium4 -gdwarf-4 -fno-debug-types-section -fvar-tracking-assignments -g2 -pthread -Wl,--as-needed -Wl,--no-copy-dt-needed-entries -Wl,-z -Wl,relro -Wl,-z -Wl,combreloc -o .libs/test-migration test-migration.o  ../src/.libs/libfontconfig.so /usr/lib/libfreetype.so /usr/lib/libbz2.so /usr/lib/libpng16.so -lm -lz -lharfbuzz /usr/lib/libexpat.so /usr/lib/libuuid.so -pthread
make[3]: Leaving directory '/tmp/B.wW5vgi/BUILD/fontconfig-2.13.0/test'
Making all in doc
/usr/bin/make  all-am
make[3]: Nothing to be done for 'all-am'.
+ /usr/bin/make -Otarget -j9 check
Making check in fontconfig
make[1]: Nothing to be done for 'check'.
Making check in fc-case
/usr/bin/make  check-am
make[2]: Nothing to be done for 'check-am'.
Making check in fc-lang
/usr/bin/make  check-am
make[2]: Nothing to be done for 'check-am'.
Making check in src
/usr/bin/make  check-am
make[2]: Nothing to be done for 'check-am'.
Making check in fc-cache
make[1]: Nothing to be done for 'check'.
Making check in fc-cat
make[1]: Nothing to be done for 'check'.
Making check in fc-conflist
make[1]: Nothing to be done for 'check'.
Making check in fc-list
make[1]: Nothing to be done for 'check'.
Making check in fc-match
make[1]: Nothing to be done for 'check'.
Making check in fc-pattern
make[1]: Nothing to be done for 'check'.
Making check in fc-query
make[1]: Nothing to be done for 'check'.
Making check in fc-scan
make[1]: Nothing to be done for 'check'.
Making check in fc-validate
make[1]: Nothing to be done for 'check'.
Making check in conf.d
/usr/bin/make  check-am
make[2]: Nothing to be done for 'check-am'.
Making check in its
make[1]: Nothing to be done for 'check'.
Making check in po
make[1]: Nothing to be done for 'check'.
Making check in po-conf
make[1]: Nothing to be done for 'check'.
Making check in test
/usr/bin/make  check-am
/usr/bin/make  test-pthread test-bz89617 test-bz131804 test-migration test-bz96676 run-test.sh
make[3]: 'test-pthread' is up to date.
make[3]: 'test-bz89617' is up to date.
make[3]: 'test-bz131804' is up to date.
make[3]: 'test-migration' is up to date.
make[3]: 'test-bz96676' is up to date.
make[3]: Nothing to be done for 'run-test.sh'.
/usr/bin/make  check-TESTS
make[4]: Entering directory '/tmp/B.wW5vgi/BUILD/fontconfig-2.13.0/test'
PASS: test-bz89617
make[4]: Leaving directory '/tmp/B.wW5vgi/BUILD/fontconfig-2.13.0/test'
make[4]: Entering directory '/tmp/B.wW5vgi/BUILD/fontconfig-2.13.0/test'
PASS: test-bz131804
make[4]: Leaving directory '/tmp/B.wW5vgi/BUILD/fontconfig-2.13.0/test'
make[4]: Entering directory '/tmp/B.wW5vgi/BUILD/fontconfig-2.13.0/test'
PASS: test-bz96676
make[4]: Leaving directory '/tmp/B.wW5vgi/BUILD/fontconfig-2.13.0/test'
make[4]: Entering directory '/tmp/B.wW5vgi/BUILD/fontconfig-2.13.0/test'
FAIL: run-test.sh
make[4]: Leaving directory '/tmp/B.wW5vgi/BUILD/fontconfig-2.13.0/test'
make[4]: Entering directory '/tmp/B.wW5vgi/BUILD/fontconfig-2.13.0/test'
============================================================================
Testsuite summary for fontconfig 2.13.0
============================================================================
# TOTAL: 4
# PASS:  3
# SKIP:  0
# XFAIL: 0
# FAIL:  1
# XPASS: 0
# ERROR: 0
============================================================================
See test/test-suite.log
Please report to https://bugs.freedesktop.org/enter_bug.cgi?product=fontconfig
============================================================================
make[4]: *** [Makefile:823: test-suite.log] Error 1
make[4]: Leaving directory '/tmp/B.wW5vgi/BUILD/fontconfig-2.13.0/test'
make[3]: *** [Makefile:931: check-TESTS] Error 2
make[2]: *** [Makefile:1019: check-am] Error 2
make[1]: *** [Makefile:1021: check] Error 2
make: *** [Makefile:599: check-recursive] Error 1
+ cat test/test-suite.log
============================================
   fontconfig 2.13.0: test/test-suite.log
============================================

# TOTAL: 4
# PASS:  3
# SKIP:  0
# XFAIL: 0
# FAIL:  1
# XPASS: 0
# ERROR: 0

.. contents:: :depth: 2

FAIL: run-test
==============

323adbe3-0883-4ee9-b121-ca8e2f1b61d6/tmp/B.wW5vgi/BUILD/fontconfig-2.13.0/test/cache.dir/251538a8-af45-4020-89a3-bfedb5045918-le32d4.cache-7
No permissions to creating new namespace, likely because the kernel does not allow non-privileged user namespaces. On e.g. debian this can be enabled with 'sysctl kernel.unprivileged_userns_clone=1'.
*** Test failed: Basic functionality with the bind-mounted cache dir
file property doesn't points to the new place: /tmp/fontconfig.lOn0fbwh/fonts/4x6.pcf

+ /bin/false
error: Bad exit status from /tmp/B.wW5vgi/BUILD/tmp/rpm-tmp.99430 (%build)


RPM build errors:
    Bad exit status from /tmp/B.wW5vgi/BUILD/tmp/rpm-tmp.99430 (%build)
ended at: Sun Mar 11 12:57:58 2018, done in 0:00:38.400840
error: No files produced.
+ chmod -R u+rwX /tmp/B.wW5vgi/BUILD
+ rm -rf /tmp/B.wW5vgi/tmp /tmp/B.wW5vgi/BUILD
+ rm -rf /tmp/B.wW5vgi
Begin-PLD-Builder-Info
Build-Time: user:36.83s sys:4.54s real:42.04s (faults io:1 non-io:2690409)

End-PLD-Builder-Info
[Back to list of logs] [View rpm -qa of builder]