FailedOk

th/SRPMS[OK]
th/x32[OK]
th/i686[OK]
th/x86_64[OK]

ac/SRPMS[OK]
ac/i386[OK]
ac/i586[OK]
ac/i686[OK]
ac/alpha[OK]
ac/amd64[OK]
ac/athlon[OK]
ac/ppc[OK]
ac/sparc[OK]
ac/sparc64[OK]

Advanced Search
main()
Powered by PLD Linux
(c) 2002-2019 PLD Team
$Revision: 1.37 $
Powered by six Cray XMT Supercomputers.
Your IP: 3.80.4.76

fss-parallel-tools 71951A4E-68CD-4676-875B-0FA117F3322A

Status:Failed
Source URL:ftp://buildlogs.pld-linux.org/th/i686/FAIL/fss-parallel-tools,71951A4E-68CD-4676-875B-0FA117F3322A.bz2
text/plain URL:View!
rpm -qa of builder:View!
Date:2019/08/09 12:46:32
Runtime:0:00:01.259890

Toc:

  • prep
  • Executing(%prep): /bin/sh -e /tmp/B.OuCMjg/BUILD/tmp/rpm-tmp.39487
  • build
  • Executing(%build): /bin/sh -e /tmp/B.OuCMjg/BUILD/tmp/rpm-tmp.39487
  • error 1
  • inodemap.c:135:32: error: format '%lu' expects argument of type 'long unsigned int', but argument 4 has type 'dev_t' {aka 'long long unsigned int'} [-Werror=format=]
  • error 2
  • fwg.c:142:38: error: format '%lu' expects argument of type 'long unsigned int', but argument 3 has type 'size_t' {aka 'unsigned int'} [-Werror=format=]
  • error 3
  • fwg.c:142:47: error: format '%lu' expects argument of type 'long unsigned int', but argument 4 has type 'size_t' {aka 'unsigned int'} [-Werror=format=]
  • error 4
  • fwg.c:155:30: error: format '%lu' expects argument of type 'long unsigned int', but argument 4 has type 'size_t' {aka 'unsigned int'} [-Werror=format=]
  • error 5
  • fwg.c:231:32: error: format '%ld' expects argument of type 'long int', but argument 2 has type 'size_t' {aka 'unsigned int'} [-Werror=format=]
  • error 6
  • fwg.c:255:56: error: format '%lu' expects argument of type 'long unsigned int', but argument 2 has type 'size_t' {aka 'unsigned int'} [-Werror=format=]
  • error 7
  • fwg.c:257:53: error: format '%lu' expects argument of type 'long unsigned int', but argument 2 has type 'size_t' {aka 'unsigned int'} [-Werror=format=]
  • error 8
  • fwg.c:263:34: error: format '%lu' expects argument of type 'long unsigned int', but argument 2 has type 'size_t' {aka 'unsigned int'} [-Werror=format=]
  • error 9
  • fwg.c:267:42: error: format '%lu' expects argument of type 'long unsigned int', but argument 4 has type 'size_t' {aka 'unsigned int'} [-Werror=format=]
  • error 10
  • fwg.c:357:45: error: format '%lu' expects argument of type 'long unsigned int', but argument 3 has type 'size_t' {aka 'unsigned int'} [-Werror=format=]
  • error 11
  • fwg.c:362:50: error: format '%lu' expects argument of type 'long unsigned int', but argument 3 has type 'size_t' {aka 'unsigned int'} [-Werror=format=]
  • error 12
  • fwg.c:366:45: error: format '%lu' expects argument of type 'long unsigned int', but argument 2 has type 'size_t' {aka 'unsigned int'} [-Werror=format=]
  • error 13
  • partar.c:275:36: error: format '%lu' expects argument of type 'long unsigned int', but argument 4 has type 'size_t' {aka 'unsigned int'} [-Werror=format=]
  • error 14
  • partar.c:282:61: error: format '%lu' expects argument of type 'long unsigned int', but argument 3 has type 'size_t' {aka 'unsigned int'} [-Werror=format=]
  • error 15
  • partar.c:282:76: error: format '%lu' expects argument of type 'long unsigned int', but argument 4 has type 'size_t' {aka 'unsigned int'} [-Werror=format=]
  • error 16
  • partar.c:386:35: error: format '%lu' expects argument of type 'long unsigned int', but argument 4 has type 'size_t' {aka 'unsigned int'} [-Werror=format=]
  • error 17
  • partar.c:388:28: error: format '%lu' expects argument of type 'long unsigned int', but argument 4 has type 'size_t' {aka 'unsigned int'} [-Werror=format=]
  • error 18
  • partar.c:395:32: error: format '%lu' expects argument of type 'long unsigned int', but argument 4 has type 'size_t' {aka 'unsigned int'} [-Werror=format=]
  • error 19
  • partar.c:397:32: error: format '%lu' expects argument of type 'long unsigned int', but argument 4 has type 'size_t' {aka 'unsigned int'} [-Werror=format=]
  • error 20
  • partar.c:698:30: error: format '%ld' expects argument of type 'long int', but argument 2 has type 'size_t' {aka 'unsigned int'} [-Werror=format=]
  • error 21
  • partar.c:698:41: error: format '%lu' expects argument of type 'long unsigned int', but argument 3 has type 'size_t' {aka 'unsigned int'} [-Werror=format=]
  • error 22
  • partar.c:975:67: error: format '%lu' expects argument of type 'long unsigned int', but argument 5 has type 'size_t' {aka 'unsigned int'} [-Werror=format=]
  • error 23
  • partar.c:975:85: error: format '%lu' expects argument of type 'long unsigned int', but argument 6 has type 'size_t' {aka 'unsigned int'} [-Werror=format=]
  • error 24
  • partar.c:982:34: error: format '%ld' expects argument of type 'long int', but argument 3 has type 'size_t' {aka 'unsigned int'} [-Werror=format=]
  • error 25
  • partar.c:1025:45: error: format '%lu' expects argument of type 'long unsigned int', but argument 2 has type 'size_t' {aka 'unsigned int'} [-Werror=format=]
  • error 26
  • partar.c:1025:55: error: format '%lo' expects argument of type 'long unsigned int', but argument 3 has type 'size_t' {aka 'unsigned int'} [-Werror=format=]
  • error 27
  • partar.c:1034:73: error: format '%ld' expects argument of type 'long int', but argument 3 has type 'size_t' {aka 'unsigned int'} [-Werror=format=]
  • error 28
  • partar.c:1034:88: error: format '%ld' expects argument of type 'long int', but argument 4 has type 'size_t' {aka 'unsigned int'} [-Werror=format=]
  • error 29
  • partar.c:1158:44: error: format '%lu' expects argument of type 'long unsigned int', but argument 2 has type 'size_t' {aka 'unsigned int'} [-Werror=format=]
  • error 30
  • partar.c:1188:40: error: format '%ld' expects argument of type 'long int', but argument 3 has type 'size_t' {aka 'unsigned int'} [-Werror=format=]
  • error 31
  • partar.c:1188:54: error: format '%ld' expects argument of type 'long int', but argument 4 has type 'size_t' {aka 'unsigned int'} [-Werror=format=]
  • error 32
  • partar.c:1188:71: error: format '%ld' expects argument of type 'long int', but argument 5 has type 'size_t' {aka 'unsigned int'} [-Werror=format=]
  • error 33
  • partar.c:1188:84: error: format '%lu' expects argument of type 'long unsigned int', but argument 6 has type 'size_t' {aka 'unsigned int'} [-Werror=format=]
  • error 34
  • partar.c:1417:56: error: conversion from '__dev_t' {aka 'long long unsigned int'} to 'ino_t' {aka 'long unsigned int'} may change value [-Werror=conversion]
  • error 35
  • partar.c:1421:55: error: conversion from '__dev_t' {aka 'long long unsigned int'} to 'ino_t' {aka 'long unsigned int'} may change value [-Werror=conversion]
  • error 36
  • error: Bad exit status from /tmp/B.OuCMjg/BUILD/tmp/rpm-tmp.39487 (%build)
  • error 37
  • RPM build errors:
  • error 38
  • error: No files produced.

Content:

request from: arekm
checking if we should skip the build
started at: Fri Aug  9 12:46:26 2019
killing old processes on a builder
sending signal 9 to pid -1
Killed
cleaning up /tmp
fetching https://srcbuilder.pld-linux.org/th//srpms/71951A4E-68CD-4676-875B-0FA117F3322A/fss-parallel-tools-1.49-1.src.rpm
fetched 58482 bytes, 159.0 K/s
installing srpm: fss-parallel-tools-1.49-1.src.rpm
+ install -d /tmp/B.OuCMjg/BUILD /tmp/B.OuCMjg/RPMS
+ LC_ALL=en_US.UTF-8
+ rpm -qp --changelog fss-parallel-tools-1.49-1.src.rpm
* Fri Aug 09 2019 PLD Linux Team <feedback@pld-linux.org>
- For complete changelog see: http://git.pld-linux.org/?p=packages/fss-parallel-tools.git;a=log;h=master
* Fri Aug 09 2019 Arkadiusz Miśkiewicz <arekm@maven.pl> 1754028
- missing patch * Thu May 30 2019 Arkadiusz Miśkiewicz <arekm@maven.pl> b7db7c0
- initial + rpm -Uhv --nodeps --define '_topdir /tmp/B.OuCMjg' --define '_specdir %{_topdir}' --define '_sourcedir %{_specdir}' --define '_rpmdir %{_topdir}/RPMS' --define '_builddir %{_topdir}/BUILD' fss-parallel-tools-1.49-1.src.rpm Preparing... ################################################## fss-parallel-tools ################################################## + rm -f fss-parallel-tools-1.49-1.src.rpm + install -m 700 -d /tmp/B.OuCMjg/BUILD/tmp + TMPDIR=/tmp/B.OuCMjg/BUILD/tmp + exec nice -n 0 rpmbuild -bp --short-circuit --nodeps --define '_topdir /tmp/B.OuCMjg' --define '_specdir %{_topdir}' --define '_sourcedir %{_specdir}' --define '_rpmdir %{_topdir}/RPMS' --define '_builddir %{_topdir}/BUILD' --target i686-pld-linux --define 'prep exit 0' /tmp/B.OuCMjg/fss-parallel-tools.spec Building target platforms: i686-pld-linux checking BuildConflict-ing packages no BuildConflicts found checking BR rpm: Building target platforms: i686-pld-linux no BR needed building RPM using: set -ex; : build-id: 71951A4E-68CD-4676-875B-0FA117F3322A; TMPDIR=/tmp/B.OuCMjg/BUILD/tmp exec nice -n 0 rpmbuild -bb --define '_smp_mflags -j9' --define '_make_opts -Otarget' --define '_pld_builder 1' --define '_topdir /tmp/B.OuCMjg' --define '_specdir %{_topdir}' --define '_sourcedir %{_specdir}' --define '_rpmdir %{_topdir}/RPMS' --define '_builddir %{_topdir}/BUILD' --target i686-pld-linux /tmp/B.OuCMjg/fss-parallel-tools.spec + : build-id: 71951A4E-68CD-4676-875B-0FA117F3322A + TMPDIR=/tmp/B.OuCMjg/BUILD/tmp + exec nice -n 0 rpmbuild -bb --define '_smp_mflags -j9' --define '_make_opts -Otarget' --define '_pld_builder 1' --define '_topdir /tmp/B.OuCMjg' --define '_specdir %{_topdir}' --define '_sourcedir %{_specdir}' --define '_rpmdir %{_topdir}/RPMS' --define '_builddir %{_topdir}/BUILD' --target i686-pld-linux /tmp/B.OuCMjg/fss-parallel-tools.spec Building target platforms: i686-pld-linux Executing(%prep): /bin/sh -e /tmp/B.OuCMjg/BUILD/tmp/rpm-tmp.39487 + umask 022 + cd /tmp/B.OuCMjg/BUILD + cd /tmp/B.OuCMjg/BUILD + rm -rf fss-parallel-tools-1.49 + /bin/mkdir -p fss-parallel-tools-1.49 + cd fss-parallel-tools-1.49 + /bin/id -u + '[' 1001 '=' 0 ']' + /bin/id -u + '[' 1001 '=' 0 ']' + /bin/chmod -Rf a+rX,u+w,g-w,o-w . + rpm2cpio /tmp/B.OuCMjg/fss-parallel-tools-1.49-1.el6.src.rpm + cpio -dim 95 blocks + tar xf fss-parallel-tools-1.49.tar.gz + cd fss-parallel-tools + echo 'Patch #0 (build.patch):' Patch #0 (build.patch): + '[' -f /tmp/B.OuCMjg/build.patch ']' + /bin/cat /tmp/B.OuCMjg/build.patch + /usr/bin/patch -s -p1 + exit 0 Executing(%build): /bin/sh -e /tmp/B.OuCMjg/BUILD/tmp/rpm-tmp.39487 TMP=/home/users/builder/tmp HOME=/home/users/builder PATH=/home/users/builder/GNUstep/Tools:/usr/local/bin:/usr/bin:/bin:/home/users/builder/bin TMPDIR=/tmp/B.OuCMjg/BUILD/tmp + umask 022 + cd /tmp/B.OuCMjg/BUILD + cd fss-parallel-tools-1.49 + /usr/bin/make -Otarget -j9 -C fss-parallel-tools 'CC=i686-pld-linux-gcc' 'GCOV_FLAGS=-O2 -fwrapv -pipe -Wformat -Werror=format-security -gdwarf-4 -fno-debug-types-section -fvar-tracking-assignments -g2 -Wp,-D_FORTIFY_SOURCE=2 -fstack-protector-strong --param=ssp-buffer-size=4 -Werror=trampolines -fomit-frame-pointer -march=i686 -fasynchronous-unwind-tables -mtune=pentium4 -gdwarf-4 -fno-debug-types-section -fvar-tracking-assignments -g2 ' 'LDFLAGS=-Wl,--as-needed -Wl,--no-copy-dt-needed-entries -Wl,-z,relro -Wl,-z,combreloc ' make: Entering directory '/tmp/B.OuCMjg/BUILD/fss-parallel-tools-1.49/fss-parallel-tools' echo \#include \"version.h\" > gitrev_new.c echo const char gitrev[] = \"$(git diff-index --quiet HEAD -- || echo "++")$(git rev-parse HEAD)\"\; >> gitrev_new.c /bin/sh: git: inaccessible or not found /bin/sh: git: inaccessible or not found if ! diff gitrev_new.c gitrev.c >> /dev/null ; then mv gitrev_new.c gitrev.c; fi make: Leaving directory '/tmp/B.OuCMjg/BUILD/fss-parallel-tools-1.49/fss-parallel-tools' make: Entering directory '/tmp/B.OuCMjg/BUILD/fss-parallel-tools-1.49/fss-parallel-tools' i686-pld-linux-gcc -Wall -Wextra -Wshadow -Wconversion -Wpointer-arith -Wmissing-prototypes -Wwrite-strings -Wswitch-enum -Werror -g -O1 -pthread -std=gnu99 -O2 -fwrapv -pipe -Wformat -Werror=format-security -gdwarf-4 -fno-debug-types-section -fvar-tracking-assignments -g2 -Wp,-D_FORTIFY_SOURCE=2 -fstack-protector-strong --param=ssp-buffer-size=4 -Werror=trampolines -fomit-frame-pointer -march=i686 -fasynchronous-unwind-tables -mtune=pentium4 -gdwarf-4 -fno-debug-types-section -fvar-tracking-assignments -g2 -DVERSION=\"1.49\" -c -o fdleak.o fdleak.c make: Leaving directory '/tmp/B.OuCMjg/BUILD/fss-parallel-tools-1.49/fss-parallel-tools' make: Entering directory '/tmp/B.OuCMjg/BUILD/fss-parallel-tools-1.49/fss-parallel-tools' i686-pld-linux-gcc -Wall -Wextra -Wshadow -Wconversion -Wpointer-arith -Wmissing-prototypes -Wwrite-strings -Wswitch-enum -Werror -g -O1 -pthread -std=gnu99 -O2 -fwrapv -pipe -Wformat -Werror=format-security -gdwarf-4 -fno-debug-types-section -fvar-tracking-assignments -g2 -Wp,-D_FORTIFY_SOURCE=2 -fstack-protector-strong --param=ssp-buffer-size=4 -Werror=trampolines -fomit-frame-pointer -march=i686 -fasynchronous-unwind-tables -mtune=pentium4 -gdwarf-4 -fno-debug-types-section -fvar-tracking-assignments -g2 -DVERSION=\"1.49\" -c -o vector-of-strings.o vector-of-strings.c make: Leaving directory '/tmp/B.OuCMjg/BUILD/fss-parallel-tools-1.49/fss-parallel-tools' make: Entering directory '/tmp/B.OuCMjg/BUILD/fss-parallel-tools-1.49/fss-parallel-tools' i686-pld-linux-gcc -Wall -Wextra -Wshadow -Wconversion -Wpointer-arith -Wmissing-prototypes -Wwrite-strings -Wswitch-enum -Werror -g -O1 -pthread -std=gnu99 -O2 -fwrapv -pipe -Wformat -Werror=format-security -gdwarf-4 -fno-debug-types-section -fvar-tracking-assignments -g2 -Wp,-D_FORTIFY_SOURCE=2 -fstack-protector-strong --param=ssp-buffer-size=4 -Werror=trampolines -fomit-frame-pointer -march=i686 -fasynchronous-unwind-tables -mtune=pentium4 -gdwarf-4 -fno-debug-types-section -fvar-tracking-assignments -g2 -DVERSION=\"1.49\" -c -o gitrev.o gitrev.c make: Leaving directory '/tmp/B.OuCMjg/BUILD/fss-parallel-tools-1.49/fss-parallel-tools' make: Entering directory '/tmp/B.OuCMjg/BUILD/fss-parallel-tools-1.49/fss-parallel-tools' i686-pld-linux-gcc -Wall -Wextra -Wshadow -Wconversion -Wpointer-arith -Wmissing-prototypes -Wwrite-strings -Wswitch-enum -Werror -g -O1 -pthread -std=gnu99 -O2 -fwrapv -pipe -Wformat -Werror=format-security -gdwarf-4 -fno-debug-types-section -fvar-tracking-assignments -g2 -Wp,-D_FORTIFY_SOURCE=2 -fstack-protector-strong --param=ssp-buffer-size=4 -Werror=trampolines -fomit-frame-pointer -march=i686 -fasynchronous-unwind-tables -mtune=pentium4 -gdwarf-4 -fno-debug-types-section -fvar-tracking-assignments -g2 -DVERSION=\"1.49\" -c -o vec.o vec.c make: Leaving directory '/tmp/B.OuCMjg/BUILD/fss-parallel-tools-1.49/fss-parallel-tools' make: Entering directory '/tmp/B.OuCMjg/BUILD/fss-parallel-tools-1.49/fss-parallel-tools' i686-pld-linux-gcc -Wall -Wextra -Wshadow -Wconversion -Wpointer-arith -Wmissing-prototypes -Wwrite-strings -Wswitch-enum -Werror -g -O1 -pthread -std=gnu99 -O2 -fwrapv -pipe -Wformat -Werror=format-security -gdwarf-4 -fno-debug-types-section -fvar-tracking-assignments -g2 -Wp,-D_FORTIFY_SOURCE=2 -fstack-protector-strong --param=ssp-buffer-size=4 -Werror=trampolines -fomit-frame-pointer -march=i686 -fasynchronous-unwind-tables -mtune=pentium4 -gdwarf-4 -fno-debug-types-section -fvar-tracking-assignments -g2 -DVERSION=\"1.49\" -c -o putils.o putils.c make: Leaving directory '/tmp/B.OuCMjg/BUILD/fss-parallel-tools-1.49/fss-parallel-tools' make: Entering directory '/tmp/B.OuCMjg/BUILD/fss-parallel-tools-1.49/fss-parallel-tools' i686-pld-linux-gcc -Wall -Wextra -Wshadow -Wconversion -Wpointer-arith -Wmissing-prototypes -Wwrite-strings -Wswitch-enum -Werror -g -O1 -pthread -std=gnu99 -O2 -fwrapv -pipe -Wformat -Werror=format-security -gdwarf-4 -fno-debug-types-section -fvar-tracking-assignments -g2 -Wp,-D_FORTIFY_SOURCE=2 -fstack-protector-strong --param=ssp-buffer-size=4 -Werror=trampolines -fomit-frame-pointer -march=i686 -fasynchronous-unwind-tables -mtune=pentium4 -gdwarf-4 -fno-debug-types-section -fvar-tracking-assignments -g2 -DVERSION=\"1.49\" -c -o sched.o sched.c make: Leaving directory '/tmp/B.OuCMjg/BUILD/fss-parallel-tools-1.49/fss-parallel-tools' make: Entering directory '/tmp/B.OuCMjg/BUILD/fss-parallel-tools-1.49/fss-parallel-tools' i686-pld-linux-gcc -Wall -Wextra -Wshadow -Wconversion -Wpointer-arith -Wmissing-prototypes -Wwrite-strings -Wswitch-enum -Werror -g -O1 -pthread -std=gnu99 -O2 -fwrapv -pipe -Wformat -Werror=format-security -gdwarf-4 -fno-debug-types-section -fvar-tracking-assignments -g2 -Wp,-D_FORTIFY_SOURCE=2 -fstack-protector-strong --param=ssp-buffer-size=4 -Werror=trampolines -fomit-frame-pointer -march=i686 -fasynchronous-unwind-tables -mtune=pentium4 -gdwarf-4 -fno-debug-types-section -fvar-tracking-assignments -g2 -DVERSION=\"1.49\" -c -o stringset.o stringset.c make: Leaving directory '/tmp/B.OuCMjg/BUILD/fss-parallel-tools-1.49/fss-parallel-tools' make: Entering directory '/tmp/B.OuCMjg/BUILD/fss-parallel-tools-1.49/fss-parallel-tools' i686-pld-linux-gcc -Wall -Wextra -Wshadow -Wconversion -Wpointer-arith -Wmissing-prototypes -Wwrite-strings -Wswitch-enum -Werror -g -O1 -pthread -std=gnu99 -O2 -fwrapv -pipe -Wformat -Werror=format-security -gdwarf-4 -fno-debug-types-section -fvar-tracking-assignments -g2 -Wp,-D_FORTIFY_SOURCE=2 -fstack-protector-strong --param=ssp-buffer-size=4 -Werror=trampolines -fomit-frame-pointer -march=i686 -fasynchronous-unwind-tables -mtune=pentium4 -gdwarf-4 -fno-debug-types-section -fvar-tracking-assignments -g2 -DVERSION=\"1.49\" -c -o inodemap.o inodemap.c inodemap.c: In function 'inodemap_print': inodemap.c:135:32: error: format '%lu' expects argument of type 'long unsigned int', but argument 4 has type 'dev_t' {aka 'long long unsigned int'} [-Werror=format=] fprintf(f, "%zd: %lu,%lu -> %p\n", i, ~~^ %llu im->entries[i].dev, im->entries[i].inode, ~~~~~~~~~~~~~~~~~~ cc1: all warnings being treated as errors make: *** [<builtin>: inodemap.o] Error 1 make: Leaving directory '/tmp/B.OuCMjg/BUILD/fss-parallel-tools-1.49/fss-parallel-tools' make: *** Waiting for unfinished jobs.... make: Entering directory '/tmp/B.OuCMjg/BUILD/fss-parallel-tools-1.49/fss-parallel-tools' i686-pld-linux-gcc -Wall -Wextra -Wshadow -Wconversion -Wpointer-arith -Wmissing-prototypes -Wwrite-strings -Wswitch-enum -Werror -g -O1 -pthread -std=gnu99 -O2 -fwrapv -pipe -Wformat -Werror=format-security -gdwarf-4 -fno-debug-types-section -fvar-tracking-assignments -g2 -Wp,-D_FORTIFY_SOURCE=2 -fstack-protector-strong --param=ssp-buffer-size=4 -Werror=trampolines -fomit-frame-pointer -march=i686 -fasynchronous-unwind-tables -mtune=pentium4 -gdwarf-4 -fno-debug-types-section -fvar-tracking-assignments -g2 -DVERSION=\"1.49\" -c -o todo.o todo.c make: Leaving directory '/tmp/B.OuCMjg/BUILD/fss-parallel-tools-1.49/fss-parallel-tools' make: Entering directory '/tmp/B.OuCMjg/BUILD/fss-parallel-tools-1.49/fss-parallel-tools' i686-pld-linux-gcc -Wall -Wextra -Wshadow -Wconversion -Wpointer-arith -Wmissing-prototypes -Wwrite-strings -Wswitch-enum -Werror -g -O1 -pthread -std=gnu99 -O2 -fwrapv -pipe -Wformat -Werror=format-security -gdwarf-4 -fno-debug-types-section -fvar-tracking-assignments -g2 -Wp,-D_FORTIFY_SOURCE=2 -fstack-protector-strong --param=ssp-buffer-size=4 -Werror=trampolines -fomit-frame-pointer -march=i686 -fasynchronous-unwind-tables -mtune=pentium4 -gdwarf-4 -fno-debug-types-section -fvar-tracking-assignments -g2 -DVERSION=\"1.49\" -c -o fwg.o fwg.c fwg.c: In function 'nodetable_insert': fwg.c:142:38: error: format '%lu' expects argument of type 'long unsigned int', but argument 3 has type 'size_t' {aka 'unsigned int'} [-Werror=format=] if (0) printf("Inserting %s, n=%lu size=%lu\n", node->name, nodetable->n, nodetable->size); ~~^ ~~~~~~~~~~~~ %u fwg.c:142:47: error: format '%lu' expects argument of type 'long unsigned int', but argument 4 has type 'size_t' {aka 'unsigned int'} [-Werror=format=] if (0) printf("Inserting %s, n=%lu size=%lu\n", node->name, nodetable->n, nodetable->size); ~~^ ~~~~~~~~~~~~~~~ %u fwg.c:155:30: error: format '%lu' expects argument of type 'long unsigned int', but argument 4 has type 'size_t' {aka 'unsigned int'} [-Werror=format=] if (0) printf("%s:%d n=%lu\n", __FILE__, __LINE__, nodetable->n); ~~^ ~~~~~~~~~~~~ %u fwg.c: In function 'fwg_destroy': fwg.c:231:32: error: format '%ld' expects argument of type 'long int', but argument 2 has type 'size_t' {aka 'unsigned int'} [-Werror=format=] printf("Nodetable->n=%ld\n", fwg->nodes->n); ~~^ ~~~~~~~~~~~~~ %d fwg.c: In function 'add_dependency': fwg.c:255:56: error: format '%lu' expects argument of type 'long unsigned int', but argument 2 has type 'size_t' {aka 'unsigned int'} [-Werror=format=] if (0) printf(" Found prev node (ready_count=%lu)\n", node->ready_count); ~~^ ~~~~~~~~~~~~~~~~~ %u fwg.c:257:53: error: format '%lu' expects argument of type 'long unsigned int', but argument 2 has type 'size_t' {aka 'unsigned int'} [-Werror=format=] if (0) printf(" No prev node (ready_count=%lu)\n", node->ready_count); ~~^ ~~~~~~~~~~~~~~~~~ %u fwg.c: In function 'note_maybe_node_is_ready': fwg.c:263:34: error: format '%lu' expects argument of type 'long unsigned int', but argument 2 has type 'size_t' {aka 'unsigned int'} [-Werror=format=] if (0) printf("ready_count=%lu\n", node->ready_count); ~~^ ~~~~~~~~~~~~~~~~~ %u fwg.c:267:42: error: format '%lu' expects argument of type 'long unsigned int', but argument 4 has type 'size_t' {aka 'unsigned int'} [-Werror=format=] if (0) printf("%s:%d n ready = %lu\n", __FILE__, __LINE__, fwg->ready_nodes->n); ~~^ ~~~~~~~~~~~~~~~~~~~ %u fwg.c: In function 'fwg_finish_node': fwg.c:357:45: error: format '%lu' expects argument of type 'long unsigned int', but argument 3 has type 'size_t' {aka 'unsigned int'} [-Werror=format=] if (0) printf("Finishing %p which has %lu successors\n", handle, handle->successors->n); ~~^ ~~~~~~~~~~~~~~~~~~~~~ %u fwg.c:362:50: error: format '%lu' expects argument of type 'long unsigned int', but argument 3 has type 'size_t' {aka 'unsigned int'} [-Werror=format=] if (0) printf(" Maybe wake up %p (pred=%lu)\n", succ, succ->ready_count); ~~^ ~~~~~~~~~~~~~~~~~ %u fwg.c:366:45: error: format '%lu' expects argument of type 'long unsigned int', but argument 2 has type 'size_t' {aka 'unsigned int'} [-Werror=format=] if (0) printf(" succ->ready_count=%lu\n", succ->ready_count); ~~^ ~~~~~~~~~~~~~~~~~ %u cc1: all warnings being treated as errors make: *** [<builtin>: fwg.o] Error 1 make: Leaving directory '/tmp/B.OuCMjg/BUILD/fss-parallel-tools-1.49/fss-parallel-tools' make: Entering directory '/tmp/B.OuCMjg/BUILD/fss-parallel-tools-1.49/fss-parallel-tools' i686-pld-linux-gcc -Wall -Wextra -Wshadow -Wconversion -Wpointer-arith -Wmissing-prototypes -Wwrite-strings -Wswitch-enum -Werror -g -O1 -pthread -std=gnu99 -O2 -fwrapv -pipe -Wformat -Werror=format-security -gdwarf-4 -fno-debug-types-section -fvar-tracking-assignments -g2 -Wp,-D_FORTIFY_SOURCE=2 -fstack-protector-strong --param=ssp-buffer-size=4 -Werror=trampolines -fomit-frame-pointer -march=i686 -fasynchronous-unwind-tables -mtune=pentium4 -gdwarf-4 -fno-debug-types-section -fvar-tracking-assignments -g2 -DVERSION=\"1.49\" -c -o parrm.o parrm.c make: Leaving directory '/tmp/B.OuCMjg/BUILD/fss-parallel-tools-1.49/fss-parallel-tools' make: Entering directory '/tmp/B.OuCMjg/BUILD/fss-parallel-tools-1.49/fss-parallel-tools' i686-pld-linux-gcc -Wall -Wextra -Wshadow -Wconversion -Wpointer-arith -Wmissing-prototypes -Wwrite-strings -Wswitch-enum -Werror -g -O1 -pthread -std=gnu99 -O2 -fwrapv -pipe -Wformat -Werror=format-security -gdwarf-4 -fno-debug-types-section -fvar-tracking-assignments -g2 -Wp,-D_FORTIFY_SOURCE=2 -fstack-protector-strong --param=ssp-buffer-size=4 -Werror=trampolines -fomit-frame-pointer -march=i686 -fasynchronous-unwind-tables -mtune=pentium4 -gdwarf-4 -fno-debug-types-section -fvar-tracking-assignments -g2 -DVERSION=\"1.49\" -c -o parcp.o parcp.c make: Leaving directory '/tmp/B.OuCMjg/BUILD/fss-parallel-tools-1.49/fss-parallel-tools' make: Entering directory '/tmp/B.OuCMjg/BUILD/fss-parallel-tools-1.49/fss-parallel-tools' i686-pld-linux-gcc -Wall -Wextra -Wshadow -Wconversion -Wpointer-arith -Wmissing-prototypes -Wwrite-strings -Wswitch-enum -Werror -g -O1 -pthread -std=gnu99 -O2 -fwrapv -pipe -Wformat -Werror=format-security -gdwarf-4 -fno-debug-types-section -fvar-tracking-assignments -g2 -Wp,-D_FORTIFY_SOURCE=2 -fstack-protector-strong --param=ssp-buffer-size=4 -Werror=trampolines -fomit-frame-pointer -march=i686 -fasynchronous-unwind-tables -mtune=pentium4 -gdwarf-4 -fno-debug-types-section -fvar-tracking-assignments -g2 -DVERSION=\"1.49\" -c -o partar.o partar.c partar.c: In function 'process_fwobject': partar.c:275:36: error: format '%lu' expects argument of type 'long unsigned int', but argument 4 has type 'size_t' {aka 'unsigned int'} [-Werror=format=] if (0) printf("%s:%d %lu: parallel (small) regular file \"%s\"\n", __FILE__, __LINE__, threadn, b->fullname); ~~^ ~~~~~~~ %u partar.c:282:61: error: format '%lu' expects argument of type 'long unsigned int', but argument 3 has type 'size_t' {aka 'unsigned int'} [-Werror=format=] if (0) fprintf(stderr, "Immediate read of %lu bytes into %lu bytes\n", b->size_to_read, b->size); ~~^ ~~~~~~~~~~~~~~~ %u partar.c:282:76: error: format '%lu' expects argument of type 'long unsigned int', but argument 4 has type 'size_t' {aka 'unsigned int'} [-Werror=format=] if (0) fprintf(stderr, "Immediate read of %lu bytes into %lu bytes\n", b->size_to_read, b->size); ~~^ ~~~~~~~ %u partar.c:386:35: error: format '%lu' expects argument of type 'long unsigned int', but argument 4 has type 'size_t' {aka 'unsigned int'} [-Werror=format=] if (0) printf("%s:%d thread %lu finishing an fwobject\n", __FILE__, __LINE__, threadn); ~~^ ~~~~~~~ %u partar.c:388:28: error: format '%lu' expects argument of type 'long unsigned int', but argument 4 has type 'size_t' {aka 'unsigned int'} [-Werror=format=] if (0) printf("%s%d: %lu: next\n", __FILE__, __LINE__, threadn); ~~^ ~~~~~~~ %u partar.c: In function 'process_fwobjects': partar.c:395:32: error: format '%lu' expects argument of type 'long unsigned int', but argument 4 has type 'size_t' {aka 'unsigned int'} [-Werror=format=] if (0) printf("%s:%d %lu getting ready node\n", __FILE__, __LINE__, threadn); ~~^ ~~~~~~~ %u partar.c:397:32: error: format '%lu' expects argument of type 'long unsigned int', but argument 4 has type 'size_t' {aka 'unsigned int'} [-Werror=format=] if (0) printf("%s:%d %lu Got %d b=%p\n", __FILE__, __LINE__, threadn, r, b); ~~^ ~~~~~~~ %u partar.c: In function 'fixup_runner': partar.c:698:30: error: format '%ld' expects argument of type 'long int', but argument 2 has type 'size_t' {aka 'unsigned int'} [-Werror=format=] printf("sc=%ld (count=%lu)\n", sc, count); ~~^ ~~ %d partar.c:698:41: error: format '%lu' expects argument of type 'long unsigned int', but argument 3 has type 'size_t' {aka 'unsigned int'} [-Werror=format=] printf("sc=%ld (count=%lu)\n", sc, count); ~~^ ~~~~~ %u partar.c: In function 'extracttar': partar.c:975:67: error: format '%lu' expects argument of type 'long unsigned int', but argument 5 has type 'size_t' {aka 'unsigned int'} [-Werror=format=] fprintf(stderr, "hfp=%d flen=%u hname_limit=%lu strlen(hname)=%lu %s\n", has_name_from_prev, flen, hname_limit, strlen(hname), hname); ~~^ ~~~~~~~~~~~ %u partar.c:975:85: error: format '%lu' expects argument of type 'long unsigned int', but argument 6 has type 'size_t' {aka 'unsigned int'} [-Werror=format=] fprintf(stderr, "hfp=%d flen=%u hname_limit=%lu strlen(hname)=%lu %s\n", has_name_from_prev, flen, hname_limit, strlen(hname), hname); ~~^ ~~~~~~~~~~~~~ %u partar.c:982:34: error: format '%ld' expects argument of type 'long int', but argument 3 has type 'size_t' {aka 'unsigned int'} [-Werror=format=] fprintf(stderr, "l=%ld %s\n", strlen(fullname), fullname); ~~^ ~~~~~~~~~~~~~~~~ %d partar.c:1025:45: error: format '%lu' expects argument of type 'long unsigned int', but argument 2 has type 'size_t' {aka 'unsigned int'} [-Werror=format=] printf("regular file size=%lu mode=0%lo \"%s\"\n", ~~^ %u size_to_write, mode, fullname); ~~~~~~~~~~~~~ partar.c:1025:55: error: format '%lo' expects argument of type 'long unsigned int', but argument 3 has type 'size_t' {aka 'unsigned int'} [-Werror=format=] printf("regular file size=%lu mode=0%lo \"%s\"\n", ~~^ %o size_to_write, mode, fullname); ~~~~ partar.c:1034:73: error: format '%ld' expects argument of type 'long int', but argument 3 has type 'size_t' {aka 'unsigned int'} [-Werror=format=] if (s != read_now) fprintf(stderr, "Tried to read %ld bytes, got %ld\n", read_now, s); ~~^ ~~~~~~~~ %d partar.c:1034:88: error: format '%ld' expects argument of type 'long int', but argument 4 has type 'size_t' {aka 'unsigned int'} [-Werror=format=] if (s != read_now) fprintf(stderr, "Tried to read %ld bytes, got %ld\n", read_now, s); ~~^ ~ %d partar.c:1158:44: error: format '%lu' expects argument of type 'long unsigned int', but argument 2 has type 'size_t' {aka 'unsigned int'} [-Werror=format=] printf("Fixing up, there are %lu dirs\n", vec_size(fixup_dirs)); ~~^ ~~~~~~~~~~~~~~~~~~~~ %u partar.c:1188:40: error: format '%ld' expects argument of type 'long int', but argument 3 has type 'size_t' {aka 'unsigned int'} [-Werror=format=] if (0) fprintf(stderr, "regcount=%ld linkcount=%ld symlinkcount=%ld dircount=%lu\n", regcount, linkcount, symlinkcount, dircount); ~~^ ~~~~~~~~ %d partar.c:1188:54: error: format '%ld' expects argument of type 'long int', but argument 4 has type 'size_t' {aka 'unsigned int'} [-Werror=format=] if (0) fprintf(stderr, "regcount=%ld linkcount=%ld symlinkcount=%ld dircount=%lu\n", regcount, linkcount, symlinkcount, dircount); ~~^ ~~~~~~~~~ %d partar.c:1188:71: error: format '%ld' expects argument of type 'long int', but argument 5 has type 'size_t' {aka 'unsigned int'} [-Werror=format=] if (0) fprintf(stderr, "regcount=%ld linkcount=%ld symlinkcount=%ld dircount=%lu\n", regcount, linkcount, symlinkcount, dircount); ~~^ ~~~~~~~~~~~~ %d partar.c:1188:84: error: format '%lu' expects argument of type 'long unsigned int', but argument 6 has type 'size_t' {aka 'unsigned int'} [-Werror=format=] if (0) fprintf(stderr, "regcount=%ld linkcount=%ld symlinkcount=%ld dircount=%lu\n", regcount, linkcount, symlinkcount, dircount); ~~^ ~~~~~~~~ %u partar.c: In function 'maybe_emit_link_locked': partar.c:1417:56: error: conversion from '__dev_t' {aka 'long long unsigned int'} to 'ino_t' {aka 'long unsigned int'} may change value [-Werror=conversion] if (inodemap_lookup(inset, statbuf->st_ino, statbuf->st_dev, &value)) { ~~~~~~~^~~~~~~~ partar.c:1421:55: error: conversion from '__dev_t' {aka 'long long unsigned int'} to 'ino_t' {aka 'long unsigned int'} may change value [-Werror=conversion] inodemap_insert(inset,statbuf->st_ino, statbuf->st_dev, strdup(fname)); ~~~~~~~^~~~~~~~ cc1: all warnings being treated as errors make: *** [<builtin>: partar.o] Error 1 make: Leaving directory '/tmp/B.OuCMjg/BUILD/fss-parallel-tools-1.49/fss-parallel-tools' error: Bad exit status from /tmp/B.OuCMjg/BUILD/tmp/rpm-tmp.39487 (%build) RPM build errors: Bad exit status from /tmp/B.OuCMjg/BUILD/tmp/rpm-tmp.39487 (%build) ended at: Fri Aug 9 12:46:32 2019, done in 0:00:01.259890 error: No files produced. + chmod -R u+rwX /tmp/B.OuCMjg/BUILD + rm -rf /tmp/B.OuCMjg/tmp /tmp/B.OuCMjg/BUILD + rm -rf /tmp/B.OuCMjg Begin-PLD-Builder-Info Build-Time: user:5.14s sys:0.30s real:5.76s (faults io:0 non-io:150678) End-PLD-Builder-Info
[Back to list of logs] [View rpm -qa of builder]