FailedOk

th/SRPMS[OK]
th/x32[OK]
th/i686[OK]
th/x86_64[OK]

ac/SRPMS[OK]
ac/i386[OK]
ac/i586[OK]
ac/i686[OK]
ac/alpha[OK]
ac/amd64[OK]
ac/athlon[OK]
ac/ppc[OK]
ac/sparc[OK]
ac/sparc64[OK]

Advanced Search
main()
Powered by PLD Linux
(c) 2002-2018 PLD Team
$Revision: 1.37 $
Powered by Star Treck.
Your IP: 34.228.30.69

gcc 67F331B4-FDC0-4828-8107-EEBEC425D7C2

Status:Failed
Source URL:ftp://buildlogs.pld-linux.org/th/i686/FAIL/gcc,67F331B4-FDC0-4828-8107-EEBEC425D7C2.bz2
text/plain URL:View!
full text:View!
rpm -qa of builder:View!
Date:2018/10/10 17:08:18
Runtime:0:00:52.149817

Toc:

  • error 1
  • error: No files produced.
  • error 2
  • configure: error: in `/tmp/B.oR3Dq_/BUILD/gcc-8.2.0/builddir/gcc':
  • error 3
  • configure: error: C++ preprocessor "i686-pld-linux-g++ -std=gnu++98 -E" fails sanity check
  • error 4
  • make[3]: *** [Makefile:4317: configure-stage1-gcc] Error 1
  • error 5
  • make[2]: *** [Makefile:25845: stage1-bubble] Error 2
  • error 6
  • make[1]: *** [Makefile:26736: profiledbootstrap] Error 2

Content:

checking for putc_unlocked... yes
checking whether abort is declared... yes
checking whether asprintf is declared... yes
checking whether basename is declared... yes
checking whether errno is declared... no
checking whether getopt is declared... yes
checking whether vasprintf is declared... yes
checking whether clearerr_unlocked is declared... yes
checking whether feof_unlocked is declared... yes
checking whether ferror_unlocked is declared... yes
checking whether fflush_unlocked is declared... yes
checking whether fgetc_unlocked is declared... yes
checking whether fgets_unlocked is declared... yes
checking whether fileno_unlocked is declared... yes
checking whether fprintf_unlocked is declared... no
checking whether fputc_unlocked is declared... yes
checking whether fputs_unlocked is declared... yes
checking whether fread_unlocked is declared... yes
checking whether fwrite_unlocked is declared... yes
checking whether getchar_unlocked is declared... yes
checking whether getc_unlocked is declared... yes
checking whether putchar_unlocked is declared... yes
checking whether putc_unlocked is declared... yes
checking for working alloca.h... yes
checking for alloca... yes
checking for ANSI C header files... (cached) yes
checking for nl_langinfo and CODESET... yes
checking whether NLS is requested... yes
checking for catalogs to be installed...  be ca da de el eo es fi fr id ja nl pt_BR ru sr sv tr uk vi zh_CN zh_TW be ca da de el eo es fi fr id ja nl pt_BR ru sr sv tr uk vi zh_CN zh_TW
checking for uchar... 
checking for ld used by GCC... ld
checking if the linker (ld) is GNU ld... yes
checking for shared library run path origin... done
checking for iconv... yes
checking for iconv declaration... install-shextern size_t iconv (iconv_t cd, char * *inbuf, size_t *inbytesleft, char * *outbuf, size_t *outbytesleft);
configure: updating cache ./config.cache
configure: creating ./config.status
config.status: creating Makefile
config.status: creating config.h
config.status: executing depdir commands
mkdir -p -- .deps
make[3]: Leaving directory '/tmp/B.oR3Dq_/BUILD/gcc-8.2.0/builddir'
make[4]: Entering directory '/tmp/B.oR3Dq_/BUILD/gcc-8.2.0/builddir/libcpp'
echo "#define LOCALEDIR \"/usr/share/locale\"" > localedir.new
../../libcpp/../move-if-change localedir.new localedir.h
echo timestamp > localedir.hs
make[4]: Leaving directory '/tmp/B.oR3Dq_/BUILD/gcc-8.2.0/builddir/libcpp'
make[4]: Entering directory '/tmp/B.oR3Dq_/BUILD/gcc-8.2.0/builddir/libcpp'
i686-pld-linux-g++ -std=gnu++98  -I../../libcpp -I. -I../../libcpp/../include -I../../libcpp/include  -O2 -pipe -gdwarf-4 -fno-debug-types-section -fvar-tracking-assignments -g2 -Wp,-D_FORTIFY_SOURCE=2 -fstack-protector-strong --param=ssp-buffer-size=4 -fomit-frame-pointer -march=i686 -fasynchronous-unwind-tables -mtune=pentium4 -gdwarf-4 -fno-debug-types-section -fvar-tracking-assignments -g2  -O1 -g0 -W -Wall -Wno-narrowing -Wwrite-strings -Wmissing-format-attribute -pedantic -Wno-long-long  -fno-exceptions -fno-rtti -I../../libcpp -I. -I../../libcpp/../include -I../../libcpp/include   -c -o errors.o -MT errors.o -MMD -MP -MF .deps/errors.Tpo ../../libcpp/errors.c
make[4]: Leaving directory '/tmp/B.oR3Dq_/BUILD/gcc-8.2.0/builddir/libcpp'
make[4]: Entering directory '/tmp/B.oR3Dq_/BUILD/gcc-8.2.0/builddir/libcpp'
i686-pld-linux-g++ -std=gnu++98  -I../../libcpp -I. -I../../libcpp/../include -I../../libcpp/include  -O2 -pipe -gdwarf-4 -fno-debug-types-section -fvar-tracking-assignments -g2 -Wp,-D_FORTIFY_SOURCE=2 -fstack-protector-strong --param=ssp-buffer-size=4 -fomit-frame-pointer -march=i686 -fasynchronous-unwind-tables -mtune=pentium4 -gdwarf-4 -fno-debug-types-section -fvar-tracking-assignments -g2  -O1 -g0 -W -Wall -Wno-narrowing -Wwrite-strings -Wmissing-format-attribute -pedantic -Wno-long-long  -fno-exceptions -fno-rtti -I../../libcpp -I. -I../../libcpp/../include -I../../libcpp/include   -c -o identifiers.o -MT identifiers.o -MMD -MP -MF .deps/identifiers.Tpo ../../libcpp/identifiers.c
make[4]: Leaving directory '/tmp/B.oR3Dq_/BUILD/gcc-8.2.0/builddir/libcpp'
make[4]: Entering directory '/tmp/B.oR3Dq_/BUILD/gcc-8.2.0/builddir/libcpp'
i686-pld-linux-g++ -std=gnu++98  -I../../libcpp -I. -I../../libcpp/../include -I../../libcpp/include  -O2 -pipe -gdwarf-4 -fno-debug-types-section -fvar-tracking-assignments -g2 -Wp,-D_FORTIFY_SOURCE=2 -fstack-protector-strong --param=ssp-buffer-size=4 -fomit-frame-pointer -march=i686 -fasynchronous-unwind-tables -mtune=pentium4 -gdwarf-4 -fno-debug-types-section -fvar-tracking-assignments -g2  -O1 -g0 -W -Wall -Wno-narrowing -Wwrite-strings -Wmissing-format-attribute -pedantic -Wno-long-long  -fno-exceptions -fno-rtti -I../../libcpp -I. -I../../libcpp/../include -I../../libcpp/include   -c -o directives-only.o -MT directives-only.o -MMD -MP -MF .deps/directives-only.Tpo ../../libcpp/directives-only.c
make[4]: Leaving directory '/tmp/B.oR3Dq_/BUILD/gcc-8.2.0/builddir/libcpp'
make[4]: Entering directory '/tmp/B.oR3Dq_/BUILD/gcc-8.2.0/builddir/libcpp'
i686-pld-linux-g++ -std=gnu++98  -I../../libcpp -I. -I../../libcpp/../include -I../../libcpp/include  -O2 -pipe -gdwarf-4 -fno-debug-types-section -fvar-tracking-assignments -g2 -Wp,-D_FORTIFY_SOURCE=2 -fstack-protector-strong --param=ssp-buffer-size=4 -fomit-frame-pointer -march=i686 -fasynchronous-unwind-tables -mtune=pentium4 -gdwarf-4 -fno-debug-types-section -fvar-tracking-assignments -g2  -O1 -g0 -W -Wall -Wno-narrowing -Wwrite-strings -Wmissing-format-attribute -pedantic -Wno-long-long  -fno-exceptions -fno-rtti -I../../libcpp -I. -I../../libcpp/../include -I../../libcpp/include   -c -o mkdeps.o -MT mkdeps.o -MMD -MP -MF .deps/mkdeps.Tpo ../../libcpp/mkdeps.c
make[4]: Leaving directory '/tmp/B.oR3Dq_/BUILD/gcc-8.2.0/builddir/libcpp'
make[4]: Entering directory '/tmp/B.oR3Dq_/BUILD/gcc-8.2.0/builddir/libcpp'
i686-pld-linux-g++ -std=gnu++98  -I../../libcpp -I. -I../../libcpp/../include -I../../libcpp/include  -O2 -pipe -gdwarf-4 -fno-debug-types-section -fvar-tracking-assignments -g2 -Wp,-D_FORTIFY_SOURCE=2 -fstack-protector-strong --param=ssp-buffer-size=4 -fomit-frame-pointer -march=i686 -fasynchronous-unwind-tables -mtune=pentium4 -gdwarf-4 -fno-debug-types-section -fvar-tracking-assignments -g2  -O1 -g0 -W -Wall -Wno-narrowing -Wwrite-strings -Wmissing-format-attribute -pedantic -Wno-long-long  -fno-exceptions -fno-rtti -I../../libcpp -I. -I../../libcpp/../include -I../../libcpp/include   -c -o files.o -MT files.o -MMD -MP -MF .deps/files.Tpo ../../libcpp/files.c
make[4]: Leaving directory '/tmp/B.oR3Dq_/BUILD/gcc-8.2.0/builddir/libcpp'
make[4]: Entering directory '/tmp/B.oR3Dq_/BUILD/gcc-8.2.0/builddir/libcpp'
i686-pld-linux-g++ -std=gnu++98  -I../../libcpp -I. -I../../libcpp/../include -I../../libcpp/include  -O2 -pipe -gdwarf-4 -fno-debug-types-section -fvar-tracking-assignments -g2 -Wp,-D_FORTIFY_SOURCE=2 -fstack-protector-strong --param=ssp-buffer-size=4 -fomit-frame-pointer -march=i686 -fasynchronous-unwind-tables -mtune=pentium4 -gdwarf-4 -fno-debug-types-section -fvar-tracking-assignments -g2  -O1 -g0 -W -Wall -Wno-narrowing -Wwrite-strings -Wmissing-format-attribute -pedantic -Wno-long-long  -fno-exceptions -fno-rtti -I../../libcpp -I. -I../../libcpp/../include -I../../libcpp/include   -c -o expr.o -MT expr.o -MMD -MP -MF .deps/expr.Tpo ../../libcpp/expr.c
make[4]: Leaving directory '/tmp/B.oR3Dq_/BUILD/gcc-8.2.0/builddir/libcpp'
make[4]: Entering directory '/tmp/B.oR3Dq_/BUILD/gcc-8.2.0/builddir/libcpp'
i686-pld-linux-g++ -std=gnu++98  -I../../libcpp -I. -I../../libcpp/../include -I../../libcpp/include  -O2 -pipe -gdwarf-4 -fno-debug-types-section -fvar-tracking-assignments -g2 -Wp,-D_FORTIFY_SOURCE=2 -fstack-protector-strong --param=ssp-buffer-size=4 -fomit-frame-pointer -march=i686 -fasynchronous-unwind-tables -mtune=pentium4 -gdwarf-4 -fno-debug-types-section -fvar-tracking-assignments -g2  -O1 -g0 -W -Wall -Wno-narrowing -Wwrite-strings -Wmissing-format-attribute -pedantic -Wno-long-long  -fno-exceptions -fno-rtti -I../../libcpp -I. -I../../libcpp/../include -I../../libcpp/include   -c -o symtab.o -MT symtab.o -MMD -MP -MF .deps/symtab.Tpo ../../libcpp/symtab.c
make[4]: Leaving directory '/tmp/B.oR3Dq_/BUILD/gcc-8.2.0/builddir/libcpp'
make[4]: Entering directory '/tmp/B.oR3Dq_/BUILD/gcc-8.2.0/builddir/libcpp'
i686-pld-linux-g++ -std=gnu++98  -I../../libcpp -I. -I../../libcpp/../include -I../../libcpp/include  -O2 -pipe -gdwarf-4 -fno-debug-types-section -fvar-tracking-assignments -g2 -Wp,-D_FORTIFY_SOURCE=2 -fstack-protector-strong --param=ssp-buffer-size=4 -fomit-frame-pointer -march=i686 -fasynchronous-unwind-tables -mtune=pentium4 -gdwarf-4 -fno-debug-types-section -fvar-tracking-assignments -g2  -O1 -g0 -W -Wall -Wno-narrowing -Wwrite-strings -Wmissing-format-attribute -pedantic -Wno-long-long  -fno-exceptions -fno-rtti -I../../libcpp -I. -I../../libcpp/../include -I../../libcpp/include   -c -o directives.o -MT directives.o -MMD -MP -MF .deps/directives.Tpo ../../libcpp/directives.c
make[4]: Leaving directory '/tmp/B.oR3Dq_/BUILD/gcc-8.2.0/builddir/libcpp'
make[4]: Entering directory '/tmp/B.oR3Dq_/BUILD/gcc-8.2.0/builddir/libcpp'
i686-pld-linux-g++ -std=gnu++98  -I../../libcpp -I. -I../../libcpp/../include -I../../libcpp/include  -O2 -pipe -gdwarf-4 -fno-debug-types-section -fvar-tracking-assignments -g2 -Wp,-D_FORTIFY_SOURCE=2 -fstack-protector-strong --param=ssp-buffer-size=4 -fomit-frame-pointer -march=i686 -fasynchronous-unwind-tables -mtune=pentium4 -gdwarf-4 -fno-debug-types-section -fvar-tracking-assignments -g2  -O1 -g0 -W -Wall -Wno-narrowing -Wwrite-strings -Wmissing-format-attribute -pedantic -Wno-long-long  -fno-exceptions -fno-rtti -I../../libcpp -I. -I../../libcpp/../include -I../../libcpp/include   -c -o charset.o -MT charset.o -MMD -MP -MF .deps/charset.Tpo ../../libcpp/charset.c
make[4]: Leaving directory '/tmp/B.oR3Dq_/BUILD/gcc-8.2.0/builddir/libcpp'
make[4]: Entering directory '/tmp/B.oR3Dq_/BUILD/gcc-8.2.0/builddir/libcpp'
i686-pld-linux-g++ -std=gnu++98  -I../../libcpp -I. -I../../libcpp/../include -I../../libcpp/include  -O2 -pipe -gdwarf-4 -fno-debug-types-section -fvar-tracking-assignments -g2 -Wp,-D_FORTIFY_SOURCE=2 -fstack-protector-strong --param=ssp-buffer-size=4 -fomit-frame-pointer -march=i686 -fasynchronous-unwind-tables -mtune=pentium4 -gdwarf-4 -fno-debug-types-section -fvar-tracking-assignments -g2  -O1 -g0 -W -Wall -Wno-narrowing -Wwrite-strings -Wmissing-format-attribute -pedantic -Wno-long-long  -fno-exceptions -fno-rtti -I../../libcpp -I. -I../../libcpp/../include -I../../libcpp/include   -c -o lex.o -MT lex.o -MMD -MP -MF .deps/lex.Tpo ../../libcpp/lex.c
make[4]: Leaving directory '/tmp/B.oR3Dq_/BUILD/gcc-8.2.0/builddir/libcpp'
make[4]: Entering directory '/tmp/B.oR3Dq_/BUILD/gcc-8.2.0/builddir/libcpp'
i686-pld-linux-g++ -std=gnu++98  -I../../libcpp -I. -I../../libcpp/../include -I../../libcpp/include  -O2 -pipe -gdwarf-4 -fno-debug-types-section -fvar-tracking-assignments -g2 -Wp,-D_FORTIFY_SOURCE=2 -fstack-protector-strong --param=ssp-buffer-size=4 -fomit-frame-pointer -march=i686 -fasynchronous-unwind-tables -mtune=pentium4 -gdwarf-4 -fno-debug-types-section -fvar-tracking-assignments -g2  -O1 -g0 -W -Wall -Wno-narrowing -Wwrite-strings -Wmissing-format-attribute -pedantic -Wno-long-long  -fno-exceptions -fno-rtti -I../../libcpp -I. -I../../libcpp/../include -I../../libcpp/include   -c -o line-map.o -MT line-map.o -MMD -MP -MF .deps/line-map.Tpo ../../libcpp/line-map.c
make[4]: Leaving directory '/tmp/B.oR3Dq_/BUILD/gcc-8.2.0/builddir/libcpp'
make[4]: Entering directory '/tmp/B.oR3Dq_/BUILD/gcc-8.2.0/builddir/libcpp'
i686-pld-linux-g++ -std=gnu++98  -I../../libcpp -I. -I../../libcpp/../include -I../../libcpp/include  -O2 -pipe -gdwarf-4 -fno-debug-types-section -fvar-tracking-assignments -g2 -Wp,-D_FORTIFY_SOURCE=2 -fstack-protector-strong --param=ssp-buffer-size=4 -fomit-frame-pointer -march=i686 -fasynchronous-unwind-tables -mtune=pentium4 -gdwarf-4 -fno-debug-types-section -fvar-tracking-assignments -g2  -O1 -g0 -W -Wall -Wno-narrowing -Wwrite-strings -Wmissing-format-attribute -pedantic -Wno-long-long  -fno-exceptions -fno-rtti -I../../libcpp -I. -I../../libcpp/../include -I../../libcpp/include   -c -o macro.o -MT macro.o -MMD -MP -MF .deps/macro.Tpo ../../libcpp/macro.c
make[4]: Leaving directory '/tmp/B.oR3Dq_/BUILD/gcc-8.2.0/builddir/libcpp'
make[4]: Entering directory '/tmp/B.oR3Dq_/BUILD/gcc-8.2.0/builddir/libcpp'
i686-pld-linux-g++ -std=gnu++98  -I../../libcpp -I. -I../../libcpp/../include -I../../libcpp/include  -O2 -pipe -gdwarf-4 -fno-debug-types-section -fvar-tracking-assignments -g2 -Wp,-D_FORTIFY_SOURCE=2 -fstack-protector-strong --param=ssp-buffer-size=4 -fomit-frame-pointer -march=i686 -fasynchronous-unwind-tables -mtune=pentium4 -gdwarf-4 -fno-debug-types-section -fvar-tracking-assignments -g2  -O1 -g0 -W -Wall -Wno-narrowing -Wwrite-strings -Wmissing-format-attribute -pedantic -Wno-long-long  -fno-exceptions -fno-rtti -I../../libcpp -I. -I../../libcpp/../include -I../../libcpp/include   -c -o pch.o -MT pch.o -MMD -MP -MF .deps/pch.Tpo ../../libcpp/pch.c
make[4]: Leaving directory '/tmp/B.oR3Dq_/BUILD/gcc-8.2.0/builddir/libcpp'
make[4]: Entering directory '/tmp/B.oR3Dq_/BUILD/gcc-8.2.0/builddir/libcpp'
i686-pld-linux-g++ -std=gnu++98  -I../../libcpp -I. -I../../libcpp/../include -I../../libcpp/include  -O2 -pipe -gdwarf-4 -fno-debug-types-section -fvar-tracking-assignments -g2 -Wp,-D_FORTIFY_SOURCE=2 -fstack-protector-strong --param=ssp-buffer-size=4 -fomit-frame-pointer -march=i686 -fasynchronous-unwind-tables -mtune=pentium4 -gdwarf-4 -fno-debug-types-section -fvar-tracking-assignments -g2  -O1 -g0 -W -Wall -Wno-narrowing -Wwrite-strings -Wmissing-format-attribute -pedantic -Wno-long-long  -fno-exceptions -fno-rtti -I../../libcpp -I. -I../../libcpp/../include -I../../libcpp/include   -c -o traditional.o -MT traditional.o -MMD -MP -MF .deps/traditional.Tpo ../../libcpp/traditional.c
make[4]: Leaving directory '/tmp/B.oR3Dq_/BUILD/gcc-8.2.0/builddir/libcpp'
make[4]: Entering directory '/tmp/B.oR3Dq_/BUILD/gcc-8.2.0/builddir/libcpp'
i686-pld-linux-g++ -std=gnu++98  -I../../libcpp -I. -I../../libcpp/../include -I../../libcpp/include  -O2 -pipe -gdwarf-4 -fno-debug-types-section -fvar-tracking-assignments -g2 -Wp,-D_FORTIFY_SOURCE=2 -fstack-protector-strong --param=ssp-buffer-size=4 -fomit-frame-pointer -march=i686 -fasynchronous-unwind-tables -mtune=pentium4 -gdwarf-4 -fno-debug-types-section -fvar-tracking-assignments -g2  -O1 -g0 -W -Wall -Wno-narrowing -Wwrite-strings -Wmissing-format-attribute -pedantic -Wno-long-long  -fno-exceptions -fno-rtti -I../../libcpp -I. -I../../libcpp/../include -I../../libcpp/include   -c -o init.o -MT init.o -MMD -MP -MF .deps/init.Tpo ../../libcpp/init.c
make[4]: Leaving directory '/tmp/B.oR3Dq_/BUILD/gcc-8.2.0/builddir/libcpp'
make[4]: Entering directory '/tmp/B.oR3Dq_/BUILD/gcc-8.2.0/builddir/libcpp'
rm -f libcpp.a
ar cru libcpp.a charset.o directives.o directives-only.o errors.o expr.o files.o identifiers.o init.o lex.o line-map.o macro.o mkdeps.o pch.o symtab.o traditional.o
ranlib libcpp.a
make[4]: Leaving directory '/tmp/B.oR3Dq_/BUILD/gcc-8.2.0/builddir/libcpp'
Terminated
ended at: Wed Oct 10 17:08:13 2018, done in 0:00:52.149817
error: No files produced.
+ chmod -R u+rwX /tmp/B.oR3Dq_/BUILD
+ rm -rf /tmp/B.oR3Dq_/tmp /tmp/B.oR3Dq_/BUILD
make[3]: Entering directory '/tmp/B.oR3Dq_/BUILD/gcc-8.2.0/builddir'
Configuring stage 1 in ./gcc
configure: creating cache ./config.cache
checking build system type... i686-pld-linux-gnu
checking host system type... i686-pld-linux-gnu
checking target system type... i686-pld-linux-gnu
checking LIBRARY_PATH variable... ok
checking GCC_EXEC_PREFIX variable... ok
checking whether to place generated files in the source directory... no
checking whether a default linker was specified... no
checking whether a default assembler was specified... no
checking for i686-pld-linux-gcc... i686-pld-linux-gcc
checking for C compiler default output file name... a.out
checking whether the C compiler works... yes
checking whether we are cross compiling... no
checking for suffix of executables... 
checking for suffix of object files... o
checking whether we are using the GNU C compiler... yes
checking whether i686-pld-linux-gcc accepts -g... yes
checking for i686-pld-linux-gcc option to accept ISO C89... none needed
checking whether we are using the GNU C++ compiler... yes
checking whether i686-pld-linux-g++ -std=gnu++98 accepts -g... yes
checking for i686-pld-linux-gnatbind... gnatbind
checking for i686-pld-linux-gnatmake... gnatmake
checking whether compiler driver understands Ada... yes
checking how to run the C++ preprocessor... i686-pld-linux-g++ -std=gnu++98 -E
checking for grep that handles long lines and -e... /bin/grep
checking for egrep... /bin/grep -E
checking for ANSI C header files... yes
checking for sys/types.h... yes
checking for sys/stat.h... yes
checking for stdlib.h... yes
checking for string.h... yes
checking for memory.h... yes
checking for strings.h... yes
checking for inttypes.h... yes
checking for stdint.h... yes
checking for unistd.h... yes
checking minix/config.h usability... no
checking minix/config.h presence... no
checking for minix/config.h... no
checking whether it is safe to define __EXTENSIONS__... yes
checking how to run the C preprocessor... i686-pld-linux-gcc -E
checking for inline... inline
checking for special C compiler options needed for large files... no
checking for _FILE_OFFSET_BITS value needed for large files... 64
checking size of void *... 4
checking size of short... 2
checking size of int... 4
checking size of long... 4
checking for long long... yes
checking size of long long... 8
checking for int8_t... yes
checking for int16_t... yes
checking for int32_t... yes
checking for int64_t... yes
checking for long long int... yes
checking for intmax_t... yes
checking for intptr_t... yes
checking for uint8_t... yes
checking for uint16_t... yes
checking for uint32_t... yes
checking for uint64_t... yes
checking for unsigned long long int... yes
checking for uintmax_t... yes
checking for uintptr_t... yes
checking for int64_t underlying type... long long
checking for std::swap in <utility>... yes
checking whether i686-pld-linux-g++ -std=gnu++98 is affected by placement new aliasing bug... no
checking whether i686-pld-linux-g++ -std=gnu++98 supports -W... yes
checking whether i686-pld-linux-g++ -std=gnu++98 supports -Wall... yes
checking whether i686-pld-linux-g++ -std=gnu++98 supports -Wnarrowing... yes
checking whether i686-pld-linux-g++ -std=gnu++98 supports -Wwrite-strings... yes
checking whether i686-pld-linux-g++ -std=gnu++98 supports -Wcast-qual... yes
checking whether i686-pld-linux-g++ -std=gnu++98 supports -Wformat... yes
checking whether i686-pld-linux-gcc supports -Wstrict-prototypes... yes
checking whether i686-pld-linux-gcc supports -Wmissing-prototypes... yes
checking whether i686-pld-linux-g++ -std=gnu++98 supports -Wmissing-format-attribute... yes
checking whether i686-pld-linux-g++ -std=gnu++98 supports -Woverloaded-virtual... yes
checking whether i686-pld-linux-gcc supports -Wold-style-definition... yes
checking whether i686-pld-linux-gcc supports -Wc++-compat... yes
checking whether i686-pld-linux-g++ -std=gnu++98 supports -pedantic -Wlong-long -Wvariadic-macros -Woverlength-strings... yes
checking whether i686-pld-linux-gcc supports -fno-exceptions... yes
checking whether i686-pld-linux-gcc supports -fno-rtti... yes
checking whether i686-pld-linux-gcc supports -fasynchronous-unwind-tables... yes
checking valgrind.h usability... no
checking valgrind.h presence... no
checking for valgrind.h... no
checking for VALGRIND_DISCARD in <valgrind/memcheck.h>... yes
checking for VALGRIND_DISCARD in <memcheck.h>... no
checking for multiarch configuration... auto
configure: WARNING: fixed-point is not supported for this target, ignored
checking whether /usr/bin/make sets $(MAKE)... yes
checking for gawk... gawk
checking whether ln -s works... yes
checking whether ln works... yes
checking for i686-pld-linux-ranlib... ranlib
checking for a BSD compatible install... /usr/bin/install -c
checking for cmp's capabilities... gnucompare
checking for mktemp... yes
checking for makeinfo... makeinfo --split-size=5000000 --split-size=5000000
checking for modern makeinfo... yes
checking for recent Pod::Man... yes
checking for flex... flex
checking for bison... bison
checking for nm... nm
checking for ar... ar
checking for sphinx-build... sphinx
checking for ANSI C header files... (cached) yes
checking whether time.h and sys/time.h may both be included... yes
checking whether string.h and strings.h may both be included... yes
checking for sys/wait.h that is POSIX.1 compatible... yes
checking whether termios.h defines TIOCGWINSZ... no
checking whether sys/ioctl.h defines TIOCGWINSZ... yes
checking for limits.h... yes
checking for stddef.h... yes
checking for string.h... (cached) yes
checking for strings.h... (cached) yes
checking for stdlib.h... (cached) yes
checking for time.h... yes
checking for iconv.h... yes
checking for fcntl.h... yes
checking for ftw.h... yes
checking for unistd.h... (cached) yes
checking for sys/file.h... yes
checking for sys/time.h... yes
checking for sys/mman.h... yes
checking for sys/resource.h... yes
checking for sys/param.h... yes
checking for sys/times.h... yes
checking for sys/stat.h... (cached) yes
checking for direct.h... no
checking for malloc.h... yes
checking for langinfo.h... yes
checking for ldfcn.h... no
checking for locale.h... yes
checking for wchar.h... yes
checking for thread.h... no
checking for pthread.h... yes
checking for CHAR_BIT... yes
checking whether byte ordering is bigendian... no
checking how to run the C++ preprocessor... i686-pld-linux-g++ -std=gnu++98 -E
checking for unordered_map... no
checking for tr1/unordered_map... yes
checking for ext/hash_map... yes
checking dependency style of i686-pld-linux-g++ -std=gnu++98... gcc3
checking for collect2 libraries... none required
checking for library containing exc_resume... no
checking for library containing kstat_open... no
checking for library containing ldexp... none required
checking for inttypes.h... yes
checking for times... yes
checking for clock... yes
checking for kill... yes
checking for getrlimit... yes
checking for setrlimit... yes
checking for atoq... no
checking for popen... yes
checking for sysconf... yes
checking for strsignal... yes
checking for getrusage... yes
checking for nl_langinfo... yes
checking for gettimeofday... yes
checking for mbstowcs... yes
checking for wcswidth... yes
checking for mmap... yes
checking for setlocale... yes
checking for clearerr_unlocked... yes
checking for feof_unlocked... yes
checking for ferror_unlocked... yes
checking for fflush_unlocked... yes
checking for fgetc_unlocked... yes
checking for fgets_unlocked... yes
checking for fileno_unlocked... yes
checking for fprintf_unlocked... no
checking for fputc_unlocked... yes
checking for fputs_unlocked... yes
checking for fread_unlocked... yes
checking for fwrite_unlocked... yes
checking for getchar_unlocked... yes
checking for getc_unlocked... yes
checking for putchar_unlocked... yes
checking for putc_unlocked... yes
checking for madvise... yes
checking whether mbstowcs works... yes
checking for ssize_t... yes
checking for caddr_t... yes
checking for sys/mman.h... (cached) yes
checking for mmap... (cached) yes
checking whether read-only mmap of a plain file works... yes
checking whether mmap from /dev/zero works... yes
checking for MAP_ANON(YMOUS)... yes
checking whether mmap with MAP_ANON(YMOUS) works... yes
checking for pid_t... yes
checking for vfork.h... no
checking for fork... yes
checking for vfork... yes
checking for working fork... yes
checking for working vfork... (cached) yes
checking for ld used by GCC... ld
checking if the linker (ld) is GNU ld... yes
checking for shared library run path origin... done
checking for iconv... yes
checking for iconv declaration... install-shextern size_t iconv (iconv_t cd, char * *inbuf, size_t *inbytesleft, char * *outbuf, size_t *outbytesleft);
checking for LC_MESSAGES... yes
checking for nl_langinfo and CODESET... yes
checking whether basename is declared... yes
checking whether strstr is declared... yes
checking whether getenv is declared... yes
checking whether atol is declared... yes
checking whether atoll is declared... yes
checking whether asprintf is declared... yes
checking whether sbrk is declared... yes
checking whether abort is declared... yes
checking whether atof is declared... yes
checking whether getcwd is declared... yes
checking whether getwd is declared... yes
checking whether madvise is declared... yes
checking whether stpcpy is declared... yes
checking whether strnlen is declared... yes
checking whether strsignal is declared... yes
checking whether strverscmp is declared... yes
checking whether strtol is declared... yes
checking whether strtoul is declared... yes
checking whether strtoll is declared... yes
checking whether strtoull is declared... yes
checking whether setenv is declared... yes
checking whether unsetenv is declared... yes
checking whether errno is declared... yes
checking whether snprintf is declared... yes
checking whether vsnprintf is declared... yes
checking whether vasprintf is declared... yes
checking whether malloc is declared... yes
checking whether realloc is declared... yes
checking whether calloc is declared... yes
checking whether free is declared... yes
checking whether getopt is declared... yes
checking whether clock is declared... yes
checking whether getpagesize is declared... yes
checking whether ffs is declared... yes
checking whether clearerr_unlocked is declared... yes
checking whether feof_unlocked is declared... yes
checking whether ferror_unlocked is declared... yes
/tmp/B.oR3Dq_/BUILD/gcc-8.2.0/gcc/configure[11035]: can't create temporary file : No such file or directory
checking whether fflush_unlocked is declared... /tmp/B.oR3Dq_/BUILD/gcc-8.2.0/gcc/configure[11035]: can't create temporary file : No such file or directory
sed: can't read conftest.cpp: No such file or directory
no
/tmp/B.oR3Dq_/BUILD/gcc-8.2.0/gcc/configure[11035]: can't create temporary file : No such file or directory
checking whether fgetc_unlocked is declared... /tmp/B.oR3Dq_/BUILD/gcc-8.2.0/gcc/configure[11035]: can't create temporary file : No such file or directory
sed: can't read conftest.cpp: No such file or directory
no
/tmp/B.oR3Dq_/BUILD/gcc-8.2.0/gcc/configure[11035]: can't create temporary file : No such file or directory
checking whether fgets_unlocked is declared... /tmp/B.oR3Dq_/BUILD/gcc-8.2.0/gcc/configure[11035]: can't create temporary file : No such file or directory
sed: can't read conftest.cpp: No such file or directory
no
/tmp/B.oR3Dq_/BUILD/gcc-8.2.0/gcc/configure[11035]: can't create temporary file : No such file or directory
checking whether fileno_unlocked is declared... /tmp/B.oR3Dq_/BUILD/gcc-8.2.0/gcc/configure[11035]: can't create temporary file : No such file or directory
sed: can't read conftest.cpp: No such file or directory
no
/tmp/B.oR3Dq_/BUILD/gcc-8.2.0/gcc/configure[11035]: can't create temporary file : No such file or directory
checking whether fprintf_unlocked is declared... /tmp/B.oR3Dq_/BUILD/gcc-8.2.0/gcc/configure[11035]: can't create temporary file : No such file or directory
sed: can't read conftest.cpp: No such file or directory
no
/tmp/B.oR3Dq_/BUILD/gcc-8.2.0/gcc/configure[11035]: can't create temporary file : No such file or directory
checking whether fputc_unlocked is declared... /tmp/B.oR3Dq_/BUILD/gcc-8.2.0/gcc/configure[11035]: can't create temporary file : No such file or directory
sed: can't read conftest.cpp: No such file or directory
no
/tmp/B.oR3Dq_/BUILD/gcc-8.2.0/gcc/configure[11035]: can't create temporary file : No such file or directory
checking whether fputs_unlocked is declared... /tmp/B.oR3Dq_/BUILD/gcc-8.2.0/gcc/configure[11035]: can't create temporary file : No such file or directory
sed: can't read conftest.cpp: No such file or directory
no
/tmp/B.oR3Dq_/BUILD/gcc-8.2.0/gcc/configure[11035]: can't create temporary file : No such file or directory
checking whether fread_unlocked is declared... /tmp/B.oR3Dq_/BUILD/gcc-8.2.0/gcc/configure[11035]: can't create temporary file : No such file or directory
sed: can't read conftest.cpp: No such file or directory
no
/tmp/B.oR3Dq_/BUILD/gcc-8.2.0/gcc/configure[11035]: can't create temporary file : No such file or directory
checking whether fwrite_unlocked is declared... /tmp/B.oR3Dq_/BUILD/gcc-8.2.0/gcc/configure[11035]: can't create temporary file : No such file or directory
sed: can't read conftest.cpp: No such file or directory
no
/tmp/B.oR3Dq_/BUILD/gcc-8.2.0/gcc/configure[11035]: can't create temporary file : No such file or directory
checking whether getchar_unlocked is declared... /tmp/B.oR3Dq_/BUILD/gcc-8.2.0/gcc/configure[11035]: can't create temporary file : No such file or directory
sed: can't read conftest.cpp: No such file or directory
no
/tmp/B.oR3Dq_/BUILD/gcc-8.2.0/gcc/configure[11035]: can't create temporary file : No such file or directory
checking whether getc_unlocked is declared... /tmp/B.oR3Dq_/BUILD/gcc-8.2.0/gcc/configure[11035]: can't create temporary file : No such file or directory
sed: can't read conftest.cpp: No such file or directory
no
/tmp/B.oR3Dq_/BUILD/gcc-8.2.0/gcc/configure[11035]: can't create temporary file : No such file or directory
checking whether putchar_unlocked is declared... /tmp/B.oR3Dq_/BUILD/gcc-8.2.0/gcc/configure[11035]: can't create temporary file : No such file or directory
sed: can't read conftest.cpp: No such file or directory
no
/tmp/B.oR3Dq_/BUILD/gcc-8.2.0/gcc/configure[11035]: can't create temporary file : No such file or directory
checking whether putc_unlocked is declared... /tmp/B.oR3Dq_/BUILD/gcc-8.2.0/gcc/configure[11035]: can't create temporary file : No such file or directory
sed: can't read conftest.cpp: No such file or directory
no
/tmp/B.oR3Dq_/BUILD/gcc-8.2.0/gcc/configure[11035]: can't create temporary file : No such file or directory
checking whether getrlimit is declared... /tmp/B.oR3Dq_/BUILD/gcc-8.2.0/gcc/configure[11090]: can't create temporary file : No such file or directory
sed: can't read conftest.cpp: No such file or directory
no
/tmp/B.oR3Dq_/BUILD/gcc-8.2.0/gcc/configure[11090]: can't create temporary file : No such file or directory
checking whether setrlimit is declared... /tmp/B.oR3Dq_/BUILD/gcc-8.2.0/gcc/configure[11090]: can't create temporary file : No such file or directory
sed: can't read conftest.cpp: No such file or directory
no
/tmp/B.oR3Dq_/BUILD/gcc-8.2.0/gcc/configure[11090]: can't create temporary file : No such file or directory
checking whether getrusage is declared... /tmp/B.oR3Dq_/BUILD/gcc-8.2.0/gcc/configure[11090]: can't create temporary file : No such file or directory
sed: can't read conftest.cpp: No such file or directory
no
/tmp/B.oR3Dq_/BUILD/gcc-8.2.0/gcc/configure[11090]: can't create temporary file : No such file or directory
/tmp/B.oR3Dq_/BUILD/gcc-8.2.0/gcc/configure[11109]: can't create temporary file : No such file or directory
sed: can't read conftest.cpp: No such file or directory
checking whether ldgetname is declared... /tmp/B.oR3Dq_/BUILD/gcc-8.2.0/gcc/configure[11177]: can't create temporary file : No such file or directory
sed: can't read conftest.cpp: No such file or directory
no
/tmp/B.oR3Dq_/BUILD/gcc-8.2.0/gcc/configure[11177]: can't create temporary file : No such file or directory
checking whether times is declared... /tmp/B.oR3Dq_/BUILD/gcc-8.2.0/gcc/configure[11232]: can't create temporary file : No such file or directory
sed: can't read conftest.cpp: No such file or directory
no
/tmp/B.oR3Dq_/BUILD/gcc-8.2.0/gcc/configure[11232]: can't create temporary file : No such file or directory
checking whether sigaltstack is declared... /tmp/B.oR3Dq_/BUILD/gcc-8.2.0/gcc/configure[11285]: can't create temporary file : No such file or directory
sed: can't read conftest.cpp: No such file or directory
no
/tmp/B.oR3Dq_/BUILD/gcc-8.2.0/gcc/configure[11285]: can't create temporary file : No such file or directory
checking for struct tms... /tmp/B.oR3Dq_/BUILD/gcc-8.2.0/gcc/configure[11318]: can't create temporary file : No such file or directory
sed: can't read conftest.cpp: No such file or directory
no
checking for clock_t... /tmp/B.oR3Dq_/BUILD/gcc-8.2.0/gcc/configure[11355]: can't create temporary file : No such file or directory
sed: can't read conftest.cpp: No such file or directory
no
checking for F_SETLKW... /tmp/B.oR3Dq_/BUILD/gcc-8.2.0/gcc/configure[11395]: can't create temporary file : No such file or directory
sed: can't read conftest.cpp: No such file or directory
no
checking if mkdir takes one argument... /tmp/B.oR3Dq_/BUILD/gcc-8.2.0/gcc/configure[11441]: can't create temporary file : No such file or directory
sed: can't read conftest.cpp: No such file or directory
yes
Using `../../gcc/config/i386/i386.c' for machine-specific logic.
Using `../../gcc/config/i386/i386.md' as machine description file.
Using the following target machine macro files:
	../../gcc/config/vxworks-dummy.h
	../../gcc/config/i386/i386.h
	../../gcc/config/i386/unix.h
	../../gcc/config/i386/att.h
	../../gcc/config/dbxelf.h
	../../gcc/config/elfos.h
	../../gcc/config/gnu-user.h
	../../gcc/config/glibc-stdint.h
	../../gcc/config/linux.h
	../../gcc/config/linux-android.h
	../../gcc/config/i386/gnu-user-common.h
	../../gcc/config/i386/gnu-user.h
	../../gcc/config/i386/linux-common.h
	../../gcc/config/i386/linux.h
	../../gcc/config/initfini-array.h
/tmp/B.oR3Dq_/BUILD/gcc-8.2.0/gcc/configure[11599]: can't create temporary file : No such file or directory
/tmp/B.oR3Dq_/BUILD/gcc-8.2.0/gcc/configure[11606]: can't create temporary file : No such file or directory
Using host-linux.o for host machine hooks.
checking for __cxa_atexit... /tmp/B.oR3Dq_/BUILD/gcc-8.2.0/gcc/configure[11748]: can't create temporary file : No such file or directory
sed: can't read conftest.cpp: No such file or directory
no
__cxa_atexit can't be enabled on this target
/tmp/B.oR3Dq_/BUILD/gcc-8.2.0/gcc/configure[11759]: can't create temporary file : No such file or directory
/tmp/B.oR3Dq_/BUILD/gcc-8.2.0/gcc/configure[11836]: can't create temporary file : No such file or directory
/tmp/B.oR3Dq_/BUILD/gcc-8.2.0/gcc/configure[11837]: cat: conftest.out: No such file or directory
/tmp/B.oR3Dq_/BUILD/gcc-8.2.0/gcc/configure[11848]: can't create temporary file : No such file or directory
/tmp/B.oR3Dq_/BUILD/gcc-8.2.0/gcc/configure[11877]: can't create temporary file : No such file or directory
checking whether NLS is requested... yes
checking for catalogs to be installed...  be da de el es fi fr hr id ja nl ru sr sv tr uk vi zh_CN zh_TW be da de el es fi fr hr id ja nl ru sr sv tr uk vi zh_CN zh_TW
/tmp/B.oR3Dq_/BUILD/gcc-8.2.0/gcc/configure[12360]: can't create temporary file : No such file or directory
checking how to print strings... print -r
checking for a sed that does not truncate output... /bin/sed
checking for fgrep... /bin/grep -F
checking for ld used by i686-pld-linux-gcc... ld
checking if the linker (ld) is GNU ld... yes
checking for BSD- or MS-compatible name lister (nm)... nm
checking the name lister (nm) interface... BSD nm
checking whether ln -s works... yes
checking the maximum length of command line arguments... 1572864
checking whether the shell understands some XSI constructs... yes
checking whether the shell understands "+="... yes
checking for ld option to reload object files... -r
checking for i686-pld-linux-objdump... objdump
checking how to recognize dependent libraries... pass_all
checking for i686-pld-linux-ar... (cached) ar
checking for i686-pld-linux-strip... no
checking for strip... strip
checking for i686-pld-linux-ranlib... (cached) ranlib
checking command to parse nm output from i686-pld-linux-gcc object... /tmp/B.oR3Dq_/BUILD/gcc-8.2.0/gcc/configure[14106]: can't create temporary file : No such file or directory
/tmp/B.oR3Dq_/BUILD/gcc-8.2.0/gcc/configure[14106]: can't create temporary file : No such file or directory
failed
checking for dlfcn.h... /tmp/B.oR3Dq_/BUILD/gcc-8.2.0/gcc/configure[14971]: can't create temporary file : No such file or directory
sed: can't read conftest.cpp: No such file or directory
no
checking for objdir... .libs
/tmp/B.oR3Dq_/BUILD/gcc-8.2.0/gcc/configure[15174]: can't create temporary file : No such file or directory
checking if i686-pld-linux-gcc supports -fno-rtti -fno-exceptions... no
checking for i686-pld-linux-gcc option to produce PIC... -fPIC -DPIC
checking if i686-pld-linux-gcc PIC flag -fPIC -DPIC works... yes
checking if i686-pld-linux-gcc static flag -static works... yes
checking if i686-pld-linux-gcc supports -c -o file.o... yes
checking if i686-pld-linux-gcc supports -c -o file.o... (cached) yes
checking whether the i686-pld-linux-gcc linker (ld) supports shared libraries... yes
checking whether -lc should be explicitly linked in... no
checking dynamic linker characteristics... /tmp/B.oR3Dq_/BUILD/gcc-8.2.0/gcc/configure[18765]: can't create temporary file : No such file or directory
sed: can't read conftest.c: No such file or directory
GNU/Linux ld.so
checking how to hardcode library paths into programs... immediate
checking whether stripping libraries is possible... yes
checking if libtool supports shared libraries... yes
checking whether to build shared libraries... yes
checking whether to build static libraries... yes
checking how to run the C++ preprocessor... i686-pld-linux-g++ -std=gnu++98 -E
/tmp/B.oR3Dq_/BUILD/gcc-8.2.0/gcc/configure[18912]: can't create temporary file : No such file or directory
sed: can't read conftest.cpp: No such file or directory
/tmp/B.oR3Dq_/BUILD/gcc-8.2.0/gcc/configure[18912]: can't create temporary file : No such file or directory
sed: can't read conftest.cpp: No such file or directory
configure: error: in `/tmp/B.oR3Dq_/BUILD/gcc-8.2.0/builddir/gcc':
configure: error: C++ preprocessor "i686-pld-linux-g++ -std=gnu++98 -E" fails sanity check
See `config.log' for more details.
/tmp/B.oR3Dq_/BUILD/gcc-8.2.0/gcc/configure: can't create temporary file : No such file or directory
/tmp/B.oR3Dq_/BUILD/gcc-8.2.0/gcc/configure: can't create temporary file : No such file or directory
/tmp/B.oR3Dq_/BUILD/gcc-8.2.0/gcc/configure: can't create temporary file : No such file or directory
/tmp/B.oR3Dq_/BUILD/gcc-8.2.0/gcc/configure: can't create temporary file : No such file or directory
make[3]: *** [Makefile:4317: configure-stage1-gcc] Error 1
make[3]: Leaving directory '/tmp/B.oR3Dq_/BUILD/gcc-8.2.0/builddir'
make[2]: *** [Makefile:25845: stage1-bubble] Error 2
make[1]: *** [Makefile:26736: profiledbootstrap] Error 2
make: *** [Makefile:4: all] Error 2
+ rm -rf /tmp/B.oR3Dq_
Begin-PLD-Builder-Info
Build-Time: user:10.64s sys:9.72s real:66.58s (faults io:0 non-io:150118)

End-PLD-Builder-Info
[Back to list of logs] [View rpm -qa of builder]