FailedOk

th/SRPMS[OK]
th/x32[OK]
th/i686[OK]
th/x86_64[OK]

ac/SRPMS[OK]
ac/i386[OK]
ac/i586[OK]
ac/i686[OK]
ac/alpha[OK]
ac/amd64[OK]
ac/athlon[OK]
ac/ppc[OK]
ac/sparc[OK]
ac/sparc64[OK]

Advanced Search
main()
Powered by PLD Linux
(c) 2002-2017 PLD Team
$Revision: 1.37 $
Powered by Neo.
Your IP: 54.234.255.29

gd 07fcfe38-5f01-4a21-9448-a0e17ab6ca9c

Status:Failed
Source URL:ftp://buildlogs.pld-linux.org/th/i686/FAIL/gd,07fcfe38-5f01-4a21-9448-a0e17ab6ca9c.bz2
text/plain URL:View!
full text:View!
rpm -qa of builder:View!
Date:2017/11/29 21:20:50
Runtime:0:01:00.563192

Toc:

  • error 1
  • XFAIL: gdimagecopyresampled/bug00201
  • error 2
  • XFAIL: gdimagegrayscale/basic
  • error 3
  • XFAIL: gdimagerotate/bug00067
  • error 4
  • XFAIL: gdimagestringft/gdimagestringft_bbox
  • error 5
  • # XFAIL: 4
  • error 6
  • # FAIL: 0
  • error 7
  • # ERROR: 0
  • error 8
  • error: Bad exit status from /tmp/B.AcgKe_/BUILD/tmp/rpm-tmp.87354 (%build)
  • error 9
  • RPM build errors:
  • error 10
  • error: No files produced.

Content:

PASS: bmp/bmp_im2im
make[3]: Leaving directory '/tmp/B.AcgKe_/BUILD/libgd-2.2.5/tests'
make[3]: Entering directory '/tmp/B.AcgKe_/BUILD/libgd-2.2.5/tests'
PASS: gd/gd_num_colors
make[3]: Leaving directory '/tmp/B.AcgKe_/BUILD/libgd-2.2.5/tests'
make[3]: Entering directory '/tmp/B.AcgKe_/BUILD/libgd-2.2.5/tests'
PASS: gd2/bug00354
make[3]: Leaving directory '/tmp/B.AcgKe_/BUILD/libgd-2.2.5/tests'
make[3]: Entering directory '/tmp/B.AcgKe_/BUILD/libgd-2.2.5/tests'
PASS: gd2/bug00209
make[3]: Leaving directory '/tmp/B.AcgKe_/BUILD/libgd-2.2.5/tests'
make[3]: Entering directory '/tmp/B.AcgKe_/BUILD/libgd-2.2.5/tests'
PASS: gd2/bug00309
make[3]: Leaving directory '/tmp/B.AcgKe_/BUILD/libgd-2.2.5/tests'
make[3]: Entering directory '/tmp/B.AcgKe_/BUILD/libgd-2.2.5/tests'
PASS: gd/gd_im2im
make[3]: Leaving directory '/tmp/B.AcgKe_/BUILD/libgd-2.2.5/tests'
make[3]: Entering directory '/tmp/B.AcgKe_/BUILD/libgd-2.2.5/tests'
PASS: gd2/gd2_empty_file
make[3]: Leaving directory '/tmp/B.AcgKe_/BUILD/libgd-2.2.5/tests'
make[3]: Entering directory '/tmp/B.AcgKe_/BUILD/libgd-2.2.5/tests'
PASS: gd2/gd2_null
make[3]: Leaving directory '/tmp/B.AcgKe_/BUILD/libgd-2.2.5/tests'
make[3]: Entering directory '/tmp/B.AcgKe_/BUILD/libgd-2.2.5/tests'
PASS: gd2/gd2_read_corrupt
make[3]: Leaving directory '/tmp/B.AcgKe_/BUILD/libgd-2.2.5/tests'
make[3]: Entering directory '/tmp/B.AcgKe_/BUILD/libgd-2.2.5/tests'
PASS: gd2/gd2_im2im
make[3]: Leaving directory '/tmp/B.AcgKe_/BUILD/libgd-2.2.5/tests'
make[3]: Entering directory '/tmp/B.AcgKe_/BUILD/libgd-2.2.5/tests'
PASS: gd2/too_few_image_data
make[3]: Leaving directory '/tmp/B.AcgKe_/BUILD/libgd-2.2.5/tests'
make[3]: Entering directory '/tmp/B.AcgKe_/BUILD/libgd-2.2.5/tests'
PASS: gdimagearc/bug00079
make[3]: Leaving directory '/tmp/B.AcgKe_/BUILD/libgd-2.2.5/tests'
make[3]: Entering directory '/tmp/B.AcgKe_/BUILD/libgd-2.2.5/tests'
PASS: gd2/gd2_read
make[3]: Leaving directory '/tmp/B.AcgKe_/BUILD/libgd-2.2.5/tests'
make[3]: Entering directory '/tmp/B.AcgKe_/BUILD/libgd-2.2.5/tests'
PASS: gdimagecolordeallocate/gdimagecolordeallocate
make[3]: Leaving directory '/tmp/B.AcgKe_/BUILD/libgd-2.2.5/tests'
make[3]: Entering directory '/tmp/B.AcgKe_/BUILD/libgd-2.2.5/tests'
PASS: gdimageclone/bug00300
make[3]: Leaving directory '/tmp/B.AcgKe_/BUILD/libgd-2.2.5/tests'
make[3]: Entering directory '/tmp/B.AcgKe_/BUILD/libgd-2.2.5/tests'
PASS: gdimagecolorclosest/gdimagecolorclosest
make[3]: Leaving directory '/tmp/B.AcgKe_/BUILD/libgd-2.2.5/tests'
make[3]: Entering directory '/tmp/B.AcgKe_/BUILD/libgd-2.2.5/tests'
PASS: gdimagecolorreplace/gdimagecolorreplace
make[3]: Leaving directory '/tmp/B.AcgKe_/BUILD/libgd-2.2.5/tests'
make[3]: Entering directory '/tmp/B.AcgKe_/BUILD/libgd-2.2.5/tests'
PASS: gdimagecolor/basic
make[3]: Leaving directory '/tmp/B.AcgKe_/BUILD/libgd-2.2.5/tests'
make[3]: Entering directory '/tmp/B.AcgKe_/BUILD/libgd-2.2.5/tests'
PASS: gdimagebrightness/basic
make[3]: Leaving directory '/tmp/B.AcgKe_/BUILD/libgd-2.2.5/tests'
make[3]: Entering directory '/tmp/B.AcgKe_/BUILD/libgd-2.2.5/tests'
PASS: gdimagecolorexact/gdimagecolorexact
make[3]: Leaving directory '/tmp/B.AcgKe_/BUILD/libgd-2.2.5/tests'
make[3]: Entering directory '/tmp/B.AcgKe_/BUILD/libgd-2.2.5/tests'
PASS: gdimagecolorresolve/gdimagecolorresolve
make[3]: Leaving directory '/tmp/B.AcgKe_/BUILD/libgd-2.2.5/tests'
make[3]: Entering directory '/tmp/B.AcgKe_/BUILD/libgd-2.2.5/tests'
PASS: gdimagecolortransparent/gdimagecolortransparent
make[3]: Leaving directory '/tmp/B.AcgKe_/BUILD/libgd-2.2.5/tests'
make[3]: Entering directory '/tmp/B.AcgKe_/BUILD/libgd-2.2.5/tests'
PASS: gdimagecopy/bug00007
make[3]: Leaving directory '/tmp/B.AcgKe_/BUILD/libgd-2.2.5/tests'
make[3]: Entering directory '/tmp/B.AcgKe_/BUILD/libgd-2.2.5/tests'
PASS: gdimagecopy/bug00081
make[3]: Leaving directory '/tmp/B.AcgKe_/BUILD/libgd-2.2.5/tests'
make[3]: Entering directory '/tmp/B.AcgKe_/BUILD/libgd-2.2.5/tests'
PASS: gdimageconvolution/basic
make[3]: Leaving directory '/tmp/B.AcgKe_/BUILD/libgd-2.2.5/tests'
make[3]: Entering directory '/tmp/B.AcgKe_/BUILD/libgd-2.2.5/tests'
PASS: gdimagecopyresampled/basic
make[3]: Leaving directory '/tmp/B.AcgKe_/BUILD/libgd-2.2.5/tests'
make[3]: Entering directory '/tmp/B.AcgKe_/BUILD/libgd-2.2.5/tests'
PASS: gdimagecopyresampled/basic_alpha
make[3]: Leaving directory '/tmp/B.AcgKe_/BUILD/libgd-2.2.5/tests'
make[3]: Entering directory '/tmp/B.AcgKe_/BUILD/libgd-2.2.5/tests'
PASS: gdimagecopyresampled/exact_alpha
make[3]: Leaving directory '/tmp/B.AcgKe_/BUILD/libgd-2.2.5/tests'
make[3]: Entering directory '/tmp/B.AcgKe_/BUILD/libgd-2.2.5/tests'
PASS: gdimagecontrast/basic
make[3]: Leaving directory '/tmp/B.AcgKe_/BUILD/libgd-2.2.5/tests'
make[3]: Entering directory '/tmp/B.AcgKe_/BUILD/libgd-2.2.5/tests'
PASS: gd2/php_bug_72339
make[3]: Leaving directory '/tmp/B.AcgKe_/BUILD/libgd-2.2.5/tests'
make[3]: Entering directory '/tmp/B.AcgKe_/BUILD/libgd-2.2.5/tests'
PASS: gdimagecreate/bug00340
make[3]: Leaving directory '/tmp/B.AcgKe_/BUILD/libgd-2.2.5/tests'
make[3]: Entering directory '/tmp/B.AcgKe_/BUILD/libgd-2.2.5/tests'
PASS: gdimagecrop/bug00297
make[3]: Leaving directory '/tmp/B.AcgKe_/BUILD/libgd-2.2.5/tests'
make[3]: Entering directory '/tmp/B.AcgKe_/BUILD/libgd-2.2.5/tests'
PASS: gdimagecrop/php_bug_72494
make[3]: Leaving directory '/tmp/B.AcgKe_/BUILD/libgd-2.2.5/tests'
make[3]: Entering directory '/tmp/B.AcgKe_/BUILD/libgd-2.2.5/tests'
XFAIL: gdimagecopyresampled/bug00201
make[3]: Leaving directory '/tmp/B.AcgKe_/BUILD/libgd-2.2.5/tests'
make[3]: Entering directory '/tmp/B.AcgKe_/BUILD/libgd-2.2.5/tests'
PASS: gdimagecopyrotated/bug00020
make[3]: Leaving directory '/tmp/B.AcgKe_/BUILD/libgd-2.2.5/tests'
make[3]: Entering directory '/tmp/B.AcgKe_/BUILD/libgd-2.2.5/tests'
PASS: gdimagefill/bug00002_1
make[3]: Leaving directory '/tmp/B.AcgKe_/BUILD/libgd-2.2.5/tests'
make[3]: Entering directory '/tmp/B.AcgKe_/BUILD/libgd-2.2.5/tests'
PASS: gdimagefile/gdnametest
make[3]: Leaving directory '/tmp/B.AcgKe_/BUILD/libgd-2.2.5/tests'
make[3]: Entering directory '/tmp/B.AcgKe_/BUILD/libgd-2.2.5/tests'
PASS: gdimagefill/bug00002_3
make[3]: Leaving directory '/tmp/B.AcgKe_/BUILD/libgd-2.2.5/tests'
make[3]: Entering directory '/tmp/B.AcgKe_/BUILD/libgd-2.2.5/tests'
PASS: gdimagefill/bug00002_2
make[3]: Leaving directory '/tmp/B.AcgKe_/BUILD/libgd-2.2.5/tests'
make[3]: Entering directory '/tmp/B.AcgKe_/BUILD/libgd-2.2.5/tests'
PASS: gdimagefill/bug00002_4
make[3]: Leaving directory '/tmp/B.AcgKe_/BUILD/libgd-2.2.5/tests'
make[3]: Entering directory '/tmp/B.AcgKe_/BUILD/libgd-2.2.5/tests'
PASS: gdimagefilledellipse/bug00191
make[3]: Leaving directory '/tmp/B.AcgKe_/BUILD/libgd-2.2.5/tests'
make[3]: Entering directory '/tmp/B.AcgKe_/BUILD/libgd-2.2.5/tests'
PASS: gdimagefilledarc/php_bug43828
make[3]: Leaving directory '/tmp/B.AcgKe_/BUILD/libgd-2.2.5/tests'
make[3]: Entering directory '/tmp/B.AcgKe_/BUILD/libgd-2.2.5/tests'
PASS: gdimagefilledellipse/github_bug_00238
make[3]: Leaving directory '/tmp/B.AcgKe_/BUILD/libgd-2.2.5/tests'
make[3]: Entering directory '/tmp/B.AcgKe_/BUILD/libgd-2.2.5/tests'
PASS: gdimagefilledpolygon/bug00100
make[3]: Leaving directory '/tmp/B.AcgKe_/BUILD/libgd-2.2.5/tests'
make[3]: Entering directory '/tmp/B.AcgKe_/BUILD/libgd-2.2.5/tests'
PASS: gdimagefill/bug00104_1
make[3]: Leaving directory '/tmp/B.AcgKe_/BUILD/libgd-2.2.5/tests'
make[3]: Entering directory '/tmp/B.AcgKe_/BUILD/libgd-2.2.5/tests'
PASS: gdimagefilledpolygon/gdimagefilledpolygon0
make[3]: Leaving directory '/tmp/B.AcgKe_/BUILD/libgd-2.2.5/tests'
make[3]: Entering directory '/tmp/B.AcgKe_/BUILD/libgd-2.2.5/tests'
PASS: gdimagefilledellipse/bug00010
make[3]: Leaving directory '/tmp/B.AcgKe_/BUILD/libgd-2.2.5/tests'
make[3]: Entering directory '/tmp/B.AcgKe_/BUILD/libgd-2.2.5/tests'
PASS: gdimagefilledpolygon/gdimagefilledpolygon1
make[3]: Leaving directory '/tmp/B.AcgKe_/BUILD/libgd-2.2.5/tests'
make[3]: Entering directory '/tmp/B.AcgKe_/BUILD/libgd-2.2.5/tests'
PASS: gdimagefilledpolygon/gdimagefilledpolygon2
make[3]: Leaving directory '/tmp/B.AcgKe_/BUILD/libgd-2.2.5/tests'
make[3]: Entering directory '/tmp/B.AcgKe_/BUILD/libgd-2.2.5/tests'
PASS: gdimagefilltoborder/github_bug_215
make[3]: Leaving directory '/tmp/B.AcgKe_/BUILD/libgd-2.2.5/tests'
make[3]: Entering directory '/tmp/B.AcgKe_/BUILD/libgd-2.2.5/tests'
PASS: gdimagefilltoborder/bug00037
make[3]: Leaving directory '/tmp/B.AcgKe_/BUILD/libgd-2.2.5/tests'
make[3]: Entering directory '/tmp/B.AcgKe_/BUILD/libgd-2.2.5/tests'
PASS: gdimagefilledrectangle/bug00078
make[3]: Leaving directory '/tmp/B.AcgKe_/BUILD/libgd-2.2.5/tests'
make[3]: Entering directory '/tmp/B.AcgKe_/BUILD/libgd-2.2.5/tests'
PASS: gdimagefilledpolygon/gdimagefilledpolygon3
make[3]: Leaving directory '/tmp/B.AcgKe_/BUILD/libgd-2.2.5/tests'
make[3]: Entering directory '/tmp/B.AcgKe_/BUILD/libgd-2.2.5/tests'
PASS: gdimagefilledrectangle/bug00106_gdimagefilledrectangle
make[3]: Leaving directory '/tmp/B.AcgKe_/BUILD/libgd-2.2.5/tests'
make[3]: Entering directory '/tmp/B.AcgKe_/BUILD/libgd-2.2.5/tests'
PASS: gdimagefilledpolygon/self_intersecting
make[3]: Leaving directory '/tmp/B.AcgKe_/BUILD/libgd-2.2.5/tests'
make[3]: Entering directory '/tmp/B.AcgKe_/BUILD/libgd-2.2.5/tests'
PASS: gdimagefilledpolygon/php_bug_64641
make[3]: Leaving directory '/tmp/B.AcgKe_/BUILD/libgd-2.2.5/tests'
make[3]: Entering directory '/tmp/B.AcgKe_/BUILD/libgd-2.2.5/tests'
PASS: gdimagefilledrectangle/bug00004
make[3]: Leaving directory '/tmp/B.AcgKe_/BUILD/libgd-2.2.5/tests'
make[3]: Entering directory '/tmp/B.AcgKe_/BUILD/libgd-2.2.5/tests'
PASS: gdimageline/bug00077
make[3]: Leaving directory '/tmp/B.AcgKe_/BUILD/libgd-2.2.5/tests'
make[3]: Entering directory '/tmp/B.AcgKe_/BUILD/libgd-2.2.5/tests'
PASS: gdimageline/bug00072
make[3]: Leaving directory '/tmp/B.AcgKe_/BUILD/libgd-2.2.5/tests'
make[3]: Entering directory '/tmp/B.AcgKe_/BUILD/libgd-2.2.5/tests'
PASS: gdimagegrayscale/bug00386
make[3]: Leaving directory '/tmp/B.AcgKe_/BUILD/libgd-2.2.5/tests'
make[3]: Entering directory '/tmp/B.AcgKe_/BUILD/libgd-2.2.5/tests'
PASS: gdimageflip/gdimageflip
make[3]: Leaving directory '/tmp/B.AcgKe_/BUILD/libgd-2.2.5/tests'
make[3]: Entering directory '/tmp/B.AcgKe_/BUILD/libgd-2.2.5/tests'
PASS: gdimageline/gdimageline_aa_outofrange
make[3]: Leaving directory '/tmp/B.AcgKe_/BUILD/libgd-2.2.5/tests'
make[3]: Entering directory '/tmp/B.AcgKe_/BUILD/libgd-2.2.5/tests'
PASS: gdimageline/bug00111
make[3]: Leaving directory '/tmp/B.AcgKe_/BUILD/libgd-2.2.5/tests'
make[3]: Entering directory '/tmp/B.AcgKe_/BUILD/libgd-2.2.5/tests'
XFAIL: gdimagegrayscale/basic
make[3]: Leaving directory '/tmp/B.AcgKe_/BUILD/libgd-2.2.5/tests'
make[3]: Entering directory '/tmp/B.AcgKe_/BUILD/libgd-2.2.5/tests'
PASS: gdimageline/gdimageline_aa
make[3]: Leaving directory '/tmp/B.AcgKe_/BUILD/libgd-2.2.5/tests'
make[3]: Entering directory '/tmp/B.AcgKe_/BUILD/libgd-2.2.5/tests'
PASS: gdimagefilter/gdCopyBlurred
make[3]: Leaving directory '/tmp/B.AcgKe_/BUILD/libgd-2.2.5/tests'
make[3]: Entering directory '/tmp/B.AcgKe_/BUILD/libgd-2.2.5/tests'
PASS: gdimageopenpolygon/gdimageopenpolygon0
make[3]: Leaving directory '/tmp/B.AcgKe_/BUILD/libgd-2.2.5/tests'
make[3]: Entering directory '/tmp/B.AcgKe_/BUILD/libgd-2.2.5/tests'
PASS: gdimageline/gdImageAALine_thickness
make[3]: Leaving directory '/tmp/B.AcgKe_/BUILD/libgd-2.2.5/tests'
make[3]: Entering directory '/tmp/B.AcgKe_/BUILD/libgd-2.2.5/tests'
PASS: gdimageopenpolygon/gdimageopenpolygon2
make[3]: Leaving directory '/tmp/B.AcgKe_/BUILD/libgd-2.2.5/tests'
make[3]: Entering directory '/tmp/B.AcgKe_/BUILD/libgd-2.2.5/tests'
PASS: gdimagenegate/basic
make[3]: Leaving directory '/tmp/B.AcgKe_/BUILD/libgd-2.2.5/tests'
make[3]: Entering directory '/tmp/B.AcgKe_/BUILD/libgd-2.2.5/tests'
PASS: gdimageopenpolygon/gdimageopenpolygon1
make[3]: Leaving directory '/tmp/B.AcgKe_/BUILD/libgd-2.2.5/tests'
make[3]: Entering directory '/tmp/B.AcgKe_/BUILD/libgd-2.2.5/tests'
PASS: gdimageline/github_bug_167
make[3]: Leaving directory '/tmp/B.AcgKe_/BUILD/libgd-2.2.5/tests'
make[3]: Entering directory '/tmp/B.AcgKe_/BUILD/libgd-2.2.5/tests'
PASS: gdimageopenpolygon/gdimageopenpolygon3
make[3]: Leaving directory '/tmp/B.AcgKe_/BUILD/libgd-2.2.5/tests'
make[3]: Entering directory '/tmp/B.AcgKe_/BUILD/libgd-2.2.5/tests'
PASS: gdimagepolygon/gdimagepolygon1
make[3]: Leaving directory '/tmp/B.AcgKe_/BUILD/libgd-2.2.5/tests'
make[3]: Entering directory '/tmp/B.AcgKe_/BUILD/libgd-2.2.5/tests'
PASS: gdimagepolygon/gdimagepolygon3
make[3]: Leaving directory '/tmp/B.AcgKe_/BUILD/libgd-2.2.5/tests'
make[3]: Entering directory '/tmp/B.AcgKe_/BUILD/libgd-2.2.5/tests'
PASS: gdimagerectangle/bug00003
make[3]: Leaving directory '/tmp/B.AcgKe_/BUILD/libgd-2.2.5/tests'
make[3]: Entering directory '/tmp/B.AcgKe_/BUILD/libgd-2.2.5/tests'
PASS: gdimagepixelate/gdimagepixelate
make[3]: Leaving directory '/tmp/B.AcgKe_/BUILD/libgd-2.2.5/tests'
make[3]: Entering directory '/tmp/B.AcgKe_/BUILD/libgd-2.2.5/tests'
PASS: gdimagepolygon/gdimagepolygon0
make[3]: Leaving directory '/tmp/B.AcgKe_/BUILD/libgd-2.2.5/tests'
make[3]: Entering directory '/tmp/B.AcgKe_/BUILD/libgd-2.2.5/tests'
PASS: gdimagepolygon/gdimagepolygon2
make[3]: Leaving directory '/tmp/B.AcgKe_/BUILD/libgd-2.2.5/tests'
make[3]: Entering directory '/tmp/B.AcgKe_/BUILD/libgd-2.2.5/tests'
PASS: gdimagerectangle/bug00106_gdimagerectangle
make[3]: Leaving directory '/tmp/B.AcgKe_/BUILD/libgd-2.2.5/tests'
make[3]: Entering directory '/tmp/B.AcgKe_/BUILD/libgd-2.2.5/tests'
PASS: gdimagerectangle/bug00299
make[3]: Leaving directory '/tmp/B.AcgKe_/BUILD/libgd-2.2.5/tests'
make[3]: Entering directory '/tmp/B.AcgKe_/BUILD/libgd-2.2.5/tests'
PASS: gdimagerectangle/point_ordering
make[3]: Leaving directory '/tmp/B.AcgKe_/BUILD/libgd-2.2.5/tests'
make[3]: Entering directory '/tmp/B.AcgKe_/BUILD/libgd-2.2.5/tests'
PASS: gdimagerectangle/github_bug_00172
make[3]: Leaving directory '/tmp/B.AcgKe_/BUILD/libgd-2.2.5/tests'
make[3]: Entering directory '/tmp/B.AcgKe_/BUILD/libgd-2.2.5/tests'
PASS: gdimagerotate/php_bug_65070
make[3]: Leaving directory '/tmp/B.AcgKe_/BUILD/libgd-2.2.5/tests'
make[3]: Entering directory '/tmp/B.AcgKe_/BUILD/libgd-2.2.5/tests'
PASS: gdimagerotate/php_bug_64898
make[3]: Leaving directory '/tmp/B.AcgKe_/BUILD/libgd-2.2.5/tests'
make[3]: Entering directory '/tmp/B.AcgKe_/BUILD/libgd-2.2.5/tests'
PASS: gdimagescale/bug00329
make[3]: Leaving directory '/tmp/B.AcgKe_/BUILD/libgd-2.2.5/tests'
make[3]: Entering directory '/tmp/B.AcgKe_/BUILD/libgd-2.2.5/tests'
XFAIL: gdimagerotate/bug00067
make[3]: Leaving directory '/tmp/B.AcgKe_/BUILD/libgd-2.2.5/tests'
make[3]: Entering directory '/tmp/B.AcgKe_/BUILD/libgd-2.2.5/tests'
PASS: gdimagescale/bug_overflow_large_new_size
make[3]: Leaving directory '/tmp/B.AcgKe_/BUILD/libgd-2.2.5/tests'
make[3]: Entering directory '/tmp/B.AcgKe_/BUILD/libgd-2.2.5/tests'
PASS: gdimagescale/bug00330
make[3]: Leaving directory '/tmp/B.AcgKe_/BUILD/libgd-2.2.5/tests'
make[3]: Entering directory '/tmp/B.AcgKe_/BUILD/libgd-2.2.5/tests'
PASS: gdimagescatterex/bug00208_1
make[3]: Leaving directory '/tmp/B.AcgKe_/BUILD/libgd-2.2.5/tests'
make[3]: Entering directory '/tmp/B.AcgKe_/BUILD/libgd-2.2.5/tests'
PASS: gdimagescatterex/bug00208_2
make[3]: Leaving directory '/tmp/B.AcgKe_/BUILD/libgd-2.2.5/tests'
make[3]: Entering directory '/tmp/B.AcgKe_/BUILD/libgd-2.2.5/tests'
PASS: gdimagescale/github_bug_00218
make[3]: Leaving directory '/tmp/B.AcgKe_/BUILD/libgd-2.2.5/tests'
make[3]: Entering directory '/tmp/B.AcgKe_/BUILD/libgd-2.2.5/tests'
PASS: gdimagesetpixel/bug00186
make[3]: Leaving directory '/tmp/B.AcgKe_/BUILD/libgd-2.2.5/tests'
make[3]: Entering directory '/tmp/B.AcgKe_/BUILD/libgd-2.2.5/tests'
PASS: gdimagesetpixel/gdeffectoverlay
make[3]: Leaving directory '/tmp/B.AcgKe_/BUILD/libgd-2.2.5/tests'
make[3]: Entering directory '/tmp/B.AcgKe_/BUILD/libgd-2.2.5/tests'
PASS: gdimagesetpixel/alpha_blending
make[3]: Leaving directory '/tmp/B.AcgKe_/BUILD/libgd-2.2.5/tests'
make[3]: Entering directory '/tmp/B.AcgKe_/BUILD/libgd-2.2.5/tests'
PASS: gdimagesetpixel/gdeffectmultiply
make[3]: Leaving directory '/tmp/B.AcgKe_/BUILD/libgd-2.2.5/tests'
make[3]: Entering directory '/tmp/B.AcgKe_/BUILD/libgd-2.2.5/tests'
PASS: gdimagestringftex/gdimagestringftex_returnfontpathname
make[3]: Leaving directory '/tmp/B.AcgKe_/BUILD/libgd-2.2.5/tests'
make[3]: Entering directory '/tmp/B.AcgKe_/BUILD/libgd-2.2.5/tests'
XFAIL: gdimagestringft/gdimagestringft_bbox
make[3]: Leaving directory '/tmp/B.AcgKe_/BUILD/libgd-2.2.5/tests'
make[3]: Entering directory '/tmp/B.AcgKe_/BUILD/libgd-2.2.5/tests'
PASS: gdimagetruecolortopalette/php_bug_67325
make[3]: Leaving directory '/tmp/B.AcgKe_/BUILD/libgd-2.2.5/tests'
make[3]: Entering directory '/tmp/B.AcgKe_/BUILD/libgd-2.2.5/tests'
PASS: gdimagetruecolortopalette/php_bug_72512
make[3]: Leaving directory '/tmp/B.AcgKe_/BUILD/libgd-2.2.5/tests'
make[3]: Entering directory '/tmp/B.AcgKe_/BUILD/libgd-2.2.5/tests'
PASS: gdimagetruecolortopalette/bug00307
make[3]: Leaving directory '/tmp/B.AcgKe_/BUILD/libgd-2.2.5/tests'
make[3]: Entering directory '/tmp/B.AcgKe_/BUILD/libgd-2.2.5/tests'
PASS: gdinterpolatedscale/gdModesAndPalettes
make[3]: Leaving directory '/tmp/B.AcgKe_/BUILD/libgd-2.2.5/tests'
make[3]: Entering directory '/tmp/B.AcgKe_/BUILD/libgd-2.2.5/tests'
PASS: gdtransformaffineboundingbox/github_bug_00221
make[3]: Leaving directory '/tmp/B.AcgKe_/BUILD/libgd-2.2.5/tests'
make[3]: Entering directory '/tmp/B.AcgKe_/BUILD/libgd-2.2.5/tests'
PASS: gdnewfilectx/gdnewfilectx_null
make[3]: Leaving directory '/tmp/B.AcgKe_/BUILD/libgd-2.2.5/tests'
make[3]: Entering directory '/tmp/B.AcgKe_/BUILD/libgd-2.2.5/tests'
PASS: gdtiled/bug00032
make[3]: Leaving directory '/tmp/B.AcgKe_/BUILD/libgd-2.2.5/tests'
make[3]: Entering directory '/tmp/B.AcgKe_/BUILD/libgd-2.2.5/tests'
PASS: gif/bug00181
make[3]: Leaving directory '/tmp/B.AcgKe_/BUILD/libgd-2.2.5/tests'
make[3]: Entering directory '/tmp/B.AcgKe_/BUILD/libgd-2.2.5/tests'
PASS: gif/bug00005_2
make[3]: Leaving directory '/tmp/B.AcgKe_/BUILD/libgd-2.2.5/tests'
make[3]: Entering directory '/tmp/B.AcgKe_/BUILD/libgd-2.2.5/tests'
PASS: gif/bug00227
make[3]: Leaving directory '/tmp/B.AcgKe_/BUILD/libgd-2.2.5/tests'
make[3]: Entering directory '/tmp/B.AcgKe_/BUILD/libgd-2.2.5/tests'
PASS: gif/gif_null
make[3]: Leaving directory '/tmp/B.AcgKe_/BUILD/libgd-2.2.5/tests'
make[3]: Entering directory '/tmp/B.AcgKe_/BUILD/libgd-2.2.5/tests'
PASS: gif/bug00005
make[3]: Leaving directory '/tmp/B.AcgKe_/BUILD/libgd-2.2.5/tests'
make[3]: Entering directory '/tmp/B.AcgKe_/BUILD/libgd-2.2.5/tests'
PASS: gif/uninitialized_memory_read
make[3]: Leaving directory '/tmp/B.AcgKe_/BUILD/libgd-2.2.5/tests'
make[3]: Entering directory '/tmp/B.AcgKe_/BUILD/libgd-2.2.5/tests'
PASS: gif/bug00060
make[3]: Leaving directory '/tmp/B.AcgKe_/BUILD/libgd-2.2.5/tests'
make[3]: Entering directory '/tmp/B.AcgKe_/BUILD/libgd-2.2.5/tests'
PASS: gif/bug00006
make[3]: Leaving directory '/tmp/B.AcgKe_/BUILD/libgd-2.2.5/tests'
make[3]: Entering directory '/tmp/B.AcgKe_/BUILD/libgd-2.2.5/tests'
PASS: gif/bug00066
make[3]: Leaving directory '/tmp/B.AcgKe_/BUILD/libgd-2.2.5/tests'
make[3]: Entering directory '/tmp/B.AcgKe_/BUILD/libgd-2.2.5/tests'
PASS: jpeg/jpeg_empty_file
make[3]: Leaving directory '/tmp/B.AcgKe_/BUILD/libgd-2.2.5/tests'
make[3]: Entering directory '/tmp/B.AcgKe_/BUILD/libgd-2.2.5/tests'
PASS: jpeg/jpeg_null
make[3]: Leaving directory '/tmp/B.AcgKe_/BUILD/libgd-2.2.5/tests'
make[3]: Entering directory '/tmp/B.AcgKe_/BUILD/libgd-2.2.5/tests'
PASS: gif/gif_im2im
make[3]: Leaving directory '/tmp/B.AcgKe_/BUILD/libgd-2.2.5/tests'
make[3]: Entering directory '/tmp/B.AcgKe_/BUILD/libgd-2.2.5/tests'
PASS: jpeg/jpeg_im2im
make[3]: Leaving directory '/tmp/B.AcgKe_/BUILD/libgd-2.2.5/tests'
make[3]: Entering directory '/tmp/B.AcgKe_/BUILD/libgd-2.2.5/tests'
PASS: jpeg/bug00338
make[3]: Leaving directory '/tmp/B.AcgKe_/BUILD/libgd-2.2.5/tests'
make[3]: Entering directory '/tmp/B.AcgKe_/BUILD/libgd-2.2.5/tests'
PASS: jpeg/bug_github_18
make[3]: Leaving directory '/tmp/B.AcgKe_/BUILD/libgd-2.2.5/tests'
make[3]: Entering directory '/tmp/B.AcgKe_/BUILD/libgd-2.2.5/tests'
PASS: jpeg/jpeg_read
make[3]: Leaving directory '/tmp/B.AcgKe_/BUILD/libgd-2.2.5/tests'
make[3]: Entering directory '/tmp/B.AcgKe_/BUILD/libgd-2.2.5/tests'
PASS: jpeg/jpeg_resolution
make[3]: Leaving directory '/tmp/B.AcgKe_/BUILD/libgd-2.2.5/tests'
make[3]: Entering directory '/tmp/B.AcgKe_/BUILD/libgd-2.2.5/tests'
PASS: png/bug00086
make[3]: Leaving directory '/tmp/B.AcgKe_/BUILD/libgd-2.2.5/tests'
make[3]: Entering directory '/tmp/B.AcgKe_/BUILD/libgd-2.2.5/tests'
PASS: png/bug00011
make[3]: Leaving directory '/tmp/B.AcgKe_/BUILD/libgd-2.2.5/tests'
make[3]: Entering directory '/tmp/B.AcgKe_/BUILD/libgd-2.2.5/tests'
PASS: png/bug00033
make[3]: Leaving directory '/tmp/B.AcgKe_/BUILD/libgd-2.2.5/tests'
make[3]: Entering directory '/tmp/B.AcgKe_/BUILD/libgd-2.2.5/tests'
PASS: png/bug00088
make[3]: Leaving directory '/tmp/B.AcgKe_/BUILD/libgd-2.2.5/tests'
make[3]: Entering directory '/tmp/B.AcgKe_/BUILD/libgd-2.2.5/tests'
PASS: png/bug00193
make[3]: Leaving directory '/tmp/B.AcgKe_/BUILD/libgd-2.2.5/tests'
make[3]: Entering directory '/tmp/B.AcgKe_/BUILD/libgd-2.2.5/tests'
PASS: png/bug00338
make[3]: Leaving directory '/tmp/B.AcgKe_/BUILD/libgd-2.2.5/tests'
make[3]: Entering directory '/tmp/B.AcgKe_/BUILD/libgd-2.2.5/tests'
PASS: png/bug00381_1
make[3]: Leaving directory '/tmp/B.AcgKe_/BUILD/libgd-2.2.5/tests'
make[3]: Entering directory '/tmp/B.AcgKe_/BUILD/libgd-2.2.5/tests'
PASS: png/bug00381_2
make[3]: Leaving directory '/tmp/B.AcgKe_/BUILD/libgd-2.2.5/tests'
make[3]: Entering directory '/tmp/B.AcgKe_/BUILD/libgd-2.2.5/tests'
PASS: png/png_null
make[3]: Leaving directory '/tmp/B.AcgKe_/BUILD/libgd-2.2.5/tests'
make[3]: Entering directory '/tmp/B.AcgKe_/BUILD/libgd-2.2.5/tests'
PASS: png/png_im2im
make[3]: Leaving directory '/tmp/B.AcgKe_/BUILD/libgd-2.2.5/tests'
make[3]: Entering directory '/tmp/B.AcgKe_/BUILD/libgd-2.2.5/tests'
PASS: png/png_resolution
make[3]: Leaving directory '/tmp/B.AcgKe_/BUILD/libgd-2.2.5/tests'
make[3]: Entering directory '/tmp/B.AcgKe_/BUILD/libgd-2.2.5/tests'
PASS: tga/bug00084
make[3]: Leaving directory '/tmp/B.AcgKe_/BUILD/libgd-2.2.5/tests'
make[3]: Entering directory '/tmp/B.AcgKe_/BUILD/libgd-2.2.5/tests'
PASS: tga/bug00247
make[3]: Leaving directory '/tmp/B.AcgKe_/BUILD/libgd-2.2.5/tests'
make[3]: Entering directory '/tmp/B.AcgKe_/BUILD/libgd-2.2.5/tests'
PASS: tga/bug00248
make[3]: Leaving directory '/tmp/B.AcgKe_/BUILD/libgd-2.2.5/tests'
make[3]: Entering directory '/tmp/B.AcgKe_/BUILD/libgd-2.2.5/tests'
PASS: tga/bug00247a
make[3]: Leaving directory '/tmp/B.AcgKe_/BUILD/libgd-2.2.5/tests'
make[3]: Entering directory '/tmp/B.AcgKe_/BUILD/libgd-2.2.5/tests'
PASS: tga/bug00248a
make[3]: Leaving directory '/tmp/B.AcgKe_/BUILD/libgd-2.2.5/tests'
make[3]: Entering directory '/tmp/B.AcgKe_/BUILD/libgd-2.2.5/tests'
PASS: tga/tga_null
make[3]: Leaving directory '/tmp/B.AcgKe_/BUILD/libgd-2.2.5/tests'
make[3]: Entering directory '/tmp/B.AcgKe_/BUILD/libgd-2.2.5/tests'
PASS: tga/heap_overflow
make[3]: Leaving directory '/tmp/B.AcgKe_/BUILD/libgd-2.2.5/tests'
make[3]: Entering directory '/tmp/B.AcgKe_/BUILD/libgd-2.2.5/tests'
PASS: tga/tga_read
make[3]: Leaving directory '/tmp/B.AcgKe_/BUILD/libgd-2.2.5/tests'
make[3]: Entering directory '/tmp/B.AcgKe_/BUILD/libgd-2.2.5/tests'
PASS: tiff/tiff_dpi
make[3]: Leaving directory '/tmp/B.AcgKe_/BUILD/libgd-2.2.5/tests'
make[3]: Entering directory '/tmp/B.AcgKe_/BUILD/libgd-2.2.5/tests'
PASS: tiff/tiff_im2im
make[3]: Leaving directory '/tmp/B.AcgKe_/BUILD/libgd-2.2.5/tests'
make[3]: Entering directory '/tmp/B.AcgKe_/BUILD/libgd-2.2.5/tests'
PASS: tiff/tiff_invalid_read
make[3]: Leaving directory '/tmp/B.AcgKe_/BUILD/libgd-2.2.5/tests'
make[3]: Entering directory '/tmp/B.AcgKe_/BUILD/libgd-2.2.5/tests'
PASS: wbmp/wbmp_null
make[3]: Leaving directory '/tmp/B.AcgKe_/BUILD/libgd-2.2.5/tests'
make[3]: Entering directory '/tmp/B.AcgKe_/BUILD/libgd-2.2.5/tests'
PASS: tiff/tiff_read_bw
make[3]: Leaving directory '/tmp/B.AcgKe_/BUILD/libgd-2.2.5/tests'
make[3]: Entering directory '/tmp/B.AcgKe_/BUILD/libgd-2.2.5/tests'
PASS: tiff/tiff_null
make[3]: Leaving directory '/tmp/B.AcgKe_/BUILD/libgd-2.2.5/tests'
make[3]: Entering directory '/tmp/B.AcgKe_/BUILD/libgd-2.2.5/tests'
PASS: webp/bug00111
make[3]: Leaving directory '/tmp/B.AcgKe_/BUILD/libgd-2.2.5/tests'
make[3]: Entering directory '/tmp/B.AcgKe_/BUILD/libgd-2.2.5/tests'
PASS: wbmp/wbmp_im2im
make[3]: Leaving directory '/tmp/B.AcgKe_/BUILD/libgd-2.2.5/tests'
make[3]: Entering directory '/tmp/B.AcgKe_/BUILD/libgd-2.2.5/tests'
PASS: xbm/github_bug_109
make[3]: Leaving directory '/tmp/B.AcgKe_/BUILD/libgd-2.2.5/tests'
make[3]: Entering directory '/tmp/B.AcgKe_/BUILD/libgd-2.2.5/tests'
PASS: xpm/bug00166
make[3]: Leaving directory '/tmp/B.AcgKe_/BUILD/libgd-2.2.5/tests'
make[3]: Entering directory '/tmp/B.AcgKe_/BUILD/libgd-2.2.5/tests'
PASS: xpm/bug00185
make[3]: Leaving directory '/tmp/B.AcgKe_/BUILD/libgd-2.2.5/tests'
make[3]: Entering directory '/tmp/B.AcgKe_/BUILD/libgd-2.2.5/tests'
PASS: xpm/color_name
make[3]: Leaving directory '/tmp/B.AcgKe_/BUILD/libgd-2.2.5/tests'
make[3]: Entering directory '/tmp/B.AcgKe_/BUILD/libgd-2.2.5/tests'
PASS: gdinterpolatedscale/gdTrivialResize
make[3]: Leaving directory '/tmp/B.AcgKe_/BUILD/libgd-2.2.5/tests'
make[3]: Entering directory '/tmp/B.AcgKe_/BUILD/libgd-2.2.5/tests'
PASS: webp/bug_double_free
make[3]: Leaving directory '/tmp/B.AcgKe_/BUILD/libgd-2.2.5/tests'
make[3]: Entering directory '/tmp/B.AcgKe_/BUILD/libgd-2.2.5/tests'
PASS: xbm/github_bug_170
make[3]: Leaving directory '/tmp/B.AcgKe_/BUILD/libgd-2.2.5/tests'
make[3]: Entering directory '/tmp/B.AcgKe_/BUILD/libgd-2.2.5/tests'
PASS: xbm/x10_basic_read
make[3]: Leaving directory '/tmp/B.AcgKe_/BUILD/libgd-2.2.5/tests'
make[3]: Entering directory '/tmp/B.AcgKe_/BUILD/libgd-2.2.5/tests'
PASS: gdimageline/gdimageline_bug5
make[3]: Leaving directory '/tmp/B.AcgKe_/BUILD/libgd-2.2.5/tests'
make[3]: Entering directory '/tmp/B.AcgKe_/BUILD/libgd-2.2.5/tests'
============================================================================
Testsuite summary for GD 2.2.5
============================================================================
# TOTAL: 166
# PASS:  161
# SKIP:  0
# XFAIL: 4
# FAIL:  0
# XPASS: 1
# ERROR: 0
============================================================================
See tests/test-suite.log
Please report to https://github.com/libgd/libgd/issues
============================================================================
make[3]: *** [Makefile:4022: test-suite.log] Error 1
make[3]: Leaving directory '/tmp/B.AcgKe_/BUILD/libgd-2.2.5/tests'
make[2]: *** [Makefile:4130: check-TESTS] Error 2
make[1]: *** [Makefile:5356: check-am] Error 2
make: *** [Makefile:418: check-recursive] Error 1
error: Bad exit status from /tmp/B.AcgKe_/BUILD/tmp/rpm-tmp.87354 (%build)


RPM build errors:
    Bad exit status from /tmp/B.AcgKe_/BUILD/tmp/rpm-tmp.87354 (%build)
ended at: Wed Nov 29 21:20:49 2017, done in 0:01:00.563192
error: No files produced.
+ chmod -R u+rwX /tmp/B.AcgKe_/BUILD
+ rm -rf /tmp/B.AcgKe_/tmp /tmp/B.AcgKe_/BUILD
+ rm -rf /tmp/B.AcgKe_
Begin-PLD-Builder-Info
Build-Time: user:107.75s sys:75.53s real:68.03s (faults io:0 non-io:23221459)

End-PLD-Builder-Info
[Back to list of logs] [View rpm -qa of builder]