FailedOk

th/SRPMS[OK]
th/x32[OK]
th/i686[OK]
th/x86_64[OK]

ac/SRPMS[OK]
ac/i386[OK]
ac/i586[OK]
ac/i686[OK]
ac/alpha[OK]
ac/amd64[OK]
ac/athlon[OK]
ac/ppc[OK]
ac/sparc[OK]
ac/sparc64[OK]

Advanced Search
main()
Powered by PLD Linux
(c) 2002-2021 PLD Team
$Revision: 1.37 $
Powered by Real Computer.
Your IP: 3.214.224.207

gnome-connections e4d8f3ae-4555-4f1a-a7ff-2ede1fb460f0

Status:Failed
Source URL:https://buildlogs.pld-linux.org/pld/th/i686/FAIL/gnome-connections,e4d8f3ae-4555-4f1a-a7ff-2ede1fb460f0.bz2
text/plain URL:View!
full text:View!
rpm -qa of builder:View!
Date:2021/09/25 23:53:56
Runtime:0:00:06.591084

Toc:

  • error 1
  • rpm: error: Failed build dependencies:
  • error 2
  • rpm: error: Failed build dependencies:
  • error 3
  • rpm: error: Failed build dependencies:
  • prep
  • Executing(%prep): /bin/sh -e /tmp/B.n48esetd/BUILD/tmp/rpm-tmp.XuiqYV
  • build
  • Executing(%build): /bin/sh -e /tmp/B.n48esetd/BUILD/tmp/rpm-tmp.iYcIlo
  • error 4
  • error: Package `gtk-vnc-2.0' not found in specified Vala API directories or GObject-Introspection GIR directories
  • error 5
  • error: Bad exit status from /tmp/B.n48esetd/BUILD/tmp/rpm-tmp.iYcIlo (%build)
  • error 6
  • RPM build errors:
  • error 7
  • error: No files produced.

Content:

checking if we should skip the build
started at: Sat Sep 25 23:53:26 2021
killing old processes on a builder
sending signal 9 to pid -1
cleaning up /tmp
fetching https://srcbuilder.pld-linux.org/th//srpms/e4d8f3ae-4555-4f1a-a7ff-2ede1fb460f0/gnome-connections-41.0-1.src.rpm
fetched 151025 bytes, 453.6 K/s
installing srpm: gnome-connections-41.0-1.src.rpm
+ install -d /tmp/B.n48esetd/BUILD /tmp/B.n48esetd/RPMS
+ LC_ALL=en_US.UTF-8
+ rpm -qp --changelog gnome-connections-41.0-1.src.rpm
* Sat Sep 25 2021 PLD Linux Team <feedback@pld-linux.org>
- For complete changelog see: http://git.pld-linux.org/?p=packages/gnome-connections.git;a=log;h=master
* Sat Sep 25 2021 Jakub Bogusz <qboosh@pld-linux.org> 9e513b9
- updated to 41.0; use included gtk-frtp for now * Thu Apr 15 2021 Jakub Bogusz <qboosh@pld-linux.org> 3036696
- updated to 40.0.1 * Fri Mar 26 2021 Jakub Bogusz <qboosh@pld-linux.org> 1de042f
- updated to 40.0, upstream name now matches ours * Tue Oct 20 2020 Jakub Bogusz <qboosh@pld-linux.org> ee508a6
- updated to 3.38.1 * Sun Oct 18 2020 Jakub Bogusz <qboosh@pld-linux.org> 2c148eb
- new, GNOME connections project as gnome-connections.spec + rpm -Uhv --nodeps --define '_topdir /tmp/B.n48esetd' --define '_specdir %{_topdir}' --define '_sourcedir %{_specdir}' --define '_rpmdir %{_topdir}/RPMS' --define '_builddir %{_topdir}/BUILD' gnome-connections-41.0-1.src.rpm Updating / installing... gnome-connections-41.0-1 ######################################## + rm -f gnome-connections-41.0-1.src.rpm + install -m 700 -d /tmp/B.n48esetd/BUILD/tmp + TMPDIR=/tmp/B.n48esetd/BUILD/tmp + exec nice -n 0 rpmbuild -bp --short-circuit --nodeps --define '_topdir /tmp/B.n48esetd' --define '_specdir %{_topdir}' --define '_sourcedir %{_specdir}' --define '_rpmdir %{_topdir}/RPMS' --define '_builddir %{_topdir}/BUILD' --target i686-pld-linux --define 'prep exit 0' /tmp/B.n48esetd/gnome-connections.spec warning: Could not canonicalize hostname: nereid Building target platforms: i686-pld-linux Building for target i686-pld-linux checking BuildConflict-ing packages rpm: warning: Could not canonicalize hostname: nereid rpm: error: Failed build dependencies: rpm: gtk3-vnc-devel >= 0.4.5 is needed by gnome-connections-41.0-1.i686 rpm: Building target platforms: i686-pld-linux rpm: Building for target i686-pld-linux no BuildConflicts found checking BR rpm: warning: Could not canonicalize hostname: nereid rpm: error: Failed build dependencies: rpm: gtk3-vnc-devel >= 0.4.5 is needed by gnome-connections-41.0-1.i686 rpm: Building target platforms: i686-pld-linux rpm: Building for target i686-pld-linux updating poldek cache... ready is up to date th is up to date th is up to date th-ready is up to date th-ready is up to date Retrieving th-test::packages.ndir.diff.toc.gz..............................................done Retrieving diff::packages.ndir.2021.09.25-18.03.06.gz......................................done Loading [pndir]th-test... Applying packages.ndir.2021.09.25-18.03.06.gz... Retrieving diff::packages.ndir.2021.09.25-21.44.02.gz......................................done Applying packages.ndir.2021.09.25-21.44.02.gz... Retrieving diff::packages.ndir.2021.09.25-21.49.01.gz......................................done Applying packages.ndir.2021.09.25-21.49.01.gz... Writing /root/.poldek-cache/[...]/packages.ndir.gz... Loading [pndir]th-test... Applying packages.ndir.2021.09.25-19.07.02.gz... Applying packages.ndir.2021.09.25-19.31.03.gz... Retrieving diff::packages.ndir.2021.09.25-21.31.02.gz......................................done Applying packages.ndir.2021.09.25-21.31.02.gz... Writing /root/.poldek-cache/[...]/packages.ndir.gz... checking conflicting packages in BRed packages poldek: Loading [pndir]ready... poldek: Loading [pndir]th-test... poldek: Loading [pndir]th-test... poldek: Loading [pndir]th-ready... poldek: Loading [pndir]th-ready... poldek: Loading [pndir]th... poldek: Loading [pndir]th... poldek: 36945 packages read poldek: Removed 6249 duplicate packages from available set poldek: Processing dependencies... poldek: gtk3-vnc-devel-1.2.0-1 marks gtk3-vnc-1.2.0-1 (cap gtk3-vnc = 1.2.0-1) poldek: gtk3-vnc-1.2.0-1 marks libgvnc-1.2.0-1 (cap libgvnc = 1.2.0-1) poldek: gtk3-vnc-devel-1.2.0-1 marks libgvnc-devel-1.2.0-1 (cap libgvnc-devel = 1.2.0-1) poldek: There are 4 packages to install (3 marked by dependencies): poldek: A gtk3-vnc-1.2.0-1 gtk3-vnc-devel-1.2.0-1 libgvnc-1.2.0-1 poldek: A libgvnc-devel-1.2.0-1 poldek: This operation will use 991.6KB of disk space. poldek: Need to get 221.1KB of archives (221.1KB to download). poldek: poldek: Retrieving [1/4] th::libgvnc-1.2.0-1.i686.rpm..............................................done poldek: Retrieving [2/4] th::gtk3-vnc-1.2.0-1.i686.rpm.............................................done poldek: Retrieving [3/4] th::libgvnc-devel-1.2.0-1.i686.rpm........................................done poldek: Retrieving [4/4] th::gtk3-vnc-devel-1.2.0-1.i686.rpm.......................................done poldek: libgvnc-1.2.0-1.i686.rpm: digests OK poldek: gtk3-vnc-1.2.0-1.i686.rpm: digests OK poldek: libgvnc-devel-1.2.0-1.i686.rpm: digests OK poldek: gtk3-vnc-devel-1.2.0-1.i686.rpm: digests OK poldek: Executing pm-command.sh --upgrade -vh --test --root / --define _check_dirname_deps 0... poldek: warning: /root/.poldek-cache/ftp_ftp1.pld-linux.org.dists.th.PLD.i686.RPMS/libgvnc-1.2.0-1.i686.rpm: Header V4 DSA/SHA1 Signature, key ID e4f1bc2d: NOKEY poldek: Verifying... ######################################## poldek: Preparing... ######################################## no conflicts found checking BR rpm: warning: Could not canonicalize hostname: nereid rpm: error: Failed build dependencies: rpm: gtk3-vnc-devel >= 0.4.5 is needed by gnome-connections-41.0-1.i686 rpm: Building target platforms: i686-pld-linux rpm: Building for target i686-pld-linux installing BR: gtk3\-vnc\-devel + poldek --noask --caplookup -Q -v '--ignore=hhvm-*' '--ignore=php4-*' '--ignore=php52-*' '--ignore=php54-*' '--ignore=php55-*' '--ignore=php56-*' '--ignore=php70-*' '--ignore=php71-*' '--ignore=php72-*' '--ignore=php73-*' '--ignore=php74-*' '--ignore=php80-*' --upgrade gtk3-vnc-devel Loading [pndir]ready... Loading [pndir]th-test... Loading [pndir]th-test... Loading [pndir]th-ready... Loading [pndir]th-ready... Loading [pndir]th... Loading [pndir]th... 36945 packages read Removed 6249 duplicate packages from available set Processing dependencies... gtk3-vnc-devel-1.2.0-1 marks gtk3-vnc-1.2.0-1 (cap gtk3-vnc = 1.2.0-1) gtk3-vnc-1.2.0-1 marks libgvnc-1.2.0-1 (cap libgvnc = 1.2.0-1) gtk3-vnc-devel-1.2.0-1 marks libgvnc-devel-1.2.0-1 (cap libgvnc-devel = 1.2.0-1) There are 4 packages to install (3 marked by dependencies): A gtk3-vnc-1.2.0-1 gtk3-vnc-devel-1.2.0-1 libgvnc-1.2.0-1 A libgvnc-devel-1.2.0-1 This operation will use 991.6KB of disk space. gtk3-vnc-devel-1.2.0-1.i686.rpm: digests OK gtk3-vnc-1.2.0-1.i686.rpm: digests OK libgvnc-1.2.0-1.i686.rpm: digests OK libgvnc-devel-1.2.0-1.i686.rpm: digests OK Need to get 221.1KB of archives. libgvnc-1.2.0-1.i686.rpm: digests OK gtk3-vnc-1.2.0-1.i686.rpm: digests OK libgvnc-devel-1.2.0-1.i686.rpm: digests OK gtk3-vnc-devel-1.2.0-1.i686.rpm: digests OK Executing pm-command.sh --upgrade -vh --root / --define _check_dirname_deps 0... warning: /root/.poldek-cache/ftp_ftp1.pld-linux.org.dists.th.PLD.i686.RPMS/libgvnc-1.2.0-1.i686.rpm: Header V4 DSA/SHA1 Signature, key ID e4f1bc2d: NOKEY Verifying... ######################################## Preparing... ######################################## Updating / installing... libgvnc-1.2.0-1 ######################################## libgvnc-devel-1.2.0-1 ######################################## gtk3-vnc-1.2.0-1 ######################################## gtk3-vnc-devel-1.2.0-1 ######################################## building RPM using: set -ex; : build-id: e4d8f3ae-4555-4f1a-a7ff-2ede1fb460f0; TMPDIR=/tmp/B.n48esetd/BUILD/tmp exec nice -n 0 rpmbuild -bb --define '_smp_mflags -j9' --define '_make_opts -Otarget' --define '_pld_builder 1' --define '_topdir /tmp/B.n48esetd' --define '_specdir %{_topdir}' --define '_sourcedir %{_specdir}' --define '_rpmdir %{_topdir}/RPMS' --define '_builddir %{_topdir}/BUILD' --target i686-pld-linux /tmp/B.n48esetd/gnome-connections.spec + : build-id: e4d8f3ae-4555-4f1a-a7ff-2ede1fb460f0 + TMPDIR=/tmp/B.n48esetd/BUILD/tmp + exec nice -n 0 rpmbuild -bb --define '_smp_mflags -j9' --define '_make_opts -Otarget' --define '_pld_builder 1' --define '_topdir /tmp/B.n48esetd' --define '_specdir %{_topdir}' --define '_sourcedir %{_specdir}' --define '_rpmdir %{_topdir}/RPMS' --define '_builddir %{_topdir}/BUILD' --target i686-pld-linux /tmp/B.n48esetd/gnome-connections.spec warning: Could not canonicalize hostname: nereid Building target platforms: i686-pld-linux Building for target i686-pld-linux Executing(%prep): /bin/sh -e /tmp/B.n48esetd/BUILD/tmp/rpm-tmp.XuiqYV + umask 022 + cd /tmp/B.n48esetd/BUILD + cd /tmp/B.n48esetd/BUILD + rm -rf gnome-connections-41.0 + /usr/bin/xz -dc /tmp/B.n48esetd/gnome-connections-41.0.tar.xz + /bin/tar -xof - + STATUS=0 + '[' 0 -ne 0 ']' + cd gnome-connections-41.0 + /bin/chmod -Rf a+rX,u+w,g-w,o-w . + /bin/sed -i -e '/dependency.*gtk-frdp-0.1/ s/gtk-frdp-0.1/gtk-frdp-nonexistent/' src/meson.build + RPM_EC=0 + jobs -p + exit 0 Executing(%build): /bin/sh -e /tmp/B.n48esetd/BUILD/tmp/rpm-tmp.iYcIlo TMP=/home/users/builder/tmp HOME=/home/users/builder PATH=/home/users/builder/GNUstep/Tools:/bin:/usr/bin:/usr/local/bin:/home/users/builder/bin TMPDIR=/tmp/B.n48esetd/BUILD/tmp + umask 022 + cd /tmp/B.n48esetd/BUILD + cd gnome-connections-41.0 + CC=i686-pld-linux-gcc CXX=i686-pld-linux-g++ CFLAGS='-O2 -fwrapv -pipe -Wformat -Werror=format-security -gdwarf-4 -fno-debug-types-section -fvar-tracking-assignments -g2 -Wp,-D_FORTIFY_SOURCE=2 -fstack-protector-strong --param=ssp-buffer-size=4 -Werror=trampolines -fomit-frame-pointer -march=i686 -fasynchronous-unwind-tables -mtune=pentium4 -gdwarf-4 -fno-debug-types-section -fvar-tracking-assignments -g2 ' CPPFLAGS='' CXXFLAGS='-O2 -fwrapv -pipe -Wformat -Werror=format-security -gdwarf-4 -fno-debug-types-section -fvar-tracking-assignments -g2 -Wp,-D_FORTIFY_SOURCE=2 -fstack-protector-strong --param=ssp-buffer-size=4 -Werror=trampolines -fomit-frame-pointer -march=i686 -fasynchronous-unwind-tables -mtune=pentium4 -gdwarf-4 -fno-debug-types-section -fvar-tracking-assignments -g2 ' LDFLAGS='-Wl,--as-needed -Wl,--no-copy-dt-needed-entries -Wl,-z,relro -Wl,-z,combreloc ' LC_ALL=C.UTF-8 /usr/bin/meson '--buildtype=plain' '--bindir=/usr/bin' '--datadir=/usr/share' '--includedir=/usr/include' '--infodir=/usr/share/info' '--libdir=/usr/lib' '--libexecdir=/usr/libexec' '--localedir=/usr/share/locale' '--localstatedir=/var' '--mandir=/usr/share/man' '--prefix=/usr' '--sbindir=/usr/sbin' '--sharedstatedir=/var/lib' '--sysconfdir=/etc' '--wrap-mode=nodownload' '--default-library=both' build The Meson build system Version: 0.59.0 Source dir: /tmp/B.n48esetd/BUILD/gnome-connections-41.0 Build dir: /tmp/B.n48esetd/BUILD/gnome-connections-41.0/build Build type: native build Project name: gnome-connections Project version: 41.0 C compiler for the host machine: i686-pld-linux-gcc (gcc 11.2.0 "i686-pld-linux-gcc (PLD-Linux) 11.2.0 20210728 (release)") C linker for the host machine: i686-pld-linux-gcc ld.bfd 2.37 Vala compiler for the host machine: valac (valac 0.54.1) Host machine cpu family: x86 Host machine cpu: i686 Configuring config.h.in using configuration Program /usr/bin/meson found: YES (/usr/bin/meson) Configuring org.gnome.Connections.desktop.in using configuration Program desktop-file-validate found: YES (/usr/bin/desktop-file-validate) Program appstream-util found: YES (/usr/bin/appstream-util) Configuring org.gnome.Connections.service using configuration Program glib-compile-schemas found: YES (/usr/bin/glib-compile-schemas) Library config found: YES Library m found: YES Found pkg-config: /usr/bin/pkg-config (0.29.2) Run-time dependency gio-2.0 found: YES 2.70.0 Run-time dependency gtk+-3.0 found: YES 3.24.30 Run-time dependency gtk-vnc-2.0 found: YES 1.2.0 Run-time dependency libhandy-1 found: YES 1.4.0 Run-time dependency libxml-2.0 found: YES 2.9.12 Found CMake: /usr/bin/cmake (3.17.2) WARNING: CMake Toolchain: Failed to determine CMake compilers state Run-time dependency gtk-frdp-nonexistent found: NO (tried pkgconfig and cmake) Executing subproject gtk-frdp gtk-frdp| Project name: gtk-frdp gtk-frdp| Project version: 0.1.0 gtk-frdp| C compiler for the host machine: i686-pld-linux-gcc (gcc 11.2.0 "i686-pld-linux-gcc (PLD-Linux) 11.2.0 20210728 (release)") gtk-frdp| C linker for the host machine: i686-pld-linux-gcc ld.bfd 2.37 gtk-frdp| Vala compiler for the host machine: valac (valac 0.54.1) gtk-frdp| Configuring gtk-frdp-config.h using configuration gtk-frdp| WARNING: Project targeting '>= 0.40.0' but tried to use feature introduced in '0.50.0': install arg in configure_file. gtk-frdp| Configuring gtk-frdp-version.h using configuration gtk-frdp| Run-time dependency winpr2 found: YES 2.4.0 gtk-frdp| Run-time dependency freerdp2 found: YES 2.4.0 gtk-frdp| Dependency gio-2.0 found: YES 2.70.0 (cached) gtk-frdp| Dependency gtk+-3.0 found: YES 3.24.30 (cached) gtk-frdp| Library m found: YES gtk-frdp| Run-time dependency gobject-introspection-1.0 found: YES 1.70.0 gtk-frdp| Dependency gobject-introspection-1.0 found: YES 1.70.0 (cached) gtk-frdp| Program g-ir-scanner found: YES (/usr/bin/g-ir-scanner) gtk-frdp| Dependency gobject-introspection-1.0 found: YES 1.70.0 (cached) gtk-frdp| Program g-ir-compiler found: YES (/usr/bin/g-ir-compiler) gtk-frdp| Program vapigen found: YES (/usr/bin/vapigen) gtk-frdp| Build targets in project: 9 gtk-frdp| WARNING: Project specifies a minimum meson_version '>= 0.40.0' but uses features which were added in newer versions: gtk-frdp| * 0.50.0: {'install arg in configure_file'} gtk-frdp| Subproject gtk-frdp finished. Found pkg-config: /usr/bin/pkg-config (0.29.2) Program glib-compile-resources found: YES (/usr/bin/glib-compile-resources) Program build-aux/meson/postinstall.py found: YES (/tmp/B.n48esetd/BUILD/gnome-connections-41.0/build-aux/meson/postinstall.py) Build targets in project: 15 gnome-connections 41.0 Subprojects gtk-frdp: YES 2 warnings Found ninja-1.10.0 at /usr/bin/ninja + LC_ALL=C.UTF-8 /usr/bin/ninja -v -j9 -C build ninja: Entering directory `build' [1/35] /usr/bin/glib-compile-resources ../src/connections.gresource.xml --sourcedir ../src --c-name connections --internal --generate --target src/connections-resources.h [2/35] /usr/bin/glib-compile-resources ../src/connections.gresource.xml --sourcedir ../src --c-name connections --internal --generate --target src/connections-resources.c --dependency-file src/connections-resources.c.d [3/35] i686-pld-linux-gcc -Isubprojects/gtk-frdp/src/libgtk-frdp-0.1.so.p -Isubprojects/gtk-frdp/src -I../subprojects/gtk-frdp/src -I/usr/include/winpr2 -I/usr/include/freerdp2/ -I/usr/include/libmount -I/usr/include/blkid -I/usr/include/glib-2.0 -I/usr/lib/glib-2.0/include -I/usr/include/gtk-3.0 -I/usr/include/at-spi2-atk/2.0 -I/usr/include/at-spi-2.0 -I/usr/include/dbus-1.0 -I/usr/lib/dbus-1.0/include -I/usr/include/gio-unix-2.0 -I/usr/include/cairo -I/usr/include/libdrm -I/usr/include/pango-1.0 -I/usr/include/harfbuzz -I/usr/include/fribidi -I/usr/include/atk-1.0 -I/usr/include/pixman-1 -I/usr/include/uuid -I/usr/include/freetype2 -I/usr/include/libpng16 -I/usr/include/gdk-pixbuf-2.0 -I/tmp/B.n48esetd/BUILD/gnome-connections-41.0/build -fdiagnostics-color=always -D_FILE_OFFSET_BITS=64 -Wall -Winvalid-pch -Wextra -O2 -fwrapv -pipe -Wformat -Werror=format-security -gdwarf-4 -fno-debug-types-section -fvar-tracking-assignments -g2 -Wp,-D_FORTIFY_SOURCE=2 -fstack-protector-strong --param=ssp-buffer-size=4 -Werror=trampolines -fomit-frame-pointer -march=i686 -fasynchronous-unwind-tables -mtune=pentium4 -gdwarf-4 -fno-debug-types-section -fvar-tracking-assignments -g2 -fPIC -pthread -MD -MQ subprojects/gtk-frdp/src/libgtk-frdp-0.1.so.p/frdp-display.c.o -MF subprojects/gtk-frdp/src/libgtk-frdp-0.1.so.p/frdp-display.c.o.d -o subprojects/gtk-frdp/src/libgtk-frdp-0.1.so.p/frdp-display.c.o -c ../subprojects/gtk-frdp/src/frdp-display.c ../subprojects/gtk-frdp/src/frdp-display.c: In function ‘frdp_enter_notify_event’: ../subprojects/gtk-frdp/src/frdp-display.c:205:45: warning: unused parameter ‘event’ [-Wunused-parameter] 205 | GdkEventCrossing *event) | ~~~~~~~~~~~~~~~~~~~^~~~~ ../subprojects/gtk-frdp/src/frdp-display.c: In function ‘frdp_leave_notify_event’: ../subprojects/gtk-frdp/src/frdp-display.c:215:45: warning: unused parameter ‘event’ [-Wunused-parameter] 215 | GdkEventCrossing *event) | ~~~~~~~~~~~~~~~~~~~^~~~~ ../subprojects/gtk-frdp/src/frdp-display.c: In function ‘frdp_display_auth_failure’: ../subprojects/gtk-frdp/src/frdp-display.c:224:41: warning: unused parameter ‘source_object’ [-Wunused-parameter] 224 | frdp_display_auth_failure (GObject *source_object, | ~~~~~~~~~~~~~^~~~~~~~~~~~~ ../subprojects/gtk-frdp/src/frdp-display.c: In function ‘frdp_display_disconnected’: ../subprojects/gtk-frdp/src/frdp-display.c:232:38: warning: unused parameter ‘source_object’ [-Wunused-parameter] 232 | frdp_display_disconnected (GObject *source_object, | ~~~~~~~~~~^~~~~~~~~~~~~ [4/35] /usr/bin/meson --internal vcstagger config.h.in config.h '' /tmp/B.n48esetd/BUILD/gnome-connections-41.0 @VCS_TAG@ '(.*)' /usr/bin/git rev-parse --short HEAD fatal: not a git repository (or any of the parent directories): .git [5/35] /usr/bin/meson --internal msgfmthelper ../data/org.gnome.Connections.appdata.xml.in data/org.gnome.Connections.appdata.xml xml ../data/../po [6/35] /usr/bin/meson --internal msgfmthelper data/org.gnome.Connections.desktop.in data/org.gnome.Connections.desktop desktop ../data/../po [7/35] i686-pld-linux-gcc -Isubprojects/gtk-frdp/src/libgtk-frdp-0.1.so.p -Isubprojects/gtk-frdp/src -I../subprojects/gtk-frdp/src -I/usr/include/winpr2 -I/usr/include/freerdp2/ -I/usr/include/libmount -I/usr/include/blkid -I/usr/include/glib-2.0 -I/usr/lib/glib-2.0/include -I/usr/include/gtk-3.0 -I/usr/include/at-spi2-atk/2.0 -I/usr/include/at-spi-2.0 -I/usr/include/dbus-1.0 -I/usr/lib/dbus-1.0/include -I/usr/include/gio-unix-2.0 -I/usr/include/cairo -I/usr/include/libdrm -I/usr/include/pango-1.0 -I/usr/include/harfbuzz -I/usr/include/fribidi -I/usr/include/atk-1.0 -I/usr/include/pixman-1 -I/usr/include/uuid -I/usr/include/freetype2 -I/usr/include/libpng16 -I/usr/include/gdk-pixbuf-2.0 -I/tmp/B.n48esetd/BUILD/gnome-connections-41.0/build -fdiagnostics-color=always -D_FILE_OFFSET_BITS=64 -Wall -Winvalid-pch -Wextra -O2 -fwrapv -pipe -Wformat -Werror=format-security -gdwarf-4 -fno-debug-types-section -fvar-tracking-assignments -g2 -Wp,-D_FORTIFY_SOURCE=2 -fstack-protector-strong --param=ssp-buffer-size=4 -Werror=trampolines -fomit-frame-pointer -march=i686 -fasynchronous-unwind-tables -mtune=pentium4 -gdwarf-4 -fno-debug-types-section -fvar-tracking-assignments -g2 -fPIC -pthread -MD -MQ subprojects/gtk-frdp/src/libgtk-frdp-0.1.so.p/frdp-session.c.o -MF subprojects/gtk-frdp/src/libgtk-frdp-0.1.so.p/frdp-session.c.o.d -o subprojects/gtk-frdp/src/libgtk-frdp-0.1.so.p/frdp-session.c.o -c ../subprojects/gtk-frdp/src/frdp-session.c ../subprojects/gtk-frdp/src/frdp-session.c: In function ‘frdp_Pointer_Free’: ../subprojects/gtk-frdp/src/frdp-session.c:211:32: warning: unused parameter ‘context’ [-Wunused-parameter] 211 | frdp_Pointer_Free (rdpContext* context, rdpPointer* pointer) | ~~~~~~~~~~~~^~~~~~~ ../subprojects/gtk-frdp/src/frdp-session.c: In function ‘frdp_Pointer_SetPosition’: ../subprojects/gtk-frdp/src/frdp-session.c:263:39: warning: unused parameter ‘context’ [-Wunused-parameter] 263 | frdp_Pointer_SetPosition (rdpContext* context, UINT32 x, UINT32 y) | ~~~~~~~~~~~~^~~~~~~ ../subprojects/gtk-frdp/src/frdp-session.c:263:55: warning: unused parameter ‘x’ [-Wunused-parameter] 263 | frdp_Pointer_SetPosition (rdpContext* context, UINT32 x, UINT32 y) | ~~~~~~~^ ../subprojects/gtk-frdp/src/frdp-session.c:263:65: warning: unused parameter ‘y’ [-Wunused-parameter] 263 | frdp_Pointer_SetPosition (rdpContext* context, UINT32 x, UINT32 y) | ~~~~~~~^ ../subprojects/gtk-frdp/src/frdp-session.c: In function ‘frdp_session_get_best_color_depth’: ../subprojects/gtk-frdp/src/frdp-session.c:284:49: warning: unused parameter ‘self’ [-Wunused-parameter] 284 | frdp_session_get_best_color_depth (FrdpSession *self) | ~~~~~~~~~~~~~^~~~ ../subprojects/gtk-frdp/src/frdp-session.c: In function ‘frdp_session_configure_event’: ../subprojects/gtk-frdp/src/frdp-session.c:297:42: warning: unused parameter ‘event’ [-Wunused-parameter] 297 | GdkEvent *event, | ~~~~~~~~~~~^~~~~ ../subprojects/gtk-frdp/src/frdp-session.c: In function ‘frdp_session_draw’: ../subprojects/gtk-frdp/src/frdp-session.c:332:31: warning: unused parameter ‘widget’ [-Wunused-parameter] 332 | frdp_session_draw (GtkWidget *widget, | ~~~~~~~~~~~^~~~~~ ../subprojects/gtk-frdp/src/frdp-session.c: In function ‘frdp_certificate_verify’: ../subprojects/gtk-frdp/src/frdp-session.c:349:39: warning: unused parameter ‘freerdp_session’ [-Wunused-parameter] 349 | frdp_certificate_verify (freerdp *freerdp_session, | ~~~~~~~~~~~~~^~~~~~~~~~~~~~~ ../subprojects/gtk-frdp/src/frdp-session.c:350:39: warning: unused parameter ‘common_name’ [-Wunused-parameter] 350 | const gchar *common_name, | ~~~~~~~~~~~~~^~~~~~~~~~~ ../subprojects/gtk-frdp/src/frdp-session.c:351:39: warning: unused parameter ‘subject’ [-Wunused-parameter] 351 | const gchar* subject, | ~~~~~~~~~~~~~^~~~~~~ ../subprojects/gtk-frdp/src/frdp-session.c:352:39: warning: unused parameter ‘issuer’ [-Wunused-parameter] 352 | const gchar* issuer, | ~~~~~~~~~~~~~^~~~~~ ../subprojects/gtk-frdp/src/frdp-session.c:353:39: warning: unused parameter ‘fingerprint’ [-Wunused-parameter] 353 | const gchar* fingerprint, | ~~~~~~~~~~~~~^~~~~~~~~~~ ../subprojects/gtk-frdp/src/frdp-session.c:354:39: warning: unused parameter ‘host_mismatch’ [-Wunused-parameter] 354 | gboolean host_mismatch) | ~~~~~~~~~~~~~^~~~~~~~~~~~~ ../subprojects/gtk-frdp/src/frdp-session.c: In function ‘frdp_changed_certificate_verify’: ../subprojects/gtk-frdp/src/frdp-session.c:361:47: warning: unused parameter ‘freerdp_session’ [-Wunused-parameter] 361 | frdp_changed_certificate_verify (freerdp *freerdp_session, | ~~~~~~~~~~~~~^~~~~~~~~~~~~~~ ../subprojects/gtk-frdp/src/frdp-session.c:362:47: warning: unused parameter ‘common_name’ [-Wunused-parameter] 362 | const gchar *common_name, | ~~~~~~~~~~~~~^~~~~~~~~~~ ../subprojects/gtk-frdp/src/frdp-session.c:363:47: warning: unused parameter ‘subject’ [-Wunused-parameter] 363 | const gchar *subject, | ~~~~~~~~~~~~~^~~~~~~ ../subprojects/gtk-frdp/src/frdp-session.c:364:47: warning: unused parameter ‘issuer’ [-Wunused-parameter] 364 | const gchar *issuer, | ~~~~~~~~~~~~~^~~~~~ ../subprojects/gtk-frdp/src/frdp-session.c:365:47: warning: unused parameter ‘new_fingerprint’ [-Wunused-parameter] 365 | const gchar *new_fingerprint, | ~~~~~~~~~~~~~^~~~~~~~~~~~~~~ ../subprojects/gtk-frdp/src/frdp-session.c:366:47: warning: unused parameter ‘old_subject’ [-Wunused-parameter] 366 | const gchar *old_subject, | ~~~~~~~~~~~~~^~~~~~~~~~~ ../subprojects/gtk-frdp/src/frdp-session.c:367:47: warning: unused parameter ‘old_issuer’ [-Wunused-parameter] 367 | const gchar *old_issuer, | ~~~~~~~~~~~~~^~~~~~~~~~ ../subprojects/gtk-frdp/src/frdp-session.c:368:47: warning: unused parameter ‘old_fingerprint’ [-Wunused-parameter] 368 | const gchar *old_fingerprint) | ~~~~~~~~~~~~~^~~~~~~~~~~~~~~ ../subprojects/gtk-frdp/src/frdp-session.c: In function ‘frdp_pre_connect’: ../subprojects/gtk-frdp/src/frdp-session.c:389:28: warning: unused parameter ‘freerdp_session’ [-Wunused-parameter] 389 | frdp_pre_connect (freerdp *freerdp_session) | ~~~~~~~~~^~~~~~~~~~~~~~~ ../subprojects/gtk-frdp/src/frdp-session.c: In function ‘frdp_session_init_freerdp’: ../subprojects/gtk-frdp/src/frdp-session.c:570:3: warning: ‘VerifyCertificate’ is deprecated [-Wdeprecated-declarations] 570 | priv->freerdp_session->VerifyCertificate = frdp_certificate_verify; | ^~~~ In file included from /usr/include/freerdp2/freerdp/api.h:23, from /usr/include/freerdp2/freerdp/freerdp.h:42, from ../subprojects/gtk-frdp/src/frdp-session.c:20: /usr/include/freerdp2/freerdp/freerdp.h:368:61: note: declared here 368 | WINPR_DEPRECATED(ALIGN64 pVerifyCertificate VerifyCertificate); /**< (offset 51) | ^~~~~~~~~~~~~~~~~ /usr/include/winpr2/winpr/winpr.h:53:31: note: in definition of macro ‘WINPR_DEPRECATED’ 53 | #define WINPR_DEPRECATED(obj) obj __attribute__((deprecated)) | ^~~ ../subprojects/gtk-frdp/src/frdp-session.c:571:3: warning: ‘VerifyChangedCertificate’ is deprecated [-Wdeprecated-declarations] 571 | priv->freerdp_session->VerifyChangedCertificate = frdp_changed_certificate_verify; | ^~~~ In file included from /usr/include/freerdp2/freerdp/api.h:23, from /usr/include/freerdp2/freerdp/freerdp.h:42, from ../subprojects/gtk-frdp/src/frdp-session.c:20: /usr/include/freerdp2/freerdp/freerdp.h:373:55: note: declared here 373 | ALIGN64 pVerifyChangedCertificate VerifyChangedCertificate); /**< (offset 52) | ^~~~~~~~~~~~~~~~~~~~~~~~ /usr/include/winpr2/winpr/winpr.h:53:31: note: in definition of macro ‘WINPR_DEPRECATED’ 53 | #define WINPR_DEPRECATED(obj) obj __attribute__((deprecated)) | ^~~ ../subprojects/gtk-frdp/src/frdp-session.c: In function ‘frdp_session_connect_thread’: ../subprojects/gtk-frdp/src/frdp-session.c:602:44: warning: unused parameter ‘task_data’ [-Wunused-parameter] 602 | gpointer task_data, | ~~~~~~~~~~~~~~^~~~~~~~~ ../subprojects/gtk-frdp/src/frdp-session.c:603:44: warning: unused parameter ‘cancellable’ [-Wunused-parameter] 603 | GCancellable *cancellable) | ~~~~~~~~~~~~~~^~~~~~~~~~~ [8/35] i686-pld-linux-gcc -o subprojects/gtk-frdp/src/libgtk-frdp-0.1.so subprojects/gtk-frdp/src/libgtk-frdp-0.1.so.p/frdp-display.c.o subprojects/gtk-frdp/src/libgtk-frdp-0.1.so.p/frdp-session.c.o -Wl,--as-needed -Wl,--no-undefined -shared -fPIC -Wl,--start-group -Wl,-soname,libgtk-frdp-0.1.so -Wl,--as-needed -Wl,--no-copy-dt-needed-entries -Wl,-z,relro -Wl,-z,combreloc -O2 -fwrapv -pipe -Wformat -Werror=format-security -gdwarf-4 -fno-debug-types-section -fvar-tracking-assignments -g2 -Wp,-D_FORTIFY_SOURCE=2 -fstack-protector-strong --param=ssp-buffer-size=4 -Werror=trampolines -fomit-frame-pointer -march=i686 -fasynchronous-unwind-tables -mtune=pentium4 -gdwarf-4 -fno-debug-types-section -fvar-tracking-assignments -g2 /usr/lib/libwinpr2.so /usr/lib/libfreerdp2.so /usr/lib/libgio-2.0.so /usr/lib/libgobject-2.0.so /usr/lib/libglib-2.0.so /usr/lib/libgtk-3.so /usr/lib/libgdk-3.so /usr/lib/libpangocairo-1.0.so /usr/lib/libpango-1.0.so /usr/lib/libharfbuzz.so /usr/lib/libatk-1.0.so /usr/lib/libcairo-gobject.so /usr/lib/libcairo.so /usr/lib/libgdk_pixbuf-2.0.so -lm -Wl,--end-group [9/35] i686-pld-linux-gcc -Isrc/gnome-connections.p -Isrc -I../src -I. -I.. -Isubprojects/gtk-frdp/src -I../subprojects/gtk-frdp/src -I/usr/include/libmount -I/usr/include/blkid -I/usr/include/glib-2.0 -I/usr/lib/glib-2.0/include -I/usr/include/gtk-3.0 -I/usr/include/at-spi2-atk/2.0 -I/usr/include/at-spi-2.0 -I/usr/include/dbus-1.0 -I/usr/lib/dbus-1.0/include -I/usr/include/gio-unix-2.0 -I/usr/include/cairo -I/usr/include/libdrm -I/usr/include/pango-1.0 -I/usr/include/harfbuzz -I/usr/include/fribidi -I/usr/include/atk-1.0 -I/usr/include/pixman-1 -I/usr/include/uuid -I/usr/include/freetype2 -I/usr/include/libpng16 -I/usr/include/gdk-pixbuf-2.0 -I/usr/include/gtk-vnc-2.0 -I/usr/include/gvnc-1.0 -I/usr/include/p11-kit-1 -I/usr/include/libhandy-1 -I/usr/include/libxml2 -fdiagnostics-color=always -D_FILE_OFFSET_BITS=64 -Wall -Winvalid-pch -Wextra -O2 -fwrapv -pipe -Wformat -Werror=format-security -gdwarf-4 -fno-debug-types-section -fvar-tracking-assignments -g2 -Wp,-D_FORTIFY_SOURCE=2 -fstack-protector-strong --param=ssp-buffer-size=4 -Werror=trampolines -fomit-frame-pointer -march=i686 -fasynchronous-unwind-tables -mtune=pentium4 -gdwarf-4 -fno-debug-types-section -fvar-tracking-assignments -g2 -pthread '-DGETTEXT_PACKAGE="connections"' -MD -MQ src/gnome-connections.p/meson-generated_.._connections-resources.c.o -MF src/gnome-connections.p/meson-generated_.._connections-resources.c.o.d -o src/gnome-connections.p/meson-generated_.._connections-resources.c.o -c src/connections-resources.c [10/35] /usr/bin/meson --internal symbolextractor /tmp/B.n48esetd/BUILD/gnome-connections-41.0/build subprojects/gtk-frdp/src/libgtk-frdp-0.1.so subprojects/gtk-frdp/src/libgtk-frdp-0.1.so subprojects/gtk-frdp/src/libgtk-frdp-0.1.so.p/libgtk-frdp-0.1.so.symbols [11/35] /usr/bin/g-ir-scanner --no-libtool --namespace=GtkFrdp --nsversion=0.1 --warn-all --output subprojects/gtk-frdp/src/GtkFrdp-0.1.gir --c-include=gtk-frdp.h --quiet -I/tmp/B.n48esetd/BUILD/gnome-connections-41.0/subprojects/gtk-frdp/src -I/tmp/B.n48esetd/BUILD/gnome-connections-41.0/build/subprojects/gtk-frdp/src --filelist=/tmp/B.n48esetd/BUILD/gnome-connections-41.0/build/subprojects/gtk-frdp/src/libgtk-frdp-0.1.so.p/GtkFrdp_0.1_gir_filelist -L/tmp/B.n48esetd/BUILD/gnome-connections-41.0/build/subprojects/gtk-frdp/src --extra-library=gtk-frdp-0.1 --include=Gio-2.0 --include=Gtk-3.0 --symbol-prefix=frdp --identifier-prefix=Frdp --cflags-begin -I/tmp/B.n48esetd/BUILD/gnome-connections-41.0/build -I/usr/include/winpr2 -I/usr/include/freerdp2/ -I/usr/include/libmount -I/usr/include/blkid -I/usr/include/glib-2.0 -I/usr/lib/glib-2.0/include -I/usr/include/gtk-3.0 -I/usr/include/at-spi2-atk/2.0 -I/usr/include/at-spi-2.0 -I/usr/include/dbus-1.0 -I/usr/lib/dbus-1.0/include -I/usr/include/gio-unix-2.0 -I/usr/include/cairo -I/usr/include/libdrm -I/usr/include/pango-1.0 -I/usr/include/harfbuzz -I/usr/include/fribidi -I/usr/include/atk-1.0 -I/usr/include/pixman-1 -I/usr/include/uuid -I/usr/include/freetype2 -I/usr/include/libpng16 -I/usr/include/gdk-pixbuf-2.0 -I/usr/include/gobject-introspection-1.0 --cflags-end --add-include-path=/usr/share/gir-1.0 -L./subprojects/gtk-frdp/src --library gtk-frdp-0.1 --extra-library=winpr2 --extra-library=freerdp2 --extra-library=gio-2.0 --extra-library=gobject-2.0 --extra-library=glib-2.0 --extra-library=gtk-3 --extra-library=gdk-3 --extra-library=pangocairo-1.0 --extra-library=pango-1.0 --extra-library=harfbuzz --extra-library=atk-1.0 --extra-library=cairo-gobject --extra-library=cairo --extra-library=gdk_pixbuf-2.0 --extra-library=m --extra-library=girepository-1.0 --sources-top-dirs /tmp/B.n48esetd/BUILD/gnome-connections-41.0/subprojects/gtk-frdp --sources-top-dirs /tmp/B.n48esetd/BUILD/gnome-connections-41.0/build/subprojects/gtk-frdp ../subprojects/gtk-frdp/src/frdp-session.h:90: Warning: GtkFrdp: frdp_session_get_pixbuf: return value: Missing (transfer) annotation [12/35] /usr/bin/g-ir-compiler subprojects/gtk-frdp/src/GtkFrdp-0.1.gir --output subprojects/gtk-frdp/src/GtkFrdp-0.1.typelib --includedir=/usr/share/gir-1.0 [13/35] /usr/bin/vapigen --quiet --library=gtk-frdp-0.1 --directory=/tmp/B.n48esetd/BUILD/gnome-connections-41.0/build/subprojects/gtk-frdp/src --metadatadir=/tmp/B.n48esetd/BUILD/gnome-connections-41.0/subprojects/gtk-frdp/src --pkg=gio-2.0 --pkg=gtk+-3.0 --metadatadir=/tmp/B.n48esetd/BUILD/gnome-connections-41.0/subprojects/gtk-frdp/src /tmp/B.n48esetd/BUILD/gnome-connections-41.0/build/subprojects/gtk-frdp/src/GtkFrdp-0.1.gir [14/35] valac -C --pkg libxml-2.0 --pkg libhandy-1 --pkg gtk-vnc-2.0 --pkg gtk+-3.0 --pkg gio-2.0 /tmp/B.n48esetd/BUILD/gnome-connections-41.0/src/config.vapi --color=always --directory src/gnome-connections.p --basedir ../src --gresources=../src/connections.gresource.xml --enable-experimental --target-glib=2.50 subprojects/gtk-frdp/src/gtk-frdp-0.1.vapi ../src/actions-popover.vala ../src/assistant.vala ../src/application.vala ../src/connection.vala ../src/collection-view.vala ../src/collection-view-child.vala ../src/database.vala ../src/display-view.vala ../src/empty-view.vala ../src/main.vala ../src/notifications.vala ../src/onboarding-dialog.vala ../src/onboarding-dialog-page.vala ../src/preferences-widgets.vala ../src/rdp-connection.vala ../src/rdp-preferences-window.vala ../src/topbar.vala ../src/vnc-connection.vala ../src/vnc-preferences-window.vala ../src/window.vala FAILED: src/gnome-connections.p/actions-popover.c src/gnome-connections.p/assistant.c src/gnome-connections.p/application.c src/gnome-connections.p/connection.c src/gnome-connections.p/collection-view.c src/gnome-connections.p/collection-view-child.c src/gnome-connections.p/database.c src/gnome-connections.p/display-view.c src/gnome-connections.p/empty-view.c src/gnome-connections.p/main.c src/gnome-connections.p/notifications.c src/gnome-connections.p/onboarding-dialog.c src/gnome-connections.p/onboarding-dialog-page.c src/gnome-connections.p/preferences-widgets.c src/gnome-connections.p/rdp-connection.c src/gnome-connections.p/rdp-preferences-window.c src/gnome-connections.p/topbar.c src/gnome-connections.p/vnc-connection.c src/gnome-connections.p/vnc-preferences-window.c src/gnome-connections.p/window.c valac -C --pkg libxml-2.0 --pkg libhandy-1 --pkg gtk-vnc-2.0 --pkg gtk+-3.0 --pkg gio-2.0 /tmp/B.n48esetd/BUILD/gnome-connections-41.0/src/config.vapi --color=always --directory src/gnome-connections.p --basedir ../src --gresources=../src/connections.gresource.xml --enable-experimental --target-glib=2.50 subprojects/gtk-frdp/src/gtk-frdp-0.1.vapi ../src/actions-popover.vala ../src/assistant.vala ../src/application.vala ../src/connection.vala ../src/collection-view.vala ../src/collection-view-child.vala ../src/database.vala ../src/display-view.vala ../src/empty-view.vala ../src/main.vala ../src/notifications.vala ../src/onboarding-dialog.vala ../src/onboarding-dialog-page.vala ../src/preferences-widgets.vala ../src/rdp-connection.vala ../src/rdp-preferences-window.vala ../src/topbar.vala ../src/vnc-connection.vala ../src/vnc-preferences-window.vala ../src/window.vala error: Package `gtk-vnc-2.0' not found in specified Vala API directories or GObject-Introspection GIR directories Compilation failed: 1 error(s), 0 warning(s) ninja: build stopped: subcommand failed. error: Bad exit status from /tmp/B.n48esetd/BUILD/tmp/rpm-tmp.iYcIlo (%build) RPM build errors: Could not canonicalize hostname: nereid Bad exit status from /tmp/B.n48esetd/BUILD/tmp/rpm-tmp.iYcIlo (%build) ended at: Sat Sep 25 23:53:56 2021, done in 0:00:06.591084 error: No files produced. + chmod -R u+rwX /tmp/B.n48esetd/BUILD + rm -rf /tmp/B.n48esetd/tmp /tmp/B.n48esetd/BUILD + rm -rf /tmp/B.n48esetd Begin-PLD-Builder-Info Build-Time: user:19.47s sys:3.14s real:29.67s (faults io:36 non-io:689921) End-PLD-Builder-Info
[Back to list of logs] [View rpm -qa of builder]